hadoop-common-dev mailing list archives

Site index · List index
Message view « Date » · « Thread »
Top « Date » · « Thread »
From Apache Jenkins Server <jenk...@builds.apache.org>
Subject Build failed in Jenkins: Hadoop-Common-0.23-Build #1074
Date Tue, 16 Sep 2014 09:19:25 GMT
See <https://builds.apache.org/job/Hadoop-Common-0.23-Build/1074/>

------------------------------------------
[...truncated 8263 lines...]
Running org.apache.hadoop.io.TestBloomMapFile
Tests run: 3, Failures: 0, Errors: 0, Skipped: 0, Time elapsed: 0.879 sec
Running org.apache.hadoop.io.TestObjectWritableProtos
Tests run: 3, Failures: 0, Errors: 0, Skipped: 0, Time elapsed: 0.321 sec
Running org.apache.hadoop.io.TestTextNonUTF8
Tests run: 1, Failures: 0, Errors: 0, Skipped: 0, Time elapsed: 0.046 sec
Running org.apache.hadoop.io.nativeio.TestNativeIO
Tests run: 9, Failures: 0, Errors: 0, Skipped: 9, Time elapsed: 0.159 sec
Running org.apache.hadoop.io.TestSortedMapWritable
Tests run: 4, Failures: 0, Errors: 0, Skipped: 0, Time elapsed: 0.196 sec
Running org.apache.hadoop.io.TestMapFile
Tests run: 3, Failures: 0, Errors: 0, Skipped: 0, Time elapsed: 0.639 sec
Running org.apache.hadoop.io.TestUTF8
Tests run: 4, Failures: 0, Errors: 0, Skipped: 0, Time elapsed: 1.446 sec
Running org.apache.hadoop.io.TestBoundedByteArrayOutputStream
Tests run: 1, Failures: 0, Errors: 0, Skipped: 0, Time elapsed: 0.044 sec
Running org.apache.hadoop.io.retry.TestRetryProxy
Tests run: 9, Failures: 0, Errors: 0, Skipped: 0, Time elapsed: 0.227 sec
Running org.apache.hadoop.io.retry.TestFailoverProxy
Tests run: 5, Failures: 0, Errors: 0, Skipped: 0, Time elapsed: 0.192 sec
Running org.apache.hadoop.io.TestSetFile
Tests run: 1, Failures: 0, Errors: 0, Skipped: 0, Time elapsed: 3.957 sec
Running org.apache.hadoop.io.serializer.TestWritableSerialization
Tests run: 3, Failures: 0, Errors: 0, Skipped: 0, Time elapsed: 0.316 sec
Running org.apache.hadoop.io.serializer.TestSerializationFactory
Tests run: 1, Failures: 0, Errors: 0, Skipped: 0, Time elapsed: 0.281 sec
Running org.apache.hadoop.io.serializer.avro.TestAvroSerialization
Tests run: 4, Failures: 0, Errors: 0, Skipped: 0, Time elapsed: 0.539 sec
Running org.apache.hadoop.util.TestGenericOptionsParser
Tests run: 4, Failures: 0, Errors: 0, Skipped: 0, Time elapsed: 0.694 sec
Running org.apache.hadoop.util.TestReflectionUtils
Tests run: 4, Failures: 0, Errors: 0, Skipped: 0, Time elapsed: 0.516 sec
Running org.apache.hadoop.util.TestJarFinder
Tests run: 1, Failures: 0, Errors: 0, Skipped: 0, Time elapsed: 0.782 sec
Running org.apache.hadoop.util.TestPureJavaCrc32
Tests run: 1, Failures: 0, Errors: 0, Skipped: 0, Time elapsed: 1.287 sec
Running org.apache.hadoop.util.TestHostsFileReader
Tests run: 5, Failures: 0, Errors: 0, Skipped: 0, Time elapsed: 0.183 sec
Running org.apache.hadoop.util.TestShutdownHookManager
Tests run: 1, Failures: 0, Errors: 0, Skipped: 0, Time elapsed: 0.144 sec
Running org.apache.hadoop.util.TestDiskChecker
Tests run: 9, Failures: 0, Errors: 0, Skipped: 0, Time elapsed: 0.521 sec
Running org.apache.hadoop.util.TestStringUtils
Tests run: 9, Failures: 0, Errors: 0, Skipped: 0, Time elapsed: 0.139 sec
Running org.apache.hadoop.util.TestGenericsUtil
Tests run: 6, Failures: 0, Errors: 0, Skipped: 0, Time elapsed: 0.261 sec
Running org.apache.hadoop.util.TestAsyncDiskService
Tests run: 1, Failures: 0, Errors: 0, Skipped: 0, Time elapsed: 0.125 sec
Running org.apache.hadoop.util.TestProtoUtil
Tests run: 1, Failures: 0, Errors: 0, Skipped: 0, Time elapsed: 0.091 sec
Running org.apache.hadoop.util.TestDataChecksum
Tests run: 3, Failures: 0, Errors: 0, Skipped: 0, Time elapsed: 0.186 sec
Running org.apache.hadoop.util.TestRunJar
Tests run: 2, Failures: 0, Errors: 0, Skipped: 0, Time elapsed: 0.134 sec
Running org.apache.hadoop.util.TestOptions
Tests run: 2, Failures: 0, Errors: 0, Skipped: 0, Time elapsed: 0.079 sec
Running org.apache.hadoop.util.TestShell
Tests run: 4, Failures: 0, Errors: 0, Skipped: 0, Time elapsed: 5.197 sec
Running org.apache.hadoop.util.TestIndexedSort
Tests run: 2, Failures: 0, Errors: 0, Skipped: 0, Time elapsed: 1.61 sec
Running org.apache.hadoop.util.TestStringInterner
Tests run: 3, Failures: 0, Errors: 0, Skipped: 0, Time elapsed: 0.114 sec
Running org.apache.hadoop.record.TestRecordVersioning
Tests run: 2, Failures: 0, Errors: 0, Skipped: 0, Time elapsed: 0.158 sec
Running org.apache.hadoop.record.TestBuffer
Tests run: 6, Failures: 0, Errors: 0, Skipped: 0, Time elapsed: 0.054 sec
Running org.apache.hadoop.record.TestRecordIO
Tests run: 5, Failures: 0, Errors: 0, Skipped: 0, Time elapsed: 0.178 sec
Running org.apache.hadoop.security.TestGroupFallback
Tests run: 4, Failures: 0, Errors: 0, Skipped: 0, Time elapsed: 0.424 sec
Running org.apache.hadoop.security.TestGroupsCaching
Tests run: 1, Failures: 0, Errors: 0, Skipped: 0, Time elapsed: 0.274 sec
Running org.apache.hadoop.security.TestProxyUserFromEnv
Tests run: 1, Failures: 0, Errors: 0, Skipped: 0, Time elapsed: 0.355 sec
Running org.apache.hadoop.security.TestUserGroupInformation
Tests run: 19, Failures: 0, Errors: 0, Skipped: 0, Time elapsed: 0.7 sec
Running org.apache.hadoop.security.TestJNIGroupsMapping
Tests run: 1, Failures: 0, Errors: 0, Skipped: 1, Time elapsed: 0.14 sec
Running org.apache.hadoop.security.TestSecurityUtil
Tests run: 15, Failures: 0, Errors: 0, Skipped: 0, Time elapsed: 0.62 sec
Running org.apache.hadoop.security.TestCredentials
Tests run: 4, Failures: 0, Errors: 0, Skipped: 0, Time elapsed: 0.543 sec
Running org.apache.hadoop.security.TestAuthenticationFilter
Tests run: 1, Failures: 0, Errors: 0, Skipped: 0, Time elapsed: 0.383 sec
Running org.apache.hadoop.security.authorize.TestAccessControlList
Tests run: 8, Failures: 0, Errors: 0, Skipped: 0, Time elapsed: 0.443 sec
Running org.apache.hadoop.security.authorize.TestProxyUsers
Tests run: 3, Failures: 0, Errors: 0, Skipped: 0, Time elapsed: 0.491 sec
Running org.apache.hadoop.security.token.delegation.TestDelegationToken
Tests run: 11, Failures: 0, Errors: 0, Skipped: 0, Time elapsed: 29.995 sec
Running org.apache.hadoop.security.token.TestToken
Tests run: 2, Failures: 0, Errors: 0, Skipped: 0, Time elapsed: 0.147 sec
Running org.apache.hadoop.security.TestDoAsEffectiveUser
Tests run: 9, Failures: 0, Errors: 0, Skipped: 0, Time elapsed: 1.173 sec
Running org.apache.hadoop.security.TestUserFromEnv
Tests run: 1, Failures: 0, Errors: 0, Skipped: 0, Time elapsed: 0.356 sec
Running org.apache.hadoop.conf.TestGetInstances
Tests run: 1, Failures: 0, Errors: 0, Skipped: 0, Time elapsed: 0.246 sec
Running org.apache.hadoop.conf.TestReconfiguration
Tests run: 3, Failures: 0, Errors: 0, Skipped: 0, Time elapsed: 0.985 sec
Running org.apache.hadoop.conf.TestConfServlet
Tests run: 3, Failures: 0, Errors: 0, Skipped: 0, Time elapsed: 0.405 sec
Running org.apache.hadoop.conf.TestConfigurationSubclass
Tests run: 3, Failures: 0, Errors: 0, Skipped: 0, Time elapsed: 0.301 sec
Running org.apache.hadoop.conf.TestConfiguration
Tests run: 37, Failures: 0, Errors: 0, Skipped: 0, Time elapsed: 3.008 sec
Running org.apache.hadoop.conf.TestDeprecatedKeys
Tests run: 3, Failures: 0, Errors: 0, Skipped: 0, Time elapsed: 0.349 sec
Running org.apache.hadoop.conf.TestConfigurationDeprecation
Tests run: 6, Failures: 0, Errors: 0, Skipped: 0, Time elapsed: 0.435 sec
Running org.apache.hadoop.test.TestMultithreadedTestUtil
Tests run: 4, Failures: 0, Errors: 0, Skipped: 0, Time elapsed: 3.162 sec
Running org.apache.hadoop.test.TestTimedOutTestsListener
Tests run: 1, Failures: 0, Errors: 0, Skipped: 0, Time elapsed: 0.117 sec
Running org.apache.hadoop.metrics.ganglia.TestGangliaContext
Tests run: 1, Failures: 0, Errors: 0, Skipped: 0, Time elapsed: 0.155 sec
Running org.apache.hadoop.metrics.TestMetricsServlet
Tests run: 3, Failures: 0, Errors: 0, Skipped: 0, Time elapsed: 0.086 sec
Running org.apache.hadoop.metrics.spi.TestOutputRecord
Tests run: 1, Failures: 0, Errors: 0, Skipped: 0, Time elapsed: 0.043 sec
Running org.apache.hadoop.cli.TestCLI
Tests run: 1, Failures: 0, Errors: 0, Skipped: 0, Time elapsed: 0.926 sec
Running org.apache.hadoop.jmx.TestJMXJsonServlet
Tests run: 1, Failures: 0, Errors: 0, Skipped: 0, Time elapsed: 0.854 sec
Running org.apache.hadoop.net.TestSocketIOWithTimeout
Tests run: 1, Failures: 0, Errors: 0, Skipped: 0, Time elapsed: 5.191 sec
Running org.apache.hadoop.net.TestSwitchMapping
Tests run: 5, Failures: 0, Errors: 0, Skipped: 0, Time elapsed: 0.312 sec
Running org.apache.hadoop.net.TestDNS
Tests run: 7, Failures: 0, Errors: 0, Skipped: 0, Time elapsed: 0.175 sec
Running org.apache.hadoop.net.TestNetUtils
Tests run: 36, Failures: 0, Errors: 0, Skipped: 0, Time elapsed: 3.48 sec
Running org.apache.hadoop.net.TestScriptBasedMapping
Tests run: 4, Failures: 0, Errors: 0, Skipped: 0, Time elapsed: 0.794 sec
Running org.apache.hadoop.net.TestStaticMapping
Tests run: 8, Failures: 0, Errors: 0, Skipped: 0, Time elapsed: 1.032 sec
Running org.apache.hadoop.log.TestLogLevel
Tests run: 1, Failures: 0, Errors: 0, Skipped: 0, Time elapsed: 0.6 sec
Running org.apache.hadoop.log.TestLog4Json
Tests run: 5, Failures: 0, Errors: 0, Skipped: 0, Time elapsed: 0.362 sec
Running org.apache.hadoop.ipc.TestRPC
Tests run: 10, Failures: 0, Errors: 0, Skipped: 0, Time elapsed: 27.571 sec
Running org.apache.hadoop.ipc.TestSaslRPC
Tests run: 10, Failures: 0, Errors: 0, Skipped: 0, Time elapsed: 1.73 sec
Running org.apache.hadoop.ipc.TestIPCServerResponder
Tests run: 2, Failures: 0, Errors: 0, Skipped: 0, Time elapsed: 5.329 sec
Running org.apache.hadoop.ipc.TestAvroRpc
Tests run: 4, Failures: 0, Errors: 0, Skipped: 0, Time elapsed: 1.343 sec
Running org.apache.hadoop.ipc.TestIPC
Tests run: 20, Failures: 0, Errors: 0, Skipped: 0, Time elapsed: 70.4 sec
Running org.apache.hadoop.ipc.TestSocketFactory
Tests run: 1, Failures: 0, Errors: 0, Skipped: 0, Time elapsed: 0.269 sec
Running org.apache.hadoop.ipc.TestRPCCompatibility
Tests run: 6, Failures: 0, Errors: 0, Skipped: 0, Time elapsed: 0.845 sec
Running org.apache.hadoop.ipc.TestMiniRPCBenchmark
Tests run: 1, Failures: 0, Errors: 0, Skipped: 0, Time elapsed: 0.74 sec
Running org.apache.hadoop.ipc.TestServer
Tests run: 5, Failures: 0, Errors: 0, Skipped: 0, Time elapsed: 0.374 sec
Running org.apache.hadoop.metrics2.source.TestJvmMetrics
Tests run: 1, Failures: 0, Errors: 0, Skipped: 0, Time elapsed: 0.365 sec
Running org.apache.hadoop.metrics2.util.TestMetricsCache
Tests run: 4, Failures: 0, Errors: 0, Skipped: 0, Time elapsed: 2.034 sec
Running org.apache.hadoop.metrics2.util.TestSampleStat
Tests run: 1, Failures: 0, Errors: 0, Skipped: 0, Time elapsed: 0.076 sec
Running org.apache.hadoop.metrics2.filter.TestPatternFilter
Tests run: 5, Failures: 0, Errors: 0, Skipped: 0, Time elapsed: 0.228 sec
Running org.apache.hadoop.metrics2.impl.TestMetricsConfig
Tests run: 3, Failures: 0, Errors: 0, Skipped: 0, Time elapsed: 0.258 sec
Running org.apache.hadoop.metrics2.impl.TestMetricsVisitor
Tests run: 1, Failures: 0, Errors: 0, Skipped: 0, Time elapsed: 0.352 sec
Running org.apache.hadoop.metrics2.impl.TestGangliaMetrics
Tests run: 2, Failures: 0, Errors: 0, Skipped: 0, Time elapsed: 0.427 sec
Running org.apache.hadoop.metrics2.impl.TestSinkQueue
Tests run: 8, Failures: 0, Errors: 0, Skipped: 0, Time elapsed: 0.473 sec
Running org.apache.hadoop.metrics2.impl.TestMetricsCollectorImpl
Tests run: 2, Failures: 0, Errors: 0, Skipped: 0, Time elapsed: 0.225 sec
Running org.apache.hadoop.metrics2.impl.TestMetricsSystemImpl
Tests run: 3, Failures: 0, Errors: 0, Skipped: 0, Time elapsed: 0.598 sec
Running org.apache.hadoop.metrics2.lib.TestMetricsRegistry
Tests run: 2, Failures: 0, Errors: 0, Skipped: 0, Time elapsed: 0.348 sec
Running org.apache.hadoop.metrics2.lib.TestInterns
Tests run: 4, Failures: 0, Errors: 0, Skipped: 0, Time elapsed: 0.222 sec
Running org.apache.hadoop.metrics2.lib.TestMetricsAnnotations
Tests run: 9, Failures: 0, Errors: 0, Skipped: 0, Time elapsed: 0.435 sec
Running org.apache.hadoop.metrics2.lib.TestUniqNames
Tests run: 2, Failures: 0, Errors: 0, Skipped: 0, Time elapsed: 0.089 sec
Running org.apache.hadoop.metrics2.lib.TestMutableMetrics
Tests run: 2, Failures: 0, Errors: 0, Skipped: 0, Time elapsed: 0.382 sec
Running org.apache.hadoop.http.TestPathFilter
Tests run: 1, Failures: 0, Errors: 0, Skipped: 0, Time elapsed: 0.743 sec
Running org.apache.hadoop.http.TestHttpServerWebapps
Tests run: 2, Failures: 0, Errors: 0, Skipped: 0, Time elapsed: 0.435 sec
Running org.apache.hadoop.http.TestHtmlQuoting
Tests run: 4, Failures: 0, Errors: 0, Skipped: 0, Time elapsed: 0.272 sec
Running org.apache.hadoop.http.TestHttpRequestLog
Tests run: 2, Failures: 0, Errors: 0, Skipped: 0, Time elapsed: 0.153 sec
Running org.apache.hadoop.http.TestHttpServerLifecycle
Tests run: 6, Failures: 0, Errors: 0, Skipped: 0, Time elapsed: 1.21 sec
Running org.apache.hadoop.http.TestGlobalFilter
Tests run: 1, Failures: 0, Errors: 0, Skipped: 0, Time elapsed: 0.757 sec
Running org.apache.hadoop.http.TestHttpServer
Tests run: 11, Failures: 0, Errors: 0, Skipped: 0, Time elapsed: 498.388 sec
Running org.apache.hadoop.http.TestHttpRequestLogAppender
Tests run: 1, Failures: 0, Errors: 0, Skipped: 0, Time elapsed: 0.079 sec
Running org.apache.hadoop.http.TestServletFilter
Tests run: 2, Failures: 0, Errors: 0, Skipped: 0, Time elapsed: 0.992 sec
Running org.apache.hadoop.http.lib.TestStaticUserWebFilter
Tests run: 3, Failures: 0, Errors: 0, Skipped: 0, Time elapsed: 0.514 sec

Results :

Failed tests:   testSnappyCodec(org.apache.hadoop.io.compress.TestCodec): Snappy native available
but Hadoop native not

Tests run: 1640, Failures: 1, Errors: 0, Skipped: 34

[INFO] ------------------------------------------------------------------------
[INFO] Reactor Summary:
[INFO] 
[INFO] Apache Hadoop Annotations ......................... SUCCESS [  5.960 s]
[INFO] Apache Hadoop Auth ................................ SUCCESS [  8.811 s]
[INFO] Apache Hadoop Auth Examples ....................... SUCCESS [  1.495 s]
[INFO] Apache Hadoop Common .............................. FAILURE [16:28 min]
[INFO] Apache Hadoop Common Project ...................... SKIPPED
[INFO] ------------------------------------------------------------------------
[INFO] BUILD FAILURE
[INFO] ------------------------------------------------------------------------
[INFO] Total time: 16:45 min
[INFO] Finished at: 2014-09-16T09:19:03+00:00
[INFO] Final Memory: 38M/978M
[INFO] ------------------------------------------------------------------------
[ERROR] Failed to execute goal org.apache.maven.plugins:maven-surefire-plugin:2.12.3:test
(default-test) on project hadoop-common: There are test failures.
[ERROR] 
[ERROR] Please refer to <https://builds.apache.org/job/Hadoop-Common-0.23-Build/ws/trunk/hadoop-common-project/hadoop-common/target/surefire-reports>
for the individual test results.
[ERROR] -> [Help 1]
[ERROR] 
[ERROR] To see the full stack trace of the errors, re-run Maven with the -e switch.
[ERROR] Re-run Maven using the -X switch to enable full debug logging.
[ERROR] 
[ERROR] For more information about the errors and possible solutions, please read the following
articles:
[ERROR] [Help 1] http://cwiki.apache.org/confluence/display/MAVEN/MojoFailureException
[ERROR] 
[ERROR] After correcting the problems, you can resume the build with the command
[ERROR]   mvn <goals> -rf :hadoop-common
Build step 'Execute shell' marked build as failure
[WARNINGS] Skipping publisher since build result is FAILURE
Archiving artifacts
Recording fingerprints
Publishing Javadoc
Recording test results

Mime
View raw message