hadoop-common-dev mailing list archives

Site index · List index
Message view « Date » · « Thread »
Top « Date » · « Thread »
From Apache Jenkins Server <jenk...@builds.apache.org>
Subject Build failed in Jenkins: Hadoop-Common-0.23-Build #1043
Date Sat, 16 Aug 2014 09:12:25 GMT
See <https://builds.apache.org/job/Hadoop-Common-0.23-Build/1043/>

------------------------------------------
[...truncated 8263 lines...]
Running org.apache.hadoop.fs.TestGlobPattern
Tests run: 2, Failures: 0, Errors: 0, Skipped: 0, Time elapsed: 0.086 sec
Running org.apache.hadoop.fs.TestFcLocalFsUtil
Tests run: 2, Failures: 0, Errors: 0, Skipped: 0, Time elapsed: 0.544 sec
Running org.apache.hadoop.fs.TestLocalFileSystemPermission
Tests run: 2, Failures: 0, Errors: 0, Skipped: 0, Time elapsed: 0.499 sec
Running org.apache.hadoop.fs.TestDFVariations
Tests run: 1, Failures: 0, Errors: 0, Skipped: 0, Time elapsed: 0.137 sec
Running org.apache.hadoop.fs.permission.TestFsPermission
Tests run: 8, Failures: 0, Errors: 0, Skipped: 0, Time elapsed: 0.47 sec
Running org.apache.hadoop.fs.TestTrash
Tests run: 4, Failures: 0, Errors: 0, Skipped: 0, Time elapsed: 21.012 sec
Running org.apache.hadoop.fs.TestFileStatus
Tests run: 10, Failures: 0, Errors: 0, Skipped: 0, Time elapsed: 0.184 sec
Running org.apache.hadoop.fs.TestChecksumFileSystem
Tests run: 9, Failures: 0, Errors: 0, Skipped: 0, Time elapsed: 0.827 sec
Running org.apache.hadoop.fs.shell.TestPathExceptions
Tests run: 3, Failures: 0, Errors: 0, Skipped: 0, Time elapsed: 0.092 sec
Running org.apache.hadoop.fs.shell.TestCommandFactory
Tests run: 2, Failures: 0, Errors: 0, Skipped: 0, Time elapsed: 0.184 sec
Running org.apache.hadoop.fs.shell.TestPathData
Tests run: 9, Failures: 0, Errors: 0, Skipped: 0, Time elapsed: 0.776 sec
Running org.apache.hadoop.fs.shell.TestCopy
Tests run: 5, Failures: 0, Errors: 0, Skipped: 0, Time elapsed: 0.695 sec
Running org.apache.hadoop.fs.TestLocalFileSystem
Tests run: 10, Failures: 0, Errors: 0, Skipped: 0, Time elapsed: 0.952 sec
Running org.apache.hadoop.fs.TestFileContextDeleteOnExit
Tests run: 1, Failures: 0, Errors: 0, Skipped: 0, Time elapsed: 0.511 sec
Running org.apache.hadoop.fs.TestPath
Tests run: 16, Failures: 0, Errors: 0, Skipped: 0, Time elapsed: 0.758 sec
Running org.apache.hadoop.fs.TestLocalDirAllocator
Tests run: 30, Failures: 0, Errors: 0, Skipped: 0, Time elapsed: 0.935 sec
Running org.apache.hadoop.fs.TestFileSystemTokens
Tests run: 10, Failures: 0, Errors: 0, Skipped: 0, Time elapsed: 0.484 sec
Running org.apache.hadoop.fs.TestFileSystemCaching
Tests run: 13, Failures: 0, Errors: 0, Skipped: 0, Time elapsed: 0.894 sec
Running org.apache.hadoop.fs.TestFsShellCopy
Tests run: 11, Failures: 0, Errors: 0, Skipped: 0, Time elapsed: 1.181 sec
Running org.apache.hadoop.fs.TestListFiles
Tests run: 2, Failures: 0, Errors: 0, Skipped: 0, Time elapsed: 0.53 sec
Running org.apache.hadoop.fs.TestHardLink
Tests run: 6, Failures: 0, Errors: 0, Skipped: 0, Time elapsed: 0.281 sec
Running org.apache.hadoop.fs.TestLocalFSFileContextMainOperations
Tests run: 56, Failures: 0, Errors: 0, Skipped: 0, Time elapsed: 2.022 sec
Running org.apache.hadoop.fs.TestLocal_S3FileContextURI
Tests run: 17, Failures: 0, Errors: 0, Skipped: 0, Time elapsed: 1.303 sec
Running org.apache.hadoop.fs.TestFsShellReturnCode
Tests run: 8, Failures: 0, Errors: 0, Skipped: 0, Time elapsed: 2.056 sec
Running org.apache.hadoop.fs.TestS3_LocalFileContextURI
Tests run: 17, Failures: 0, Errors: 0, Skipped: 0, Time elapsed: 1.28 sec
Running org.apache.hadoop.fs.TestFileUtil
Tests run: 12, Failures: 0, Errors: 0, Skipped: 0, Time elapsed: 0.652 sec
Running org.apache.hadoop.fs.s3native.TestInMemoryNativeS3FileSystemContract
Tests run: 36, Failures: 0, Errors: 0, Skipped: 0, Time elapsed: 1.404 sec
Running org.apache.hadoop.fs.TestLocalFSFileContextSymlink
Tests run: 61, Failures: 0, Errors: 0, Skipped: 3, Time elapsed: 2.327 sec
Running org.apache.hadoop.fs.TestFsShell
Tests run: 1, Failures: 0, Errors: 0, Skipped: 0, Time elapsed: 0.278 sec
Running org.apache.hadoop.fs.TestBlockLocation
Tests run: 1, Failures: 0, Errors: 0, Skipped: 0, Time elapsed: 0.055 sec
Running org.apache.hadoop.fs.TestTruncatedInputBug
Tests run: 1, Failures: 0, Errors: 0, Skipped: 0, Time elapsed: 0.481 sec
Running org.apache.hadoop.fs.TestCommandFormat
Tests run: 10, Failures: 0, Errors: 0, Skipped: 0, Time elapsed: 0.102 sec
Running org.apache.hadoop.fs.TestLocalFSFileContextCreateMkdir
Tests run: 8, Failures: 0, Errors: 0, Skipped: 0, Time elapsed: 0.804 sec
Running org.apache.hadoop.fs.TestFSMainOperationsLocalFileSystem
Tests run: 49, Failures: 0, Errors: 0, Skipped: 0, Time elapsed: 1.585 sec
Running org.apache.hadoop.fs.s3.TestINode
Tests run: 3, Failures: 0, Errors: 0, Skipped: 0, Time elapsed: 0.05 sec
Running org.apache.hadoop.fs.s3.TestS3Credentials
Tests run: 1, Failures: 0, Errors: 0, Skipped: 0, Time elapsed: 0.145 sec
Running org.apache.hadoop.fs.s3.TestS3FileSystem
Tests run: 1, Failures: 0, Errors: 0, Skipped: 0, Time elapsed: 0.155 sec
Running org.apache.hadoop.fs.s3.TestInMemoryS3FileSystemContract
Tests run: 29, Failures: 0, Errors: 0, Skipped: 0, Time elapsed: 0.888 sec
Running org.apache.hadoop.fs.TestHarFileSystem
Tests run: 3, Failures: 0, Errors: 0, Skipped: 0, Time elapsed: 0.298 sec
Running org.apache.hadoop.fs.kfs.TestKosmosFileSystem
Tests run: 3, Failures: 0, Errors: 0, Skipped: 0, Time elapsed: 0.614 sec
Running org.apache.hadoop.fs.TestAfsCheckPath
Tests run: 4, Failures: 0, Errors: 0, Skipped: 0, Time elapsed: 0.165 sec
Running org.apache.hadoop.fs.TestDU
Tests run: 2, Failures: 0, Errors: 0, Skipped: 0, Time elapsed: 5.149 sec
Running org.apache.hadoop.fs.TestAvroFSInput
Tests run: 1, Failures: 0, Errors: 0, Skipped: 0, Time elapsed: 0.477 sec
Running org.apache.hadoop.fs.TestFilterFileSystem
Tests run: 12, Failures: 0, Errors: 0, Skipped: 0, Time elapsed: 0.57 sec
Running org.apache.hadoop.fs.TestHarFileSystemBasics
Tests run: 9, Failures: 0, Errors: 0, Skipped: 0, Time elapsed: 2.148 sec
Running org.apache.hadoop.fs.TestFileSystemCanonicalization
Tests run: 16, Failures: 0, Errors: 0, Skipped: 0, Time elapsed: 0.393 sec
Running org.apache.hadoop.fs.TestGetFileBlockLocations
Tests run: 3, Failures: 0, Errors: 0, Skipped: 0, Time elapsed: 0.743 sec
Running org.apache.hadoop.fs.viewfs.TestViewFileSystemWithAuthorityLocalFileSystem
Tests run: 38, Failures: 0, Errors: 0, Skipped: 0, Time elapsed: 1.973 sec
Running org.apache.hadoop.fs.viewfs.TestFcCreateMkdirLocalFs
Tests run: 8, Failures: 0, Errors: 0, Skipped: 0, Time elapsed: 1.014 sec
Running org.apache.hadoop.fs.viewfs.TestChRootedFileSystem
Tests run: 12, Failures: 0, Errors: 0, Skipped: 0, Time elapsed: 1.076 sec
Running org.apache.hadoop.fs.viewfs.TestViewFileSystemDelegation
Tests run: 2, Failures: 0, Errors: 0, Skipped: 0, Time elapsed: 0.452 sec
Running org.apache.hadoop.fs.viewfs.TestChRootedFs
Tests run: 9, Failures: 0, Errors: 0, Skipped: 0, Time elapsed: 1.04 sec
Running org.apache.hadoop.fs.viewfs.TestViewFileSystemLocalFileSystem
Tests run: 38, Failures: 0, Errors: 0, Skipped: 0, Time elapsed: 1.78 sec
Running org.apache.hadoop.fs.viewfs.TestFcMainOperationsLocalFs
Tests run: 54, Failures: 0, Errors: 0, Skipped: 0, Time elapsed: 2.549 sec
Running org.apache.hadoop.fs.viewfs.TestViewFsWithAuthorityLocalFs
Tests run: 42, Failures: 0, Errors: 0, Skipped: 0, Time elapsed: 2.738 sec
Running org.apache.hadoop.fs.viewfs.TestViewFsTrash
Tests run: 1, Failures: 0, Errors: 0, Skipped: 0, Time elapsed: 0.888 sec
Running org.apache.hadoop.fs.viewfs.TestFSMainOperationsLocalFileSystem
Tests run: 49, Failures: 0, Errors: 0, Skipped: 0, Time elapsed: 2.094 sec
Running org.apache.hadoop.fs.viewfs.TestFcPermissionsLocalFs
Tests run: 4, Failures: 0, Errors: 0, Skipped: 0, Time elapsed: 0.87 sec
Running org.apache.hadoop.fs.viewfs.TestViewfsFileStatus
Tests run: 2, Failures: 0, Errors: 0, Skipped: 0, Time elapsed: 0.756 sec
Running org.apache.hadoop.fs.viewfs.TestViewFsConfig
Tests run: 1, Failures: 0, Errors: 0, Skipped: 0, Time elapsed: 0.391 sec
Running org.apache.hadoop.fs.viewfs.TestViewFsLocalFs
Tests run: 42, Failures: 0, Errors: 0, Skipped: 0, Time elapsed: 2.561 sec
Running org.apache.hadoop.fs.TestFileContextResolveAfs
Tests run: 1, Failures: 0, Errors: 0, Skipped: 0, Time elapsed: 0.511 sec
Running org.apache.hadoop.fs.TestFilterFs
Tests run: 1, Failures: 0, Errors: 0, Skipped: 0, Time elapsed: 0.193 sec
Running org.apache.hadoop.jmx.TestJMXJsonServlet
Tests run: 1, Failures: 0, Errors: 0, Skipped: 0, Time elapsed: 0.856 sec
Running org.apache.hadoop.conf.TestConfiguration
Tests run: 37, Failures: 0, Errors: 0, Skipped: 0, Time elapsed: 2.485 sec
Running org.apache.hadoop.conf.TestConfigurationDeprecation
Tests run: 6, Failures: 0, Errors: 0, Skipped: 0, Time elapsed: 0.443 sec
Running org.apache.hadoop.conf.TestConfServlet
Tests run: 3, Failures: 0, Errors: 0, Skipped: 0, Time elapsed: 0.395 sec
Running org.apache.hadoop.conf.TestConfigurationSubclass
Tests run: 3, Failures: 0, Errors: 0, Skipped: 0, Time elapsed: 0.305 sec
Running org.apache.hadoop.conf.TestGetInstances
Tests run: 1, Failures: 0, Errors: 0, Skipped: 0, Time elapsed: 0.237 sec
Running org.apache.hadoop.conf.TestReconfiguration
Tests run: 3, Failures: 0, Errors: 0, Skipped: 0, Time elapsed: 0.98 sec
Running org.apache.hadoop.conf.TestDeprecatedKeys
Tests run: 3, Failures: 0, Errors: 0, Skipped: 0, Time elapsed: 0.337 sec
Running org.apache.hadoop.log.TestLogLevel
Tests run: 1, Failures: 0, Errors: 0, Skipped: 0, Time elapsed: 0.571 sec
Running org.apache.hadoop.log.TestLog4Json
Tests run: 5, Failures: 0, Errors: 0, Skipped: 0, Time elapsed: 0.363 sec
Running org.apache.hadoop.cli.TestCLI
Tests run: 1, Failures: 0, Errors: 0, Skipped: 0, Time elapsed: 0.962 sec
Running org.apache.hadoop.util.TestHostsFileReader
Tests run: 5, Failures: 0, Errors: 0, Skipped: 0, Time elapsed: 0.181 sec
Running org.apache.hadoop.util.TestPureJavaCrc32
Tests run: 1, Failures: 0, Errors: 0, Skipped: 0, Time elapsed: 1.256 sec
Running org.apache.hadoop.util.TestProtoUtil
Tests run: 1, Failures: 0, Errors: 0, Skipped: 0, Time elapsed: 0.084 sec
Running org.apache.hadoop.util.TestStringUtils
Tests run: 9, Failures: 0, Errors: 0, Skipped: 0, Time elapsed: 0.126 sec
Running org.apache.hadoop.util.TestStringInterner
Tests run: 3, Failures: 0, Errors: 0, Skipped: 0, Time elapsed: 0.13 sec
Running org.apache.hadoop.util.TestRunJar
Tests run: 2, Failures: 0, Errors: 0, Skipped: 0, Time elapsed: 0.131 sec
Running org.apache.hadoop.util.TestReflectionUtils
Tests run: 4, Failures: 0, Errors: 0, Skipped: 0, Time elapsed: 0.484 sec
Running org.apache.hadoop.util.TestIndexedSort
Tests run: 2, Failures: 0, Errors: 0, Skipped: 0, Time elapsed: 1.518 sec
Running org.apache.hadoop.util.TestAsyncDiskService
Tests run: 1, Failures: 0, Errors: 0, Skipped: 0, Time elapsed: 0.125 sec
Running org.apache.hadoop.util.TestShutdownHookManager
Tests run: 1, Failures: 0, Errors: 0, Skipped: 0, Time elapsed: 0.142 sec
Running org.apache.hadoop.util.TestDataChecksum
Tests run: 3, Failures: 0, Errors: 0, Skipped: 0, Time elapsed: 0.184 sec
Running org.apache.hadoop.util.TestOptions
Tests run: 2, Failures: 0, Errors: 0, Skipped: 0, Time elapsed: 0.079 sec
Running org.apache.hadoop.util.TestShell
Tests run: 4, Failures: 0, Errors: 0, Skipped: 0, Time elapsed: 5.199 sec
Running org.apache.hadoop.util.TestGenericsUtil
Tests run: 6, Failures: 0, Errors: 0, Skipped: 0, Time elapsed: 0.252 sec
Running org.apache.hadoop.util.TestDiskChecker
Tests run: 9, Failures: 0, Errors: 0, Skipped: 0, Time elapsed: 0.473 sec
Running org.apache.hadoop.util.TestJarFinder
Tests run: 1, Failures: 0, Errors: 0, Skipped: 0, Time elapsed: 0.774 sec
Running org.apache.hadoop.util.TestGenericOptionsParser
Tests run: 4, Failures: 0, Errors: 0, Skipped: 0, Time elapsed: 0.672 sec
Running org.apache.hadoop.record.TestBuffer
Tests run: 6, Failures: 0, Errors: 0, Skipped: 0, Time elapsed: 0.054 sec
Running org.apache.hadoop.record.TestRecordVersioning
Tests run: 2, Failures: 0, Errors: 0, Skipped: 0, Time elapsed: 0.167 sec
Running org.apache.hadoop.record.TestRecordIO
Tests run: 5, Failures: 0, Errors: 0, Skipped: 0, Time elapsed: 0.217 sec
Running org.apache.hadoop.http.TestGlobalFilter
Tests run: 1, Failures: 0, Errors: 0, Skipped: 0, Time elapsed: 0.746 sec
Running org.apache.hadoop.http.TestPathFilter
Tests run: 1, Failures: 0, Errors: 0, Skipped: 0, Time elapsed: 0.747 sec
Running org.apache.hadoop.http.TestServletFilter
Tests run: 2, Failures: 0, Errors: 0, Skipped: 0, Time elapsed: 0.951 sec
Running org.apache.hadoop.http.TestHttpRequestLogAppender
Tests run: 1, Failures: 0, Errors: 0, Skipped: 0, Time elapsed: 0.087 sec
Running org.apache.hadoop.http.TestHttpServerLifecycle
Tests run: 6, Failures: 0, Errors: 0, Skipped: 0, Time elapsed: 1.168 sec
Running org.apache.hadoop.http.lib.TestStaticUserWebFilter
Tests run: 3, Failures: 0, Errors: 0, Skipped: 0, Time elapsed: 0.515 sec
Running org.apache.hadoop.http.TestHttpRequestLog
Tests run: 2, Failures: 0, Errors: 0, Skipped: 0, Time elapsed: 0.157 sec
Running org.apache.hadoop.http.TestHtmlQuoting
Tests run: 4, Failures: 0, Errors: 0, Skipped: 0, Time elapsed: 0.274 sec
Running org.apache.hadoop.http.TestHttpServerWebapps
Tests run: 2, Failures: 0, Errors: 0, Skipped: 0, Time elapsed: 0.45 sec
Running org.apache.hadoop.http.TestHttpServer
Tests run: 11, Failures: 0, Errors: 0, Skipped: 0, Time elapsed: 3.749 sec

Results :

Failed tests:   testSnappyCodec(org.apache.hadoop.io.compress.TestCodec): Snappy native available
but Hadoop native not

Tests run: 1640, Failures: 1, Errors: 0, Skipped: 34

[INFO] ------------------------------------------------------------------------
[INFO] Reactor Summary:
[INFO] 
[INFO] Apache Hadoop Annotations ......................... SUCCESS [  7.913 s]
[INFO] Apache Hadoop Auth ................................ SUCCESS [  8.812 s]
[INFO] Apache Hadoop Auth Examples ....................... SUCCESS [  1.475 s]
[INFO] Apache Hadoop Common .............................. FAILURE [08:16 min]
[INFO] Apache Hadoop Common Project ...................... SKIPPED
[INFO] ------------------------------------------------------------------------
[INFO] BUILD FAILURE
[INFO] ------------------------------------------------------------------------
[INFO] Total time: 08:35 min
[INFO] Finished at: 2014-08-16T09:11:38+00:00
[INFO] Final Memory: 55M/998M
[INFO] ------------------------------------------------------------------------
[ERROR] Failed to execute goal org.apache.maven.plugins:maven-surefire-plugin:2.12.3:test
(default-test) on project hadoop-common: There are test failures.
[ERROR] 
[ERROR] Please refer to <https://builds.apache.org/job/Hadoop-Common-0.23-Build/ws/trunk/hadoop-common-project/hadoop-common/target/surefire-reports>
for the individual test results.
[ERROR] -> [Help 1]
[ERROR] 
[ERROR] To see the full stack trace of the errors, re-run Maven with the -e switch.
[ERROR] Re-run Maven using the -X switch to enable full debug logging.
[ERROR] 
[ERROR] For more information about the errors and possible solutions, please read the following
articles:
[ERROR] [Help 1] http://cwiki.apache.org/confluence/display/MAVEN/MojoFailureException
[ERROR] 
[ERROR] After correcting the problems, you can resume the build with the command
[ERROR]   mvn <goals> -rf :hadoop-common
Build step 'Execute shell' marked build as failure
[WARNINGS] Skipping publisher since build result is FAILURE
Archiving artifacts
Recording fingerprints
Publishing Javadoc
Recording test results

Mime
View raw message