hadoop-common-dev mailing list archives

Site index · List index
Message view « Date » · « Thread »
Top « Date » · « Thread »
From Apache Jenkins Server <jenk...@builds.apache.org>
Subject Build failed in Jenkins: Hadoop-Common-0.23-Build #1027
Date Thu, 31 Jul 2014 09:04:01 GMT
See <https://builds.apache.org/job/Hadoop-Common-0.23-Build/1027/>

------------------------------------------
[...truncated 10298 lines...]
           
Downloaded: http://repo.maven.apache.org/maven2/org/codehaus/plexus/plexus-compiler-api/1.5.3/plexus-compiler-api-1.5.3.jar
(20 KB at 173.2 KB/sec)
[INFO] Clover Version 3.0.2, built on April 13 2010 (build-790)
[INFO] Loaded from: /home/jenkins/.m2/repository/com/cenqua/clover/clover/3.0.2/clover-3.0.2.jar
[INFO] Clover: Open Source License registered to Apache.
[INFO] Creating new database at '<https://builds.apache.org/job/Hadoop-Common-0.23-Build/ws/trunk/hadoop-common-project/hadoop-annotations/target/clover/hadoop-coverage.db'.>
[INFO] Processing files at 1.6 source level.
[INFO] Clover all over. Instrumented 8 files (2 packages).
[INFO] Elapsed time = 0.262 secs. (30.534 files/sec, 2,335.878 srclines/sec)
[INFO] No Clover instrumentation done on source files in: [<https://builds.apache.org/job/Hadoop-Common-0.23-Build/ws/trunk/hadoop-common-project/hadoop-annotations/src/test/java]>
as no matching sources files found
[INFO] 
[INFO] --- maven-resources-plugin:2.2:resources (default-resources) @ hadoop-annotations ---
[INFO] Using default encoding to copy filtered resources.
[INFO] 
[INFO] --- maven-compiler-plugin:2.5.1:compile (default-compile) @ hadoop-annotations ---
[INFO] Compiling 8 source files to <https://builds.apache.org/job/Hadoop-Common-0.23-Build/ws/trunk/hadoop-common-project/hadoop-annotations/target/classes>
[INFO] 
[INFO] --- maven-resources-plugin:2.2:testResources (default-testResources) @ hadoop-annotations
---
[INFO] Using default encoding to copy filtered resources.
[INFO] 
[INFO] --- maven-compiler-plugin:2.5.1:testCompile (default-testCompile) @ hadoop-annotations
---
[INFO] No sources to compile
[INFO] 
[INFO] --- maven-surefire-plugin:2.12.3:test (default-test) @ hadoop-annotations ---
[INFO] No tests to run.
[INFO] 
[INFO] --- maven-clover2-plugin:3.0.5:clover (clover) @ hadoop-annotations ---
[INFO] Setting property: classpath.resource.loader.class => 'org.codehaus.plexus.velocity.ContextClassLoaderResourceLoader'.
[INFO] Setting property: velocimacro.messages.on => 'false'.
[INFO] Setting property: resource.loader => 'classpath'.
[INFO] Setting property: resource.manager.logwhenfound => 'false'.
[INFO] ************************************************************** 
[INFO] Starting Jakarta Velocity v1.4
[INFO] RuntimeInstance initializing.
[INFO] Default Properties File: org/apache/velocity/runtime/defaults/velocity.properties
[INFO] Default ResourceManager initializing. (class org.apache.velocity.runtime.resource.ResourceManagerImpl)
[INFO] Resource Loader Instantiated: org.codehaus.plexus.velocity.ContextClassLoaderResourceLoader
[INFO] ClasspathResourceLoader : initialization starting.
[INFO] ClasspathResourceLoader : initialization complete.
[INFO] ResourceCache : initialized. (class org.apache.velocity.runtime.resource.ResourceCacheImpl)
[INFO] Default ResourceManager initialization complete.
[INFO] Loaded System Directive: org.apache.velocity.runtime.directive.Literal
[INFO] Loaded System Directive: org.apache.velocity.runtime.directive.Macro
[INFO] Loaded System Directive: org.apache.velocity.runtime.directive.Parse
[INFO] Loaded System Directive: org.apache.velocity.runtime.directive.Include
[INFO] Loaded System Directive: org.apache.velocity.runtime.directive.Foreach
[INFO] Created: 20 parsers.
[INFO] Velocimacro : initialization starting.
[INFO] Velocimacro : adding VMs from VM library template : VM_global_library.vm
[ERROR] ResourceManager : unable to find resource 'VM_global_library.vm' in any resource loader.
[INFO] Velocimacro : error using  VM library template VM_global_library.vm : org.apache.velocity.exception.ResourceNotFoundException:
Unable to find resource 'VM_global_library.vm'
[INFO] Velocimacro :  VM library template macro registration complete.
[INFO] Velocimacro : allowInline = true : VMs can be defined inline in templates
[INFO] Velocimacro : allowInlineToOverride = false : VMs defined inline may NOT replace previous
VM definitions
[INFO] Velocimacro : allowInlineLocal = false : VMs defined inline will be  global in scope
if allowed.
[INFO] Velocimacro : initialization complete.
[INFO] Velocity successfully started.
[INFO] Using /default-clover-report descriptor.
[INFO] Using Clover report descriptor: /tmp/mvn3059995646865054012resource
[INFO] Clover Version 3.0.2, built on April 13 2010 (build-790)
[INFO] Loaded from: /home/jenkins/.m2/repository/com/cenqua/clover/clover/3.0.2/clover-3.0.2.jar
[INFO] Clover: Open Source License registered to Apache.
[INFO] Clover is enabled with initstring '<https://builds.apache.org/job/Hadoop-Common-0.23-Build/ws/trunk/hadoop-common-project/hadoop-annotations/target/clover/hadoop-coverage.db'>
[WARNING] Clover historical directory [<https://builds.apache.org/job/Hadoop-Common-0.23-Build/ws/trunk/hadoop-common-project/hadoop-annotations/target/clover/history]>
does not exist, skipping Clover historical report generation ([<https://builds.apache.org/job/Hadoop-Common-0.23-Build/ws/trunk/hadoop-common-project/hadoop-annotations/target/clover])>
[INFO] Clover Version 3.0.2, built on April 13 2010 (build-790)
[INFO] Loaded from: /home/jenkins/.m2/repository/com/cenqua/clover/clover/3.0.2/clover-3.0.2.jar
[INFO] Clover: Open Source License registered to Apache.
[INFO] Loading coverage database from: '<https://builds.apache.org/job/Hadoop-Common-0.23-Build/ws/trunk/hadoop-common-project/hadoop-annotations/target/clover/hadoop-coverage.db'>
[INFO] Writing HTML report to '<https://builds.apache.org/job/Hadoop-Common-0.23-Build/ws/trunk/hadoop-common-project/hadoop-annotations/target/clover'>
[INFO] Done. Processed 2 packages in 3491ms (1745ms per package).
[INFO] Clover Version 3.0.2, built on April 13 2010 (build-790)
[INFO] Loaded from: /home/jenkins/.m2/repository/com/cenqua/clover/clover/3.0.2/clover-3.0.2.jar
[INFO] Clover: Open Source License registered to Apache.
[INFO] Clover is enabled with initstring '<https://builds.apache.org/job/Hadoop-Common-0.23-Build/ws/trunk/hadoop-common-project/hadoop-annotations/target/clover/hadoop-coverage.db'>
[WARNING] Clover historical directory [<https://builds.apache.org/job/Hadoop-Common-0.23-Build/ws/trunk/hadoop-common-project/hadoop-annotations/target/clover/history]>
does not exist, skipping Clover historical report generation ([<https://builds.apache.org/job/Hadoop-Common-0.23-Build/ws/trunk/hadoop-common-project/hadoop-annotations/target/clover/clover.xml])>
[INFO] Clover Version 3.0.2, built on April 13 2010 (build-790)
[INFO] Loaded from: /home/jenkins/.m2/repository/com/cenqua/clover/clover/3.0.2/clover-3.0.2.jar
[INFO] Clover: Open Source License registered to Apache.
[INFO] Loading coverage database from: '<https://builds.apache.org/job/Hadoop-Common-0.23-Build/ws/trunk/hadoop-common-project/hadoop-annotations/target/clover/hadoop-coverage.db'>
[INFO] Writing report to '<https://builds.apache.org/job/Hadoop-Common-0.23-Build/ws/trunk/hadoop-common-project/hadoop-annotations/target/clover/clover.xml'>
[INFO]                                                                         
[INFO] ------------------------------------------------------------------------
[INFO] Building Apache Hadoop Auth 0.23.12-SNAPSHOT
[INFO] ------------------------------------------------------------------------
[INFO] 
[INFO] --- maven-antrun-plugin:1.6:run (create-testdirs) @ hadoop-auth ---
[INFO] Executing tasks

main:
[INFO] Executed tasks
[INFO] 
[INFO] --- maven-dependency-plugin:2.1:build-classpath (build-classpath) @ hadoop-auth ---
[INFO] Wrote classpath file '<https://builds.apache.org/job/Hadoop-Common-0.23-Build/ws/trunk/hadoop-common-project/hadoop-auth/target/classes/mrapp-generated-classpath'.>
[INFO] 
[INFO] --- maven-clover2-plugin:3.0.5:setup (setup) @ hadoop-auth ---
[INFO] Clover Version 3.0.2, built on April 13 2010 (build-790)
[INFO] Loaded from: /home/jenkins/.m2/repository/com/cenqua/clover/clover/3.0.2/clover-3.0.2.jar
[INFO] Clover: Open Source License registered to Apache.
[INFO] Creating new database at '<https://builds.apache.org/job/Hadoop-Common-0.23-Build/ws/trunk/hadoop-common-project/hadoop-auth/target/clover/hadoop-coverage.db'.>
[INFO] Processing files at 1.6 source level.
[INFO] Clover all over. Instrumented 14 files (3 packages).
[INFO] Elapsed time = 0.248 secs. (56.452 files/sec, 10,125 srclines/sec)
[INFO] Clover Version 3.0.2, built on April 13 2010 (build-790)
[INFO] Loaded from: /home/jenkins/.m2/repository/com/cenqua/clover/clover/3.0.2/clover-3.0.2.jar
[INFO] Clover: Open Source License registered to Apache.
[INFO] Updating existing database at '<https://builds.apache.org/job/Hadoop-Common-0.23-Build/ws/trunk/hadoop-common-project/hadoop-auth/target/clover/hadoop-coverage.db'.>
[INFO] Processing files at 1.6 source level.
[INFO] Clover all over. Instrumented 12 files (4 packages).
[INFO] 56 test methods detected.
[INFO] Elapsed time = 0.112 secs. (107.143 files/sec, 16,607.143 srclines/sec)
[INFO] 
[INFO] --- maven-resources-plugin:2.2:resources (default-resources) @ hadoop-auth ---
[INFO] Using default encoding to copy filtered resources.
[INFO] 
[INFO] --- maven-compiler-plugin:2.5.1:compile (default-compile) @ hadoop-auth ---
[INFO] Compiling 14 source files to <https://builds.apache.org/job/Hadoop-Common-0.23-Build/ws/trunk/hadoop-common-project/hadoop-auth/target/classes>
[INFO] 
[INFO] --- maven-resources-plugin:2.2:testResources (default-testResources) @ hadoop-auth
---
[INFO] Using default encoding to copy filtered resources.
[INFO] 
[INFO] --- maven-compiler-plugin:2.5.1:testCompile (default-testCompile) @ hadoop-auth ---
[INFO] Compiling 12 source files to <https://builds.apache.org/job/Hadoop-Common-0.23-Build/ws/trunk/hadoop-common-project/hadoop-auth/target/test-classes>
[INFO] 
[INFO] --- maven-surefire-plugin:2.12.3:test (default-test) @ hadoop-auth ---
[INFO] Surefire report directory: <https://builds.apache.org/job/Hadoop-Common-0.23-Build/ws/trunk/hadoop-common-project/hadoop-auth/target/surefire-reports>
Downloading: http://repo.maven.apache.org/maven2/org/apache/maven/surefire/surefire-junit4/2.12.3/surefire-junit4-2.12.3.pom
3/3 KB     
         
Downloaded: http://repo.maven.apache.org/maven2/org/apache/maven/surefire/surefire-junit4/2.12.3/surefire-junit4-2.12.3.pom
(3 KB at 22.2 KB/sec)
Downloading: http://repo.maven.apache.org/maven2/org/apache/maven/surefire/surefire-providers/2.12.3/surefire-providers-2.12.3.pom
3/3 KB   
         
Downloaded: http://repo.maven.apache.org/maven2/org/apache/maven/surefire/surefire-providers/2.12.3/surefire-providers-2.12.3.pom
(3 KB at 30.6 KB/sec)
Downloading: http://repo.maven.apache.org/maven2/org/apache/maven/surefire/surefire-junit4/2.12.3/surefire-junit4-2.12.3.jar
4/36 KB   
7/36 KB   
11/36 KB   
14/36 KB   
18/36 KB   
22/36 KB   
26/36 KB   
30/36 KB   
31/36 KB   
35/36 KB   
36/36 KB   
           
Downloaded: http://repo.maven.apache.org/maven2/org/apache/maven/surefire/surefire-junit4/2.12.3/surefire-junit4-2.12.3.jar
(36 KB at 253.0 KB/sec)

-------------------------------------------------------
 T E S T S
-------------------------------------------------------

-------------------------------------------------------
 T E S T S
-------------------------------------------------------
Running org.apache.hadoop.security.authentication.server.TestAuthenticationToken
Tests run: 5, Failures: 0, Errors: 0, Skipped: 0, Time elapsed: 0.195 sec
Running org.apache.hadoop.security.authentication.server.TestAuthenticationFilter
Tests run: 13, Failures: 0, Errors: 0, Skipped: 0, Time elapsed: 0.459 sec
Running org.apache.hadoop.security.authentication.server.TestPseudoAuthenticationHandler
Tests run: 6, Failures: 0, Errors: 0, Skipped: 0, Time elapsed: 0.302 sec
Running org.apache.hadoop.security.authentication.client.TestPseudoAuthenticator
Tests run: 7, Failures: 0, Errors: 0, Skipped: 0, Time elapsed: 1.008 sec
Running org.apache.hadoop.security.authentication.client.TestAuthenticatedURL
Tests run: 4, Failures: 0, Errors: 0, Skipped: 0, Time elapsed: 0.286 sec
Running org.apache.hadoop.security.authentication.util.TestSigner
Tests run: 6, Failures: 0, Errors: 0, Skipped: 0, Time elapsed: 0.113 sec
Running org.apache.hadoop.security.authentication.util.TestKerberosName
Tests run: 2, Failures: 0, Errors: 0, Skipped: 0, Time elapsed: 0.135 sec
Running org.apache.hadoop.security.authentication.util.TestKerberosUtil
Tests run: 1, Failures: 0, Errors: 1, Skipped: 0, Time elapsed: 0.263 sec <<< FAILURE!
testGetServerPrincipal(org.apache.hadoop.security.authentication.util.TestKerberosUtil)  Time
elapsed: 211 sec  <<< ERROR!
java.net.UnknownHostException: asf901.ygridcore.net: asf901.ygridcore.net
	at java.net.InetAddress.getLocalHost(InetAddress.java:1402)
	at org.apache.hadoop.security.authentication.util.KerberosUtil.getLocalHostName(KerberosUtil.java:74)
	at org.apache.hadoop.security.authentication.util.TestKerberosUtil.__CLR3_0_26p29am1bm(TestKerberosUtil.java:31)
	at org.apache.hadoop.security.authentication.util.TestKerberosUtil.testGetServerPrincipal(TestKerberosUtil.java:29)
	at sun.reflect.NativeMethodAccessorImpl.invoke0(Native Method)
	at sun.reflect.NativeMethodAccessorImpl.invoke(NativeMethodAccessorImpl.java:39)
	at sun.reflect.DelegatingMethodAccessorImpl.invoke(DelegatingMethodAccessorImpl.java:25)
	at java.lang.reflect.Method.invoke(Method.java:597)
	at org.junit.runners.model.FrameworkMethod$1.runReflectiveCall(FrameworkMethod.java:44)
	at org.junit.internal.runners.model.ReflectiveCallable.run(ReflectiveCallable.java:15)
	at org.junit.runners.model.FrameworkMethod.invokeExplosively(FrameworkMethod.java:41)
	at org.junit.internal.runners.statements.InvokeMethod.evaluate(InvokeMethod.java:20)
	at org.junit.runners.BlockJUnit4ClassRunner.runNotIgnored(BlockJUnit4ClassRunner.java:79)
	at org.junit.runners.BlockJUnit4ClassRunner.runChild(BlockJUnit4ClassRunner.java:71)
	at org.junit.runners.BlockJUnit4ClassRunner.runChild(BlockJUnit4ClassRunner.java:49)
	at org.junit.runners.ParentRunner$3.run(ParentRunner.java:193)
	at org.junit.runners.ParentRunner$1.schedule(ParentRunner.java:52)
	at org.junit.runners.ParentRunner.runChildren(ParentRunner.java:191)
	at org.junit.runners.ParentRunner.access$000(ParentRunner.java:42)
	at org.junit.runners.ParentRunner$2.evaluate(ParentRunner.java:184)
	at org.junit.runners.ParentRunner.run(ParentRunner.java:236)
	at org.apache.maven.surefire.junit4.JUnit4Provider.execute(JUnit4Provider.java:252)
	at org.apache.maven.surefire.junit4.JUnit4Provider.executeTestSet(JUnit4Provider.java:141)
	at org.apache.maven.surefire.junit4.JUnit4Provider.invoke(JUnit4Provider.java:112)
	at sun.reflect.NativeMethodAccessorImpl.invoke0(Native Method)
	at sun.reflect.NativeMethodAccessorImpl.invoke(NativeMethodAccessorImpl.java:39)
	at sun.reflect.DelegatingMethodAccessorImpl.invoke(DelegatingMethodAccessorImpl.java:25)
	at java.lang.reflect.Method.invoke(Method.java:597)
	at org.apache.maven.surefire.util.ReflectionUtils.invokeMethodWithArray(ReflectionUtils.java:189)
	at org.apache.maven.surefire.booter.ProviderFactory$ProviderProxy.invoke(ProviderFactory.java:165)
	at org.apache.maven.surefire.booter.ProviderFactory.invokeProvider(ProviderFactory.java:85)
	at org.apache.maven.surefire.booter.ForkedBooter.runSuitesInProcess(ForkedBooter.java:115)
	at org.apache.maven.surefire.booter.ForkedBooter.main(ForkedBooter.java:75)


Results :

Tests in error: 
  testGetServerPrincipal(org.apache.hadoop.security.authentication.util.TestKerberosUtil):
asf901.ygridcore.net: asf901.ygridcore.net

Tests run: 44, Failures: 0, Errors: 1, Skipped: 0

[INFO] ------------------------------------------------------------------------
[INFO] Reactor Summary:
[INFO] 
[INFO] Apache Hadoop Annotations ......................... SUCCESS [ 11.048 s]
[INFO] Apache Hadoop Auth ................................ FAILURE [  6.509 s]
[INFO] Apache Hadoop Auth Examples ....................... SKIPPED
[INFO] Apache Hadoop Common .............................. SKIPPED
[INFO] Apache Hadoop Common Project ...................... SKIPPED
[INFO] ------------------------------------------------------------------------
[INFO] BUILD FAILURE
[INFO] ------------------------------------------------------------------------
[INFO] Total time: 17.860 s
[INFO] Finished at: 2014-07-31T09:02:40+00:00
[INFO] Final Memory: 23M/723M
[INFO] ------------------------------------------------------------------------
[ERROR] Failed to execute goal org.apache.maven.plugins:maven-surefire-plugin:2.12.3:test
(default-test) on project hadoop-auth: There are test failures.
[ERROR] 
[ERROR] Please refer to <https://builds.apache.org/job/Hadoop-Common-0.23-Build/ws/trunk/hadoop-common-project/hadoop-auth/target/surefire-reports>
for the individual test results.
[ERROR] -> [Help 1]
[ERROR] 
[ERROR] To see the full stack trace of the errors, re-run Maven with the -e switch.
[ERROR] Re-run Maven using the -X switch to enable full debug logging.
[ERROR] 
[ERROR] For more information about the errors and possible solutions, please read the following
articles:
[ERROR] [Help 1] http://cwiki.apache.org/confluence/display/MAVEN/MojoFailureException
[ERROR] 
[ERROR] After correcting the problems, you can resume the build with the command
[ERROR]   mvn <goals> -rf :hadoop-auth
Build step 'Execute shell' marked build as failure
[WARNINGS] Skipping publisher since build result is FAILURE
Archiving artifacts
Recording fingerprints
Publishing Javadoc
Recording test results

Mime
View raw message