hadoop-common-dev mailing list archives

Site index · List index
Message view « Date » · « Thread »
Top « Date » · « Thread »
From Apache Jenkins Server <jenk...@builds.apache.org>
Subject Build failed in Jenkins: Hadoop-Common-trunk #1165
Date Mon, 07 Jul 2014 20:09:15 GMT
See <https://builds.apache.org/job/Hadoop-Common-trunk/1165/changes>

Changes:

[cnauroth] MAPREDUCE-5866. TestFixedLengthInputFormat fails in windows. Contributed by Varun
Vasudev.

[vinodkv] MAPREDUCE-5868. Fixed an issue with TestPipeApplication that was causing the nightly
builds to fail. Contributed by Akira Ajisaka.

------------------------------------------
[...truncated 65678 lines...]
Setting project property: settings.localRepository -> /home/jenkins/.m2/repository
Setting project property: org.apache.hadoop:hadoop-annotations:jar -> <https://builds.apache.org/job/Hadoop-Common-trunk/ws/trunk/hadoop-common-project/hadoop-annotations/target/hadoop-annotations-3.0.0-SNAPSHOT.jar>
Setting project property: jdk.tools:jdk.tools:jar -> /home/jenkins/tools/java/jdk1.6.0_20-32/jre/../lib/tools.jar
Setting project property: com.google.guava:guava:jar -> /home/jenkins/.m2/repository/com/google/guava/guava/11.0.2/guava-11.0.2.jar
Setting project property: commons-cli:commons-cli:jar -> /home/jenkins/.m2/repository/commons-cli/commons-cli/1.2/commons-cli-1.2.jar
Setting project property: org.apache.commons:commons-math3:jar -> /home/jenkins/.m2/repository/org/apache/commons/commons-math3/3.1.1/commons-math3-3.1.1.jar
Setting project property: xmlenc:xmlenc:jar -> /home/jenkins/.m2/repository/xmlenc/xmlenc/0.52/xmlenc-0.52.jar
Setting project property: commons-httpclient:commons-httpclient:jar -> /home/jenkins/.m2/repository/commons-httpclient/commons-httpclient/3.1/commons-httpclient-3.1.jar
Setting project property: commons-codec:commons-codec:jar -> /home/jenkins/.m2/repository/commons-codec/commons-codec/1.4/commons-codec-1.4.jar
Setting project property: commons-io:commons-io:jar -> /home/jenkins/.m2/repository/commons-io/commons-io/2.4/commons-io-2.4.jar
Setting project property: commons-net:commons-net:jar -> /home/jenkins/.m2/repository/commons-net/commons-net/3.1/commons-net-3.1.jar
Setting project property: commons-collections:commons-collections:jar -> /home/jenkins/.m2/repository/commons-collections/commons-collections/3.2.1/commons-collections-3.2.1.jar
Setting project property: javax.servlet:servlet-api:jar -> /home/jenkins/.m2/repository/javax/servlet/servlet-api/2.5/servlet-api-2.5.jar
Setting project property: org.mortbay.jetty:jetty:jar -> /home/jenkins/.m2/repository/org/mortbay/jetty/jetty/6.1.26/jetty-6.1.26.jar
Setting project property: org.mortbay.jetty:jetty-util:jar -> /home/jenkins/.m2/repository/org/mortbay/jetty/jetty-util/6.1.26/jetty-util-6.1.26.jar
Setting project property: javax.servlet.jsp:jsp-api:jar -> /home/jenkins/.m2/repository/javax/servlet/jsp/jsp-api/2.1/jsp-api-2.1.jar
Setting project property: com.sun.jersey:jersey-core:jar -> /home/jenkins/.m2/repository/com/sun/jersey/jersey-core/1.9/jersey-core-1.9.jar
Setting project property: com.sun.jersey:jersey-json:jar -> /home/jenkins/.m2/repository/com/sun/jersey/jersey-json/1.9/jersey-json-1.9.jar
Setting project property: org.codehaus.jettison:jettison:jar -> /home/jenkins/.m2/repository/org/codehaus/jettison/jettison/1.1/jettison-1.1.jar
Setting project property: com.sun.xml.bind:jaxb-impl:jar -> /home/jenkins/.m2/repository/com/sun/xml/bind/jaxb-impl/2.2.3-1/jaxb-impl-2.2.3-1.jar
Setting project property: javax.xml.bind:jaxb-api:jar -> /home/jenkins/.m2/repository/javax/xml/bind/jaxb-api/2.2.2/jaxb-api-2.2.2.jar
Setting project property: javax.xml.stream:stax-api:jar -> /home/jenkins/.m2/repository/javax/xml/stream/stax-api/1.0-2/stax-api-1.0-2.jar
Setting project property: javax.activation:activation:jar -> /home/jenkins/.m2/repository/javax/activation/activation/1.1/activation-1.1.jar
Setting project property: org.codehaus.jackson:jackson-jaxrs:jar -> /home/jenkins/.m2/repository/org/codehaus/jackson/jackson-jaxrs/1.9.13/jackson-jaxrs-1.9.13.jar
Setting project property: org.codehaus.jackson:jackson-xc:jar -> /home/jenkins/.m2/repository/org/codehaus/jackson/jackson-xc/1.9.13/jackson-xc-1.9.13.jar
Setting project property: com.sun.jersey:jersey-server:jar -> /home/jenkins/.m2/repository/com/sun/jersey/jersey-server/1.9/jersey-server-1.9.jar
Setting project property: asm:asm:jar -> /home/jenkins/.m2/repository/asm/asm/3.2/asm-3.2.jar
Setting project property: commons-logging:commons-logging:jar -> /home/jenkins/.m2/repository/commons-logging/commons-logging/1.1.3/commons-logging-1.1.3.jar
Setting project property: log4j:log4j:jar -> /home/jenkins/.m2/repository/log4j/log4j/1.2.17/log4j-1.2.17.jar
Setting project property: net.java.dev.jets3t:jets3t:jar -> /home/jenkins/.m2/repository/net/java/dev/jets3t/jets3t/0.9.0/jets3t-0.9.0.jar
Setting project property: org.apache.httpcomponents:httpclient:jar -> /home/jenkins/.m2/repository/org/apache/httpcomponents/httpclient/4.2.5/httpclient-4.2.5.jar
Setting project property: org.apache.httpcomponents:httpcore:jar -> /home/jenkins/.m2/repository/org/apache/httpcomponents/httpcore/4.2.5/httpcore-4.2.5.jar
Setting project property: com.jamesmurty.utils:java-xmlbuilder:jar -> /home/jenkins/.m2/repository/com/jamesmurty/utils/java-xmlbuilder/0.4/java-xmlbuilder-0.4.jar
Setting project property: junit:junit:jar -> /home/jenkins/.m2/repository/junit/junit/4.11/junit-4.11.jar
Setting project property: org.hamcrest:hamcrest-core:jar -> /home/jenkins/.m2/repository/org/hamcrest/hamcrest-core/1.3/hamcrest-core-1.3.jar
Setting project property: commons-lang:commons-lang:jar -> /home/jenkins/.m2/repository/commons-lang/commons-lang/2.6/commons-lang-2.6.jar
Setting project property: commons-configuration:commons-configuration:jar -> /home/jenkins/.m2/repository/commons-configuration/commons-configuration/1.6/commons-configuration-1.6.jar
Setting project property: commons-digester:commons-digester:jar -> /home/jenkins/.m2/repository/commons-digester/commons-digester/1.8/commons-digester-1.8.jar
Setting project property: commons-beanutils:commons-beanutils:jar -> /home/jenkins/.m2/repository/commons-beanutils/commons-beanutils/1.7.0/commons-beanutils-1.7.0.jar
Setting project property: commons-beanutils:commons-beanutils-core:jar -> /home/jenkins/.m2/repository/commons-beanutils/commons-beanutils-core/1.8.0/commons-beanutils-core-1.8.0.jar
Setting project property: org.slf4j:slf4j-api:jar -> /home/jenkins/.m2/repository/org/slf4j/slf4j-api/1.7.5/slf4j-api-1.7.5.jar
Setting project property: org.slf4j:slf4j-log4j12:jar -> /home/jenkins/.m2/repository/org/slf4j/slf4j-log4j12/1.7.5/slf4j-log4j12-1.7.5.jar
Setting project property: org.codehaus.jackson:jackson-core-asl:jar -> /home/jenkins/.m2/repository/org/codehaus/jackson/jackson-core-asl/1.9.13/jackson-core-asl-1.9.13.jar
Setting project property: org.codehaus.jackson:jackson-mapper-asl:jar -> /home/jenkins/.m2/repository/org/codehaus/jackson/jackson-mapper-asl/1.9.13/jackson-mapper-asl-1.9.13.jar
Setting project property: org.mockito:mockito-all:jar -> /home/jenkins/.m2/repository/org/mockito/mockito-all/1.8.5/mockito-all-1.8.5.jar
Setting project property: org.apache.avro:avro:jar -> /home/jenkins/.m2/repository/org/apache/avro/avro/1.7.4/avro-1.7.4.jar
Setting project property: com.thoughtworks.paranamer:paranamer:jar -> /home/jenkins/.m2/repository/com/thoughtworks/paranamer/paranamer/2.3/paranamer-2.3.jar
Setting project property: org.xerial.snappy:snappy-java:jar -> /home/jenkins/.m2/repository/org/xerial/snappy/snappy-java/1.0.4.1/snappy-java-1.0.4.1.jar
Setting project property: org.apache.ant:ant:jar -> /home/jenkins/.m2/repository/org/apache/ant/ant/1.8.1/ant-1.8.1.jar
Setting project property: org.apache.ant:ant-launcher:jar -> /home/jenkins/.m2/repository/org/apache/ant/ant-launcher/1.8.1/ant-launcher-1.8.1.jar
Setting project property: com.google.protobuf:protobuf-java:jar -> /home/jenkins/.m2/repository/com/google/protobuf/protobuf-java/2.5.0/protobuf-java-2.5.0.jar
Setting project property: com.google.code.gson:gson:jar -> /home/jenkins/.m2/repository/com/google/code/gson/gson/2.2.4/gson-2.2.4.jar
Setting project property: org.apache.hadoop:hadoop-auth:jar -> <https://builds.apache.org/job/Hadoop-Common-trunk/ws/trunk/hadoop-common-project/hadoop-auth/target/hadoop-auth-3.0.0-SNAPSHOT.jar>
Setting project property: org.apache.directory.server:apacheds-kerberos-codec:jar -> /home/jenkins/.m2/repository/org/apache/directory/server/apacheds-kerberos-codec/2.0.0-M15/apacheds-kerberos-codec-2.0.0-M15.jar
Setting project property: org.apache.directory.server:apacheds-i18n:jar -> /home/jenkins/.m2/repository/org/apache/directory/server/apacheds-i18n/2.0.0-M15/apacheds-i18n-2.0.0-M15.jar
Setting project property: org.apache.directory.api:api-asn1-api:jar -> /home/jenkins/.m2/repository/org/apache/directory/api/api-asn1-api/1.0.0-M20/api-asn1-api-1.0.0-M20.jar
Setting project property: org.apache.directory.api:api-util:jar -> /home/jenkins/.m2/repository/org/apache/directory/api/api-util/1.0.0-M20/api-util-1.0.0-M20.jar
Setting project property: com.jcraft:jsch:jar -> /home/jenkins/.m2/repository/com/jcraft/jsch/0.1.42/jsch-0.1.42.jar
Setting project property: com.google.code.findbugs:jsr305:jar -> /home/jenkins/.m2/repository/com/google/code/findbugs/jsr305/1.3.9/jsr305-1.3.9.jar
Setting project property: org.apache.zookeeper:zookeeper:jar -> /home/jenkins/.m2/repository/org/apache/zookeeper/zookeeper/3.4.6/zookeeper-3.4.6.jar
Setting project property: io.netty:netty:jar -> /home/jenkins/.m2/repository/io/netty/netty/3.6.2.Final/netty-3.6.2.Final.jar
Setting project property: org.apache.zookeeper:zookeeper:test-jar:tests -> /home/jenkins/.m2/repository/org/apache/zookeeper/zookeeper/3.4.6/zookeeper-3.4.6-tests.jar
Setting project property: jline:jline:jar -> /home/jenkins/.m2/repository/jline/jline/0.9.94/jline-0.9.94.jar
Setting project property: org.apache.commons:commons-compress:jar -> /home/jenkins/.m2/repository/org/apache/commons/commons-compress/1.4.1/commons-compress-1.4.1.jar
Setting project property: org.tukaani:xz:jar -> /home/jenkins/.m2/repository/org/tukaani/xz/1.0/xz-1.0.jar
Setting project property: maven.project.dependencies.versions -> 3.0.0-SNAPSHOT:1.6:11.0.2:1.2:3.1.1:0.52:3.1:1.4:2.4:3.1:3.2.1:2.5:6.1.26:6.1.26:2.1:1.9:1.9:1.1:2.2.3-1:2.2.2:1.0-2:1.1:1.9.13:1.9.13:1.9:3.2:1.1.3:1.2.17:0.9.0:4.2.5:4.2.5:0.4:4.11:1.3:2.6:1.6:1.8:1.7.0:1.8.0:1.7.5:1.7.5:1.9.13:1.9.13:1.8.5:1.7.4:2.3:1.0.4.1:1.8.1:1.8.1:2.5.0:2.2.4:3.0.0-SNAPSHOT:2.0.0-M15:2.0.0-M15:1.0.0-M20:1.0.0-M20:0.1.42:1.3.9:3.4.6:3.6.2.Final:3.4.6:0.9.94:1.4.1:1.0:
Setting project property: maven.dependency.org.apache.hadoop.hadoop-annotations.jar.path ->
<https://builds.apache.org/job/Hadoop-Common-trunk/ws/trunk/hadoop-common-project/hadoop-annotations/target/hadoop-annotations-3.0.0-SNAPSHOT.jar>
Setting project property: maven.dependency.jdk.tools.jdk.tools.jar.path -> /home/jenkins/tools/java/jdk1.6.0_20-32/jre/../lib/tools.jar
Setting project property: maven.dependency.com.google.guava.guava.jar.path -> /home/jenkins/.m2/repository/com/google/guava/guava/11.0.2/guava-11.0.2.jar
Setting project property: maven.dependency.commons-cli.commons-cli.jar.path -> /home/jenkins/.m2/repository/commons-cli/commons-cli/1.2/commons-cli-1.2.jar
Setting project property: maven.dependency.org.apache.commons.commons-math3.jar.path ->
/home/jenkins/.m2/repository/org/apache/commons/commons-math3/3.1.1/commons-math3-3.1.1.jar
Setting project property: maven.dependency.xmlenc.xmlenc.jar.path -> /home/jenkins/.m2/repository/xmlenc/xmlenc/0.52/xmlenc-0.52.jar
Setting project property: maven.dependency.commons-httpclient.commons-httpclient.jar.path
-> /home/jenkins/.m2/repository/commons-httpclient/commons-httpclient/3.1/commons-httpclient-3.1.jar
Setting project property: maven.dependency.commons-codec.commons-codec.jar.path -> /home/jenkins/.m2/repository/commons-codec/commons-codec/1.4/commons-codec-1.4.jar
Setting project property: maven.dependency.commons-io.commons-io.jar.path -> /home/jenkins/.m2/repository/commons-io/commons-io/2.4/commons-io-2.4.jar
Setting project property: maven.dependency.commons-net.commons-net.jar.path -> /home/jenkins/.m2/repository/commons-net/commons-net/3.1/commons-net-3.1.jar
Setting project property: maven.dependency.commons-collections.commons-collections.jar.path
-> /home/jenkins/.m2/repository/commons-collections/commons-collections/3.2.1/commons-collections-3.2.1.jar
Setting project property: maven.dependency.javax.servlet.servlet-api.jar.path -> /home/jenkins/.m2/repository/javax/servlet/servlet-api/2.5/servlet-api-2.5.jar
Setting project property: maven.dependency.org.mortbay.jetty.jetty.jar.path -> /home/jenkins/.m2/repository/org/mortbay/jetty/jetty/6.1.26/jetty-6.1.26.jar
Setting project property: maven.dependency.org.mortbay.jetty.jetty-util.jar.path -> /home/jenkins/.m2/repository/org/mortbay/jetty/jetty-util/6.1.26/jetty-util-6.1.26.jar
Setting project property: maven.dependency.javax.servlet.jsp.jsp-api.jar.path -> /home/jenkins/.m2/repository/javax/servlet/jsp/jsp-api/2.1/jsp-api-2.1.jar
Setting project property: maven.dependency.com.sun.jersey.jersey-core.jar.path -> /home/jenkins/.m2/repository/com/sun/jersey/jersey-core/1.9/jersey-core-1.9.jar
Setting project property: maven.dependency.com.sun.jersey.jersey-json.jar.path -> /home/jenkins/.m2/repository/com/sun/jersey/jersey-json/1.9/jersey-json-1.9.jar
Setting project property: maven.dependency.org.codehaus.jettison.jettison.jar.path -> /home/jenkins/.m2/repository/org/codehaus/jettison/jettison/1.1/jettison-1.1.jar
Setting project property: maven.dependency.com.sun.xml.bind.jaxb-impl.jar.path -> /home/jenkins/.m2/repository/com/sun/xml/bind/jaxb-impl/2.2.3-1/jaxb-impl-2.2.3-1.jar
Setting project property: maven.dependency.javax.xml.bind.jaxb-api.jar.path -> /home/jenkins/.m2/repository/javax/xml/bind/jaxb-api/2.2.2/jaxb-api-2.2.2.jar
Setting project property: maven.dependency.javax.xml.stream.stax-api.jar.path -> /home/jenkins/.m2/repository/javax/xml/stream/stax-api/1.0-2/stax-api-1.0-2.jar
Setting project property: maven.dependency.javax.activation.activation.jar.path -> /home/jenkins/.m2/repository/javax/activation/activation/1.1/activation-1.1.jar
Setting project property: maven.dependency.org.codehaus.jackson.jackson-jaxrs.jar.path ->
/home/jenkins/.m2/repository/org/codehaus/jackson/jackson-jaxrs/1.9.13/jackson-jaxrs-1.9.13.jar
Setting project property: maven.dependency.org.codehaus.jackson.jackson-xc.jar.path ->
/home/jenkins/.m2/repository/org/codehaus/jackson/jackson-xc/1.9.13/jackson-xc-1.9.13.jar
Setting project property: maven.dependency.com.sun.jersey.jersey-server.jar.path -> /home/jenkins/.m2/repository/com/sun/jersey/jersey-server/1.9/jersey-server-1.9.jar
Setting project property: maven.dependency.asm.asm.jar.path -> /home/jenkins/.m2/repository/asm/asm/3.2/asm-3.2.jar
Setting project property: maven.dependency.commons-logging.commons-logging.jar.path ->
/home/jenkins/.m2/repository/commons-logging/commons-logging/1.1.3/commons-logging-1.1.3.jar
Setting project property: maven.dependency.log4j.log4j.jar.path -> /home/jenkins/.m2/repository/log4j/log4j/1.2.17/log4j-1.2.17.jar
Setting project property: maven.dependency.net.java.dev.jets3t.jets3t.jar.path -> /home/jenkins/.m2/repository/net/java/dev/jets3t/jets3t/0.9.0/jets3t-0.9.0.jar
Setting project property: maven.dependency.org.apache.httpcomponents.httpclient.jar.path ->
/home/jenkins/.m2/repository/org/apache/httpcomponents/httpclient/4.2.5/httpclient-4.2.5.jar
Setting project property: maven.dependency.org.apache.httpcomponents.httpcore.jar.path ->
/home/jenkins/.m2/repository/org/apache/httpcomponents/httpcore/4.2.5/httpcore-4.2.5.jar
Setting project property: maven.dependency.com.jamesmurty.utils.java-xmlbuilder.jar.path ->
/home/jenkins/.m2/repository/com/jamesmurty/utils/java-xmlbuilder/0.4/java-xmlbuilder-0.4.jar
Setting project property: maven.dependency.junit.junit.jar.path -> /home/jenkins/.m2/repository/junit/junit/4.11/junit-4.11.jar
Setting project property: maven.dependency.org.hamcrest.hamcrest-core.jar.path -> /home/jenkins/.m2/repository/org/hamcrest/hamcrest-core/1.3/hamcrest-core-1.3.jar
Setting project property: maven.dependency.commons-lang.commons-lang.jar.path -> /home/jenkins/.m2/repository/commons-lang/commons-lang/2.6/commons-lang-2.6.jar
Setting project property: maven.dependency.commons-configuration.commons-configuration.jar.path
-> /home/jenkins/.m2/repository/commons-configuration/commons-configuration/1.6/commons-configuration-1.6.jar
Setting project property: maven.dependency.commons-digester.commons-digester.jar.path ->
/home/jenkins/.m2/repository/commons-digester/commons-digester/1.8/commons-digester-1.8.jar
Setting project property: maven.dependency.commons-beanutils.commons-beanutils.jar.path ->
/home/jenkins/.m2/repository/commons-beanutils/commons-beanutils/1.7.0/commons-beanutils-1.7.0.jar
Setting project property: maven.dependency.commons-beanutils.commons-beanutils-core.jar.path
-> /home/jenkins/.m2/repository/commons-beanutils/commons-beanutils-core/1.8.0/commons-beanutils-core-1.8.0.jar
Setting project property: maven.dependency.org.slf4j.slf4j-api.jar.path -> /home/jenkins/.m2/repository/org/slf4j/slf4j-api/1.7.5/slf4j-api-1.7.5.jar
Setting project property: maven.dependency.org.slf4j.slf4j-log4j12.jar.path -> /home/jenkins/.m2/repository/org/slf4j/slf4j-log4j12/1.7.5/slf4j-log4j12-1.7.5.jar
Setting project property: maven.dependency.org.codehaus.jackson.jackson-core-asl.jar.path
-> /home/jenkins/.m2/repository/org/codehaus/jackson/jackson-core-asl/1.9.13/jackson-core-asl-1.9.13.jar
Setting project property: maven.dependency.org.codehaus.jackson.jackson-mapper-asl.jar.path
-> /home/jenkins/.m2/repository/org/codehaus/jackson/jackson-mapper-asl/1.9.13/jackson-mapper-asl-1.9.13.jar
Setting project property: maven.dependency.org.mockito.mockito-all.jar.path -> /home/jenkins/.m2/repository/org/mockito/mockito-all/1.8.5/mockito-all-1.8.5.jar
Setting project property: maven.dependency.org.apache.avro.avro.jar.path -> /home/jenkins/.m2/repository/org/apache/avro/avro/1.7.4/avro-1.7.4.jar
Setting project property: maven.dependency.com.thoughtworks.paranamer.paranamer.jar.path ->
/home/jenkins/.m2/repository/com/thoughtworks/paranamer/paranamer/2.3/paranamer-2.3.jar
Setting project property: maven.dependency.org.xerial.snappy.snappy-java.jar.path -> /home/jenkins/.m2/repository/org/xerial/snappy/snappy-java/1.0.4.1/snappy-java-1.0.4.1.jar
Setting project property: maven.dependency.org.apache.ant.ant.jar.path -> /home/jenkins/.m2/repository/org/apache/ant/ant/1.8.1/ant-1.8.1.jar
Setting project property: maven.dependency.org.apache.ant.ant-launcher.jar.path -> /home/jenkins/.m2/repository/org/apache/ant/ant-launcher/1.8.1/ant-launcher-1.8.1.jar
Setting project property: maven.dependency.com.google.protobuf.protobuf-java.jar.path ->
/home/jenkins/.m2/repository/com/google/protobuf/protobuf-java/2.5.0/protobuf-java-2.5.0.jar
Setting project property: maven.dependency.com.google.code.gson.gson.jar.path -> /home/jenkins/.m2/repository/com/google/code/gson/gson/2.2.4/gson-2.2.4.jar
Setting project property: maven.dependency.org.apache.hadoop.hadoop-auth.jar.path -> <https://builds.apache.org/job/Hadoop-Common-trunk/ws/trunk/hadoop-common-project/hadoop-auth/target/hadoop-auth-3.0.0-SNAPSHOT.jar>
Setting project property: maven.dependency.org.apache.directory.server.apacheds-kerberos-codec.jar.path
-> /home/jenkins/.m2/repository/org/apache/directory/server/apacheds-kerberos-codec/2.0.0-M15/apacheds-kerberos-codec-2.0.0-M15.jar
Setting project property: maven.dependency.org.apache.directory.server.apacheds-i18n.jar.path
-> /home/jenkins/.m2/repository/org/apache/directory/server/apacheds-i18n/2.0.0-M15/apacheds-i18n-2.0.0-M15.jar
Setting project property: maven.dependency.org.apache.directory.api.api-asn1-api.jar.path
-> /home/jenkins/.m2/repository/org/apache/directory/api/api-asn1-api/1.0.0-M20/api-asn1-api-1.0.0-M20.jar
Setting project property: maven.dependency.org.apache.directory.api.api-util.jar.path ->
/home/jenkins/.m2/repository/org/apache/directory/api/api-util/1.0.0-M20/api-util-1.0.0-M20.jar
Setting project property: maven.dependency.com.jcraft.jsch.jar.path -> /home/jenkins/.m2/repository/com/jcraft/jsch/0.1.42/jsch-0.1.42.jar
Setting project property: maven.dependency.com.google.code.findbugs.jsr305.jar.path ->
/home/jenkins/.m2/repository/com/google/code/findbugs/jsr305/1.3.9/jsr305-1.3.9.jar
Setting project property: maven.dependency.org.apache.zookeeper.zookeeper.jar.path -> /home/jenkins/.m2/repository/org/apache/zookeeper/zookeeper/3.4.6/zookeeper-3.4.6.jar
Setting project property: maven.dependency.io.netty.netty.jar.path -> /home/jenkins/.m2/repository/io/netty/netty/3.6.2.Final/netty-3.6.2.Final.jar
Setting project property: maven.dependency.org.apache.zookeeper.zookeeper.tests.test-jar.path
-> /home/jenkins/.m2/repository/org/apache/zookeeper/zookeeper/3.4.6/zookeeper-3.4.6-tests.jar
Setting project property: maven.dependency.jline.jline.jar.path -> /home/jenkins/.m2/repository/jline/jline/0.9.94/jline-0.9.94.jar
Setting project property: maven.dependency.org.apache.commons.commons-compress.jar.path ->
/home/jenkins/.m2/repository/org/apache/commons/commons-compress/1.4.1/commons-compress-1.4.1.jar
Setting project property: maven.dependency.org.tukaani.xz.jar.path -> /home/jenkins/.m2/repository/org/tukaani/xz/1.0/xz-1.0.jar
[INFO] Executing tasks
Build sequence for target(s) `main' is [main]
Complete build sequence is [main, ]

main:
     [exec] Current OS is Linux
     [exec] Executing 'cmake' with arguments:
     [exec] '<https://builds.apache.org/job/Hadoop-Common-trunk/ws/trunk/hadoop-common-project/hadoop-common/src/'>
     [exec] '-DGENERATED_JAVAH=<https://builds.apache.org/job/Hadoop-Common-trunk/ws/trunk/hadoop-common-project/hadoop-common/target/native/javah'>
     [exec] '-DJVM_ARCH_DATA_MODEL=32'
     [exec] '-DREQUIRE_BZIP2=false'
     [exec] '-DREQUIRE_SNAPPY=false'
     [exec] '-DCUSTOM_SNAPPY_PREFIX='
     [exec] '-DCUSTOM_SNAPPY_LIB='
     [exec] '-DCUSTOM_SNAPPY_INCLUDE='
     [exec] 
     [exec] The ' characters around the executable and arguments are
     [exec] not part of the command.
Execute:Java13CommandLauncher: Executing 'cmake' with arguments:
'<https://builds.apache.org/job/Hadoop-Common-trunk/ws/trunk/hadoop-common-project/hadoop-common/src/'>
'-DGENERATED_JAVAH=<https://builds.apache.org/job/Hadoop-Common-trunk/ws/trunk/hadoop-common-project/hadoop-common/target/native/javah'>
'-DJVM_ARCH_DATA_MODEL=32'
'-DREQUIRE_BZIP2=false'
'-DREQUIRE_SNAPPY=false'
'-DCUSTOM_SNAPPY_PREFIX='
'-DCUSTOM_SNAPPY_LIB='
'-DCUSTOM_SNAPPY_INCLUDE='

The ' characters around the executable and arguments are
not part of the command.
[INFO] ------------------------------------------------------------------------
[INFO] Reactor Summary:
[INFO] 
[INFO] Apache Hadoop Annotations ......................... SUCCESS [ 15.865 s]
[INFO] Apache Hadoop MiniKDC ............................. SUCCESS [ 13.298 s]
[INFO] Apache Hadoop Auth ................................ SUCCESS [01:15 min]
[INFO] Apache Hadoop Auth Examples ....................... SUCCESS [  3.034 s]
[INFO] Apache Hadoop Common .............................. FAILURE [ 16.260 s]
[INFO] Apache Hadoop NFS ................................. SKIPPED
[INFO] Apache Hadoop KMS ................................. SKIPPED
[INFO] Apache Hadoop Common Project ...................... SKIPPED
[INFO] ------------------------------------------------------------------------
[INFO] BUILD FAILURE
[INFO] ------------------------------------------------------------------------
[INFO] Total time: 02:07 min
[INFO] Finished at: 2014-07-07T20:06:40+00:00
[INFO] Final Memory: 71M/770M
[INFO] ------------------------------------------------------------------------
[ERROR] Failed to execute goal org.apache.maven.plugins:maven-antrun-plugin:1.7:run (make)
on project hadoop-common: An Ant BuildException has occured: Execute failed: java.io.IOException:
Cannot run program "cmake" (in directory "<https://builds.apache.org/job/Hadoop-Common-trunk/ws/trunk/hadoop-common-project/hadoop-common/target/native")>:
java.io.IOException: error=2, No such file or directory
[ERROR] around Ant part ...<exec dir="<https://builds.apache.org/job/Hadoop-Common-trunk/ws/trunk/hadoop-common-project/hadoop-common/target/native">
executable="cmake" failonerror="true">... @ 4:167 in <https://builds.apache.org/job/Hadoop-Common-trunk/ws/trunk/hadoop-common-project/hadoop-common/target/antrun/build-main.xml>
[ERROR] -> [Help 1]
org.apache.maven.lifecycle.LifecycleExecutionException: Failed to execute goal org.apache.maven.plugins:maven-antrun-plugin:1.7:run
(make) on project hadoop-common: An Ant BuildException has occured: Execute failed: java.io.IOException:
Cannot run program "cmake" (in directory "<https://builds.apache.org/job/Hadoop-Common-trunk/ws/trunk/hadoop-common-project/hadoop-common/target/native")>:
java.io.IOException: error=2, No such file or directory
around Ant part ...<exec dir="<https://builds.apache.org/job/Hadoop-Common-trunk/ws/trunk/hadoop-common-project/hadoop-common/target/native">
executable="cmake" failonerror="true">... @ 4:167 in <https://builds.apache.org/job/Hadoop-Common-trunk/ws/trunk/hadoop-common-project/hadoop-common/target/antrun/build-main.xml>
	at org.apache.maven.lifecycle.internal.MojoExecutor.execute(MojoExecutor.java:216)
	at org.apache.maven.lifecycle.internal.MojoExecutor.execute(MojoExecutor.java:153)
	at org.apache.maven.lifecycle.internal.MojoExecutor.execute(MojoExecutor.java:145)
	at org.apache.maven.lifecycle.internal.LifecycleModuleBuilder.buildProject(LifecycleModuleBuilder.java:108)
	at org.apache.maven.lifecycle.internal.LifecycleModuleBuilder.buildProject(LifecycleModuleBuilder.java:76)
	at org.apache.maven.lifecycle.internal.builder.singlethreaded.SingleThreadedBuilder.build(SingleThreadedBuilder.java:51)
	at org.apache.maven.lifecycle.internal.LifecycleStarter.execute(LifecycleStarter.java:116)
	at org.apache.maven.DefaultMaven.doExecute(DefaultMaven.java:361)
	at org.apache.maven.DefaultMaven.execute(DefaultMaven.java:155)
	at org.apache.maven.cli.MavenCli.execute(MavenCli.java:584)
	at org.apache.maven.cli.MavenCli.doMain(MavenCli.java:213)
	at org.apache.maven.cli.MavenCli.main(MavenCli.java:157)
	at sun.reflect.NativeMethodAccessorImpl.invoke0(Native Method)
	at sun.reflect.NativeMethodAccessorImpl.invoke(NativeMethodAccessorImpl.java:39)
	at sun.reflect.DelegatingMethodAccessorImpl.invoke(DelegatingMethodAccessorImpl.java:25)
	at java.lang.reflect.Method.invoke(Method.java:597)
	at org.codehaus.plexus.classworlds.launcher.Launcher.launchEnhanced(Launcher.java:289)
	at org.codehaus.plexus.classworlds.launcher.Launcher.launch(Launcher.java:229)
	at org.codehaus.plexus.classworlds.launcher.Launcher.mainWithExitCode(Launcher.java:415)
	at org.codehaus.plexus.classworlds.launcher.Launcher.main(Launcher.java:356)
Caused by: org.apache.maven.plugin.MojoExecutionException: An Ant BuildException has occured:
Execute failed: java.io.IOException: Cannot run program "cmake" (in directory "<https://builds.apache.org/job/Hadoop-Common-trunk/ws/trunk/hadoop-common-project/hadoop-common/target/native")>:
java.io.IOException: error=2, No such file or directory
around Ant part ...<exec dir="<https://builds.apache.org/job/Hadoop-Common-trunk/ws/trunk/hadoop-common-project/hadoop-common/target/native">
executable="cmake" failonerror="true">... @ 4:167 in <https://builds.apache.org/job/Hadoop-Common-trunk/ws/trunk/hadoop-common-project/hadoop-common/target/antrun/build-main.xml>
	at org.apache.maven.plugin.antrun.AntRunMojo.execute(AntRunMojo.java:355)
	at org.apache.maven.plugin.DefaultBuildPluginManager.executeMojo(DefaultBuildPluginManager.java:133)
	at org.apache.maven.lifecycle.internal.MojoExecutor.execute(MojoExecutor.java:208)
	... 19 more
Caused by: <https://builds.apache.org/job/Hadoop-Common-trunk/ws/trunk/hadoop-common-project/hadoop-common/target/antrun/build-main.xml>:4:
Execute failed: java.io.IOException: Cannot run program "cmake" (in directory "<https://builds.apache.org/job/Hadoop-Common-trunk/ws/trunk/hadoop-common-project/hadoop-common/target/native")>:
java.io.IOException: error=2, No such file or directory
	at org.apache.tools.ant.taskdefs.ExecTask.runExec(ExecTask.java:675)
	at org.apache.tools.ant.taskdefs.ExecTask.execute(ExecTask.java:498)
	at org.apache.tools.ant.UnknownElement.execute(UnknownElement.java:291)
	at sun.reflect.GeneratedMethodAccessor98.invoke(Unknown Source)
	at sun.reflect.DelegatingMethodAccessorImpl.invoke(DelegatingMethodAccessorImpl.java:25)
	at java.lang.reflect.Method.invoke(Method.java:597)
	at org.apache.tools.ant.dispatch.DispatchUtils.execute(DispatchUtils.java:106)
	at org.apache.tools.ant.Task.perform(Task.java:348)
	at org.apache.tools.ant.Target.execute(Target.java:390)
	at org.apache.tools.ant.Target.performTasks(Target.java:411)
	at org.apache.tools.ant.Project.executeSortedTargets(Project.java:1399)
	at org.apache.tools.ant.Project.executeTarget(Project.java:1368)
	at org.apache.maven.plugin.antrun.AntRunMojo.execute(AntRunMojo.java:327)
	... 21 more
Caused by: java.io.IOException: Cannot run program "cmake" (in directory "<https://builds.apache.org/job/Hadoop-Common-trunk/ws/trunk/hadoop-common-project/hadoop-common/target/native")>:
java.io.IOException: error=2, No such file or directory
	at java.lang.ProcessBuilder.start(ProcessBuilder.java:460)
	at java.lang.Runtime.exec(Runtime.java:593)
	at org.apache.tools.ant.taskdefs.Execute$Java13CommandLauncher.exec(Execute.java:862)
	at org.apache.tools.ant.taskdefs.Execute.launch(Execute.java:481)
	at org.apache.tools.ant.taskdefs.Execute.execute(Execute.java:495)
	at org.apache.tools.ant.taskdefs.ExecTask.runExecute(ExecTask.java:631)
	at org.apache.tools.ant.taskdefs.ExecTask.runExec(ExecTask.java:672)
	... 33 more
Caused by: java.io.IOException: java.io.IOException: error=2, No such file or directory
	at java.lang.UNIXProcess.<init>(UNIXProcess.java:148)
	at java.lang.ProcessImpl.start(ProcessImpl.java:65)
	at java.lang.ProcessBuilder.start(ProcessBuilder.java:453)
	... 39 more
[ERROR] 
[ERROR] 
[ERROR] For more information about the errors and possible solutions, please read the following
articles:
[ERROR] [Help 1] http://cwiki.apache.org/confluence/display/MAVEN/MojoExecutionException
[ERROR] 
[ERROR] After correcting the problems, you can resume the build with the command
[ERROR]   mvn <goals> -rf :hadoop-common
+ /home/jenkins/tools/maven/latest/bin/mvn -eaf test -Pclover -DcloverLicenseLocation=/home/jenkins/tools/clover/latest/lib/clover.license
Build step 'Execute shell' marked build as failure
Archiving artifacts
Recording test results

Mime
View raw message