hadoop-common-dev mailing list archives

Site index · List index
Message view « Date » · « Thread »
Top « Date » · « Thread »
From Apache Jenkins Server <jenk...@builds.apache.org>
Subject Build failed in Jenkins: Hadoop-Common-0.23-Build #1023
Date Sun, 27 Jul 2014 09:12:01 GMT
See <https://builds.apache.org/job/Hadoop-Common-0.23-Build/1023/>

------------------------------------------
[...truncated 8263 lines...]
Running org.apache.hadoop.fs.TestFileSystemTokens
Tests run: 10, Failures: 0, Errors: 0, Skipped: 0, Time elapsed: 0.504 sec
Running org.apache.hadoop.fs.TestFSMainOperationsLocalFileSystem
Tests run: 49, Failures: 0, Errors: 0, Skipped: 0, Time elapsed: 1.66 sec
Running org.apache.hadoop.fs.TestLocalFSFileContextSymlink
Tests run: 61, Failures: 0, Errors: 0, Skipped: 3, Time elapsed: 2.427 sec
Running org.apache.hadoop.fs.TestHarFileSystem
Tests run: 3, Failures: 0, Errors: 0, Skipped: 0, Time elapsed: 0.305 sec
Running org.apache.hadoop.fs.TestFcLocalFsUtil
Tests run: 2, Failures: 0, Errors: 0, Skipped: 0, Time elapsed: 0.577 sec
Running org.apache.hadoop.fs.TestLocalDirAllocator
Tests run: 30, Failures: 0, Errors: 0, Skipped: 0, Time elapsed: 1.057 sec
Running org.apache.hadoop.fs.TestLocalFileSystemPermission
Tests run: 2, Failures: 0, Errors: 0, Skipped: 0, Time elapsed: 0.528 sec
Running org.apache.hadoop.fs.TestFileSystemCaching
Tests run: 13, Failures: 0, Errors: 0, Skipped: 0, Time elapsed: 0.895 sec
Running org.apache.hadoop.fs.TestLocalFSFileContextCreateMkdir
Tests run: 8, Failures: 0, Errors: 0, Skipped: 0, Time elapsed: 0.951 sec
Running org.apache.hadoop.fs.TestPath
Tests run: 16, Failures: 0, Errors: 0, Skipped: 0, Time elapsed: 0.82 sec
Running org.apache.hadoop.fs.TestListFiles
Tests run: 2, Failures: 0, Errors: 0, Skipped: 0, Time elapsed: 0.675 sec
Running org.apache.hadoop.fs.TestHarFileSystemBasics
Tests run: 9, Failures: 0, Errors: 0, Skipped: 0, Time elapsed: 2.246 sec
Running org.apache.hadoop.fs.TestChecksumFileSystem
Tests run: 9, Failures: 0, Errors: 0, Skipped: 0, Time elapsed: 0.822 sec
Running org.apache.hadoop.fs.TestGetFileBlockLocations
Tests run: 3, Failures: 0, Errors: 0, Skipped: 0, Time elapsed: 0.753 sec
Running org.apache.hadoop.fs.TestFsShellCopy
Tests run: 11, Failures: 0, Errors: 0, Skipped: 0, Time elapsed: 1.238 sec
Running org.apache.hadoop.fs.TestDU
Tests run: 2, Failures: 0, Errors: 0, Skipped: 0, Time elapsed: 5.156 sec
Running org.apache.hadoop.fs.TestAvroFSInput
Tests run: 1, Failures: 0, Errors: 0, Skipped: 0, Time elapsed: 0.478 sec
Running org.apache.hadoop.fs.shell.TestPathExceptions
Tests run: 3, Failures: 0, Errors: 0, Skipped: 0, Time elapsed: 0.091 sec
Running org.apache.hadoop.fs.shell.TestCommandFactory
Tests run: 2, Failures: 0, Errors: 0, Skipped: 0, Time elapsed: 0.183 sec
Running org.apache.hadoop.fs.shell.TestPathData
Tests run: 9, Failures: 0, Errors: 0, Skipped: 0, Time elapsed: 0.768 sec
Running org.apache.hadoop.fs.shell.TestCopy
Tests run: 5, Failures: 0, Errors: 0, Skipped: 0, Time elapsed: 0.775 sec
Running org.apache.hadoop.fs.TestHardLink
Tests run: 6, Failures: 0, Errors: 0, Skipped: 0, Time elapsed: 0.244 sec
Running org.apache.hadoop.fs.TestFilterFileSystem
Tests run: 12, Failures: 0, Errors: 0, Skipped: 0, Time elapsed: 0.617 sec
Running org.apache.hadoop.fs.TestLocalFSFileContextMainOperations
Tests run: 56, Failures: 0, Errors: 0, Skipped: 0, Time elapsed: 2.111 sec
Running org.apache.hadoop.fs.TestTrash
Tests run: 4, Failures: 0, Errors: 0, Skipped: 0, Time elapsed: 21.048 sec
Running org.apache.hadoop.fs.viewfs.TestChRootedFileSystem
Tests run: 12, Failures: 0, Errors: 0, Skipped: 0, Time elapsed: 1.102 sec
Running org.apache.hadoop.fs.viewfs.TestViewFileSystemDelegation
Tests run: 2, Failures: 0, Errors: 0, Skipped: 0, Time elapsed: 0.438 sec
Running org.apache.hadoop.fs.viewfs.TestFcMainOperationsLocalFs
Tests run: 54, Failures: 0, Errors: 0, Skipped: 0, Time elapsed: 2.644 sec
Running org.apache.hadoop.fs.viewfs.TestFcCreateMkdirLocalFs
Tests run: 8, Failures: 0, Errors: 0, Skipped: 0, Time elapsed: 1.093 sec
Running org.apache.hadoop.fs.viewfs.TestViewFileSystemWithAuthorityLocalFileSystem
Tests run: 38, Failures: 0, Errors: 0, Skipped: 0, Time elapsed: 2.106 sec
Running org.apache.hadoop.fs.viewfs.TestChRootedFs
Tests run: 9, Failures: 0, Errors: 0, Skipped: 0, Time elapsed: 1.034 sec
Running org.apache.hadoop.fs.viewfs.TestFSMainOperationsLocalFileSystem
Tests run: 49, Failures: 0, Errors: 0, Skipped: 0, Time elapsed: 2.214 sec
Running org.apache.hadoop.fs.viewfs.TestViewFsTrash
Tests run: 1, Failures: 0, Errors: 0, Skipped: 0, Time elapsed: 0.922 sec
Running org.apache.hadoop.fs.viewfs.TestViewfsFileStatus
Tests run: 2, Failures: 0, Errors: 0, Skipped: 0, Time elapsed: 0.771 sec
Running org.apache.hadoop.fs.viewfs.TestViewFsLocalFs
Tests run: 42, Failures: 0, Errors: 0, Skipped: 0, Time elapsed: 2.617 sec
Running org.apache.hadoop.fs.viewfs.TestViewFsWithAuthorityLocalFs
Tests run: 42, Failures: 0, Errors: 0, Skipped: 0, Time elapsed: 2.651 sec
Running org.apache.hadoop.fs.viewfs.TestViewFsConfig
Tests run: 1, Failures: 0, Errors: 0, Skipped: 0, Time elapsed: 0.412 sec
Running org.apache.hadoop.fs.viewfs.TestFcPermissionsLocalFs
Tests run: 4, Failures: 0, Errors: 0, Skipped: 0, Time elapsed: 0.873 sec
Running org.apache.hadoop.fs.viewfs.TestViewFileSystemLocalFileSystem
Tests run: 38, Failures: 0, Errors: 0, Skipped: 0, Time elapsed: 1.813 sec
Running org.apache.hadoop.fs.TestFileContextResolveAfs
Tests run: 1, Failures: 0, Errors: 0, Skipped: 0, Time elapsed: 0.566 sec
Running org.apache.hadoop.fs.TestFileSystemCanonicalization
Tests run: 16, Failures: 0, Errors: 0, Skipped: 0, Time elapsed: 0.401 sec
Running org.apache.hadoop.fs.TestFileUtil
Tests run: 12, Failures: 0, Errors: 0, Skipped: 0, Time elapsed: 0.664 sec
Running org.apache.hadoop.fs.permission.TestFsPermission
Tests run: 8, Failures: 0, Errors: 0, Skipped: 0, Time elapsed: 0.469 sec
Running org.apache.hadoop.metrics2.lib.TestUniqNames
Tests run: 2, Failures: 0, Errors: 0, Skipped: 0, Time elapsed: 0.087 sec
Running org.apache.hadoop.metrics2.lib.TestMetricsAnnotations
Tests run: 9, Failures: 0, Errors: 0, Skipped: 0, Time elapsed: 0.452 sec
Running org.apache.hadoop.metrics2.lib.TestMetricsRegistry
Tests run: 2, Failures: 0, Errors: 0, Skipped: 0, Time elapsed: 0.362 sec
Running org.apache.hadoop.metrics2.lib.TestMutableMetrics
Tests run: 2, Failures: 0, Errors: 0, Skipped: 0, Time elapsed: 0.393 sec
Running org.apache.hadoop.metrics2.lib.TestInterns
Tests run: 4, Failures: 0, Errors: 0, Skipped: 0, Time elapsed: 0.219 sec
Running org.apache.hadoop.metrics2.util.TestSampleStat
Tests run: 1, Failures: 0, Errors: 0, Skipped: 0, Time elapsed: 0.076 sec
Running org.apache.hadoop.metrics2.util.TestMetricsCache
Tests run: 4, Failures: 0, Errors: 0, Skipped: 0, Time elapsed: 1.975 sec
Running org.apache.hadoop.metrics2.impl.TestSinkQueue
Tests run: 8, Failures: 0, Errors: 0, Skipped: 0, Time elapsed: 0.462 sec
Running org.apache.hadoop.metrics2.impl.TestGangliaMetrics
Tests run: 2, Failures: 0, Errors: 0, Skipped: 0, Time elapsed: 0.596 sec
Running org.apache.hadoop.metrics2.impl.TestMetricsCollectorImpl
Tests run: 2, Failures: 0, Errors: 0, Skipped: 0, Time elapsed: 0.224 sec
Running org.apache.hadoop.metrics2.impl.TestMetricsSystemImpl
Tests run: 3, Failures: 0, Errors: 0, Skipped: 0, Time elapsed: 0.713 sec
Running org.apache.hadoop.metrics2.impl.TestMetricsConfig
Tests run: 3, Failures: 0, Errors: 0, Skipped: 0, Time elapsed: 0.28 sec
Running org.apache.hadoop.metrics2.impl.TestMetricsVisitor
Tests run: 1, Failures: 0, Errors: 0, Skipped: 0, Time elapsed: 0.361 sec
Running org.apache.hadoop.metrics2.source.TestJvmMetrics
Tests run: 1, Failures: 0, Errors: 0, Skipped: 0, Time elapsed: 0.369 sec
Running org.apache.hadoop.metrics2.filter.TestPatternFilter
Tests run: 5, Failures: 0, Errors: 0, Skipped: 0, Time elapsed: 0.252 sec
Running org.apache.hadoop.log.TestLogLevel
Tests run: 1, Failures: 0, Errors: 0, Skipped: 0, Time elapsed: 0.604 sec
Running org.apache.hadoop.log.TestLog4Json
Tests run: 5, Failures: 0, Errors: 0, Skipped: 0, Time elapsed: 0.366 sec
Running org.apache.hadoop.jmx.TestJMXJsonServlet
Tests run: 1, Failures: 0, Errors: 0, Skipped: 0, Time elapsed: 1.017 sec
Running org.apache.hadoop.ipc.TestIPCServerResponder
Tests run: 2, Failures: 0, Errors: 0, Skipped: 0, Time elapsed: 5.554 sec
Running org.apache.hadoop.ipc.TestSocketFactory
Tests run: 1, Failures: 0, Errors: 0, Skipped: 0, Time elapsed: 0.27 sec
Running org.apache.hadoop.ipc.TestRPCCompatibility
Tests run: 6, Failures: 0, Errors: 0, Skipped: 0, Time elapsed: 1.07 sec
Running org.apache.hadoop.ipc.TestMiniRPCBenchmark
Tests run: 1, Failures: 0, Errors: 0, Skipped: 0, Time elapsed: 0.875 sec
Running org.apache.hadoop.ipc.TestIPC
Tests run: 20, Failures: 0, Errors: 0, Skipped: 0, Time elapsed: 71.855 sec
Running org.apache.hadoop.ipc.TestServer
Tests run: 5, Failures: 0, Errors: 0, Skipped: 0, Time elapsed: 0.348 sec
Running org.apache.hadoop.ipc.TestRPC
Tests run: 10, Failures: 0, Errors: 0, Skipped: 0, Time elapsed: 26.991 sec
Running org.apache.hadoop.ipc.TestAvroRpc
Tests run: 4, Failures: 0, Errors: 0, Skipped: 0, Time elapsed: 1.641 sec
Running org.apache.hadoop.ipc.TestSaslRPC
Tests run: 10, Failures: 0, Errors: 0, Skipped: 0, Time elapsed: 2.053 sec
Running org.apache.hadoop.security.token.delegation.TestDelegationToken
Tests run: 11, Failures: 0, Errors: 0, Skipped: 0, Time elapsed: 29.963 sec
Running org.apache.hadoop.security.token.TestToken
Tests run: 2, Failures: 0, Errors: 0, Skipped: 0, Time elapsed: 0.15 sec
Running org.apache.hadoop.security.TestAuthenticationFilter
Tests run: 1, Failures: 0, Errors: 0, Skipped: 0, Time elapsed: 0.389 sec
Running org.apache.hadoop.security.TestGroupFallback
Tests run: 4, Failures: 0, Errors: 0, Skipped: 0, Time elapsed: 0.419 sec
Running org.apache.hadoop.security.TestProxyUserFromEnv
Tests run: 1, Failures: 0, Errors: 0, Skipped: 0, Time elapsed: 0.381 sec
Running org.apache.hadoop.security.TestDoAsEffectiveUser
Tests run: 9, Failures: 0, Errors: 0, Skipped: 0, Time elapsed: 1.903 sec
Running org.apache.hadoop.security.TestJNIGroupsMapping
Tests run: 1, Failures: 0, Errors: 0, Skipped: 1, Time elapsed: 0.139 sec
Running org.apache.hadoop.security.TestGroupsCaching
Tests run: 1, Failures: 0, Errors: 0, Skipped: 0, Time elapsed: 0.255 sec
Running org.apache.hadoop.security.TestUserFromEnv
Tests run: 1, Failures: 0, Errors: 0, Skipped: 0, Time elapsed: 0.331 sec
Running org.apache.hadoop.security.TestCredentials
Tests run: 4, Failures: 0, Errors: 0, Skipped: 0, Time elapsed: 0.691 sec
Running org.apache.hadoop.security.authorize.TestAccessControlList
Tests run: 8, Failures: 0, Errors: 0, Skipped: 0, Time elapsed: 0.445 sec
Running org.apache.hadoop.security.authorize.TestProxyUsers
Tests run: 3, Failures: 0, Errors: 0, Skipped: 0, Time elapsed: 0.481 sec
Running org.apache.hadoop.security.TestSecurityUtil
Tests run: 15, Failures: 0, Errors: 0, Skipped: 0, Time elapsed: 0.848 sec
Running org.apache.hadoop.security.TestUserGroupInformation
Tests run: 19, Failures: 0, Errors: 0, Skipped: 0, Time elapsed: 0.687 sec
Running org.apache.hadoop.http.lib.TestStaticUserWebFilter
Tests run: 3, Failures: 0, Errors: 0, Skipped: 0, Time elapsed: 0.515 sec
Running org.apache.hadoop.http.TestServletFilter
Tests run: 2, Failures: 0, Errors: 0, Skipped: 0, Time elapsed: 1.074 sec
Running org.apache.hadoop.http.TestHttpRequestLogAppender
Tests run: 1, Failures: 0, Errors: 0, Skipped: 0, Time elapsed: 0.091 sec
Running org.apache.hadoop.http.TestHtmlQuoting
Tests run: 4, Failures: 0, Errors: 0, Skipped: 0, Time elapsed: 0.273 sec
Running org.apache.hadoop.http.TestPathFilter
Tests run: 1, Failures: 0, Errors: 0, Skipped: 0, Time elapsed: 0.773 sec
Running org.apache.hadoop.http.TestGlobalFilter
Tests run: 1, Failures: 0, Errors: 0, Skipped: 0, Time elapsed: 0.756 sec
Running org.apache.hadoop.http.TestHttpServerLifecycle
Tests run: 6, Failures: 0, Errors: 0, Skipped: 0, Time elapsed: 1.203 sec
Running org.apache.hadoop.http.TestHttpRequestLog
Tests run: 2, Failures: 0, Errors: 0, Skipped: 0, Time elapsed: 0.156 sec
Running org.apache.hadoop.http.TestHttpServerWebapps
Tests run: 2, Failures: 0, Errors: 0, Skipped: 0, Time elapsed: 0.426 sec
Running org.apache.hadoop.http.TestHttpServer
Tests run: 11, Failures: 0, Errors: 0, Skipped: 0, Time elapsed: 3.571 sec
Running org.apache.hadoop.metrics.spi.TestOutputRecord
Tests run: 1, Failures: 0, Errors: 0, Skipped: 0, Time elapsed: 0.045 sec
Running org.apache.hadoop.metrics.ganglia.TestGangliaContext
Tests run: 1, Failures: 0, Errors: 0, Skipped: 0, Time elapsed: 0.158 sec
Running org.apache.hadoop.metrics.TestMetricsServlet
Tests run: 3, Failures: 0, Errors: 0, Skipped: 0, Time elapsed: 0.086 sec
Running org.apache.hadoop.net.TestSocketIOWithTimeout
Tests run: 1, Failures: 0, Errors: 0, Skipped: 0, Time elapsed: 5.185 sec
Running org.apache.hadoop.net.TestSwitchMapping
Tests run: 5, Failures: 0, Errors: 0, Skipped: 0, Time elapsed: 0.324 sec
Running org.apache.hadoop.net.TestStaticMapping
Tests run: 8, Failures: 0, Errors: 0, Skipped: 0, Time elapsed: 0.973 sec
Running org.apache.hadoop.net.TestNetUtils
Tests run: 36, Failures: 0, Errors: 0, Skipped: 0, Time elapsed: 3.756 sec
Running org.apache.hadoop.net.TestDNS
Tests run: 7, Failures: 0, Errors: 0, Skipped: 0, Time elapsed: 0.291 sec
Running org.apache.hadoop.net.TestScriptBasedMapping
Tests run: 4, Failures: 0, Errors: 0, Skipped: 0, Time elapsed: 0.656 sec
Running org.apache.hadoop.cli.TestCLI
Tests run: 1, Failures: 0, Errors: 0, Skipped: 0, Time elapsed: 0.978 sec

Results :

Failed tests:   testSnappyCodec(org.apache.hadoop.io.compress.TestCodec): Snappy native available
but Hadoop native not

Tests run: 1640, Failures: 1, Errors: 0, Skipped: 34

[INFO] ------------------------------------------------------------------------
[INFO] Reactor Summary:
[INFO] 
[INFO] Apache Hadoop Annotations ......................... SUCCESS [  6.299 s]
[INFO] Apache Hadoop Auth ................................ SUCCESS [  9.908 s]
[INFO] Apache Hadoop Auth Examples ....................... SUCCESS [  1.497 s]
[INFO] Apache Hadoop Common .............................. FAILURE [08:23 min]
[INFO] Apache Hadoop Common Project ...................... SKIPPED
[INFO] ------------------------------------------------------------------------
[INFO] BUILD FAILURE
[INFO] ------------------------------------------------------------------------
[INFO] Total time: 08:41 min
[INFO] Finished at: 2014-07-27T09:10:52+00:00
[INFO] Final Memory: 33M/976M
[INFO] ------------------------------------------------------------------------
[ERROR] Failed to execute goal org.apache.maven.plugins:maven-surefire-plugin:2.12.3:test
(default-test) on project hadoop-common: There are test failures.
[ERROR] 
[ERROR] Please refer to <https://builds.apache.org/job/Hadoop-Common-0.23-Build/ws/trunk/hadoop-common-project/hadoop-common/target/surefire-reports>
for the individual test results.
[ERROR] -> [Help 1]
[ERROR] 
[ERROR] To see the full stack trace of the errors, re-run Maven with the -e switch.
[ERROR] Re-run Maven using the -X switch to enable full debug logging.
[ERROR] 
[ERROR] For more information about the errors and possible solutions, please read the following
articles:
[ERROR] [Help 1] http://cwiki.apache.org/confluence/display/MAVEN/MojoFailureException
[ERROR] 
[ERROR] After correcting the problems, you can resume the build with the command
[ERROR]   mvn <goals> -rf :hadoop-common
Build step 'Execute shell' marked build as failure
[WARNINGS] Skipping publisher since build result is FAILURE
Archiving artifacts
Recording fingerprints
Publishing Javadoc
Recording test results

Mime
View raw message