hadoop-common-dev mailing list archives

Site index · List index
Message view « Date » · « Thread »
Top « Date » · « Thread »
From Apache Jenkins Server <jenk...@builds.apache.org>
Subject Build failed in Jenkins: Hadoop-Common-0.23-Build #1018
Date Tue, 22 Jul 2014 09:30:22 GMT
See <https://builds.apache.org/job/Hadoop-Common-0.23-Build/1018/>

------------------------------------------
[...truncated 8722 lines...]
Running org.apache.hadoop.fs.TestFileStatus
Tests run: 10, Failures: 0, Errors: 0, Skipped: 0, Time elapsed: 0.196 sec
Running org.apache.hadoop.fs.TestChecksumFileSystem
Tests run: 9, Failures: 0, Errors: 0, Skipped: 0, Time elapsed: 0.834 sec
Running org.apache.hadoop.fs.shell.TestPathExceptions
Tests run: 3, Failures: 0, Errors: 0, Skipped: 0, Time elapsed: 0.091 sec
Running org.apache.hadoop.fs.shell.TestCommandFactory
Tests run: 2, Failures: 0, Errors: 0, Skipped: 0, Time elapsed: 0.177 sec
Running org.apache.hadoop.fs.shell.TestPathData
Tests run: 9, Failures: 0, Errors: 0, Skipped: 0, Time elapsed: 0.777 sec
Running org.apache.hadoop.fs.shell.TestCopy
Tests run: 5, Failures: 0, Errors: 0, Skipped: 0, Time elapsed: 0.741 sec
Running org.apache.hadoop.fs.TestLocalFileSystem
Tests run: 10, Failures: 0, Errors: 0, Skipped: 0, Time elapsed: 0.972 sec
Running org.apache.hadoop.fs.TestFileContextDeleteOnExit
Tests run: 1, Failures: 0, Errors: 0, Skipped: 0, Time elapsed: 0.533 sec
Running org.apache.hadoop.fs.TestPath
Tests run: 16, Failures: 0, Errors: 0, Skipped: 0, Time elapsed: 0.793 sec
Running org.apache.hadoop.fs.TestLocalDirAllocator
Tests run: 30, Failures: 0, Errors: 0, Skipped: 0, Time elapsed: 6.098 sec
Running org.apache.hadoop.fs.TestFileSystemTokens
Tests run: 10, Failures: 0, Errors: 0, Skipped: 0, Time elapsed: 0.493 sec
Running org.apache.hadoop.fs.TestFileSystemCaching
Tests run: 13, Failures: 0, Errors: 0, Skipped: 0, Time elapsed: 0.873 sec
Running org.apache.hadoop.fs.TestFsShellCopy
Tests run: 11, Failures: 0, Errors: 0, Skipped: 0, Time elapsed: 1.371 sec
Running org.apache.hadoop.fs.TestListFiles
Tests run: 2, Failures: 0, Errors: 0, Skipped: 0, Time elapsed: 0.546 sec
Running org.apache.hadoop.fs.TestHardLink
Tests run: 6, Failures: 0, Errors: 0, Skipped: 0, Time elapsed: 0.259 sec
Running org.apache.hadoop.fs.TestLocalFSFileContextMainOperations
Tests run: 56, Failures: 0, Errors: 0, Skipped: 0, Time elapsed: 2.286 sec
Running org.apache.hadoop.fs.TestLocal_S3FileContextURI
Tests run: 17, Failures: 0, Errors: 0, Skipped: 0, Time elapsed: 1.368 sec
Running org.apache.hadoop.fs.TestFsShellReturnCode
Tests run: 8, Failures: 0, Errors: 0, Skipped: 0, Time elapsed: 2.619 sec
Running org.apache.hadoop.fs.TestS3_LocalFileContextURI
Tests run: 17, Failures: 0, Errors: 0, Skipped: 0, Time elapsed: 1.339 sec
Running org.apache.hadoop.fs.TestFileUtil
Tests run: 12, Failures: 0, Errors: 0, Skipped: 0, Time elapsed: 0.69 sec
Running org.apache.hadoop.fs.s3native.TestInMemoryNativeS3FileSystemContract
Tests run: 36, Failures: 0, Errors: 0, Skipped: 0, Time elapsed: 9.177 sec
Running org.apache.hadoop.fs.TestLocalFSFileContextSymlink
Tests run: 61, Failures: 0, Errors: 0, Skipped: 3, Time elapsed: 2.723 sec
Running org.apache.hadoop.fs.TestFsShell
Tests run: 1, Failures: 0, Errors: 0, Skipped: 0, Time elapsed: 0.282 sec
Running org.apache.hadoop.fs.TestBlockLocation
Tests run: 1, Failures: 0, Errors: 0, Skipped: 0, Time elapsed: 0.054 sec
Running org.apache.hadoop.fs.TestTruncatedInputBug
Tests run: 1, Failures: 0, Errors: 0, Skipped: 0, Time elapsed: 0.459 sec
Running org.apache.hadoop.fs.TestCommandFormat
Tests run: 10, Failures: 0, Errors: 0, Skipped: 0, Time elapsed: 0.112 sec
Running org.apache.hadoop.fs.TestLocalFSFileContextCreateMkdir
Tests run: 8, Failures: 0, Errors: 0, Skipped: 0, Time elapsed: 0.785 sec
Running org.apache.hadoop.fs.TestFSMainOperationsLocalFileSystem
Tests run: 49, Failures: 0, Errors: 0, Skipped: 0, Time elapsed: 1.67 sec
Running org.apache.hadoop.fs.s3.TestINode
Tests run: 3, Failures: 0, Errors: 0, Skipped: 0, Time elapsed: 0.051 sec
Running org.apache.hadoop.fs.s3.TestS3Credentials
Tests run: 1, Failures: 0, Errors: 0, Skipped: 0, Time elapsed: 0.128 sec
Running org.apache.hadoop.fs.s3.TestS3FileSystem
Tests run: 1, Failures: 0, Errors: 0, Skipped: 0, Time elapsed: 0.156 sec
Running org.apache.hadoop.fs.s3.TestInMemoryS3FileSystemContract
Tests run: 29, Failures: 0, Errors: 0, Skipped: 0, Time elapsed: 18.994 sec
Running org.apache.hadoop.fs.TestHarFileSystem
Tests run: 3, Failures: 0, Errors: 0, Skipped: 0, Time elapsed: 0.303 sec
Running org.apache.hadoop.fs.kfs.TestKosmosFileSystem
Tests run: 3, Failures: 0, Errors: 0, Skipped: 0, Time elapsed: 0.585 sec
Running org.apache.hadoop.fs.TestAfsCheckPath
Tests run: 4, Failures: 0, Errors: 0, Skipped: 0, Time elapsed: 0.168 sec
Running org.apache.hadoop.fs.TestDU
Tests run: 2, Failures: 0, Errors: 0, Skipped: 0, Time elapsed: 5.162 sec
Running org.apache.hadoop.fs.TestAvroFSInput
Tests run: 1, Failures: 0, Errors: 0, Skipped: 0, Time elapsed: 0.491 sec
Running org.apache.hadoop.fs.TestFilterFileSystem
Tests run: 12, Failures: 0, Errors: 0, Skipped: 0, Time elapsed: 0.586 sec
Running org.apache.hadoop.fs.TestHarFileSystemBasics
Tests run: 9, Failures: 0, Errors: 0, Skipped: 0, Time elapsed: 2.302 sec
Running org.apache.hadoop.fs.TestFileSystemCanonicalization
Tests run: 16, Failures: 0, Errors: 0, Skipped: 0, Time elapsed: 0.388 sec
Running org.apache.hadoop.fs.TestGetFileBlockLocations
Tests run: 3, Failures: 0, Errors: 0, Skipped: 0, Time elapsed: 0.741 sec
Running org.apache.hadoop.fs.viewfs.TestViewFileSystemWithAuthorityLocalFileSystem
Tests run: 38, Failures: 0, Errors: 0, Skipped: 0, Time elapsed: 38.158 sec
Running org.apache.hadoop.fs.viewfs.TestFcCreateMkdirLocalFs
Tests run: 8, Failures: 0, Errors: 0, Skipped: 0, Time elapsed: 1.064 sec
Running org.apache.hadoop.fs.viewfs.TestChRootedFileSystem
Tests run: 12, Failures: 0, Errors: 0, Skipped: 0, Time elapsed: 1.114 sec
Running org.apache.hadoop.fs.viewfs.TestViewFileSystemDelegation
Tests run: 2, Failures: 0, Errors: 0, Skipped: 0, Time elapsed: 0.436 sec
Running org.apache.hadoop.fs.viewfs.TestChRootedFs
Tests run: 9, Failures: 0, Errors: 0, Skipped: 0, Time elapsed: 1.045 sec
Running org.apache.hadoop.fs.viewfs.TestViewFileSystemLocalFileSystem
Tests run: 38, Failures: 0, Errors: 0, Skipped: 0, Time elapsed: 1.806 sec
Running org.apache.hadoop.fs.viewfs.TestFcMainOperationsLocalFs
Tests run: 54, Failures: 0, Errors: 0, Skipped: 0, Time elapsed: 2.756 sec
Running org.apache.hadoop.fs.viewfs.TestViewFsWithAuthorityLocalFs
Tests run: 42, Failures: 0, Errors: 0, Skipped: 0, Time elapsed: 2.98 sec
Running org.apache.hadoop.fs.viewfs.TestViewFsTrash
Tests run: 1, Failures: 0, Errors: 0, Skipped: 0, Time elapsed: 0.977 sec
Running org.apache.hadoop.fs.viewfs.TestFSMainOperationsLocalFileSystem
Tests run: 49, Failures: 0, Errors: 0, Skipped: 0, Time elapsed: 2.353 sec
Running org.apache.hadoop.fs.viewfs.TestFcPermissionsLocalFs
Tests run: 4, Failures: 0, Errors: 0, Skipped: 0, Time elapsed: 0.891 sec
Running org.apache.hadoop.fs.viewfs.TestViewfsFileStatus
Tests run: 2, Failures: 0, Errors: 0, Skipped: 0, Time elapsed: 0.763 sec
Running org.apache.hadoop.fs.viewfs.TestViewFsConfig
Tests run: 1, Failures: 0, Errors: 0, Skipped: 0, Time elapsed: 0.397 sec
Running org.apache.hadoop.fs.viewfs.TestViewFsLocalFs
Tests run: 42, Failures: 0, Errors: 0, Skipped: 0, Time elapsed: 2.864 sec
Running org.apache.hadoop.fs.TestFileContextResolveAfs
Tests run: 1, Failures: 0, Errors: 0, Skipped: 0, Time elapsed: 0.532 sec
Running org.apache.hadoop.fs.TestFilterFs
Tests run: 1, Failures: 0, Errors: 0, Skipped: 0, Time elapsed: 0.161 sec
Running org.apache.hadoop.jmx.TestJMXJsonServlet
Tests run: 1, Failures: 0, Errors: 0, Skipped: 0, Time elapsed: 27.074 sec
Running org.apache.hadoop.conf.TestConfiguration
Tests run: 37, Failures: 0, Errors: 0, Skipped: 0, Time elapsed: 29.029 sec
Running org.apache.hadoop.conf.TestConfigurationDeprecation
Tests run: 6, Failures: 0, Errors: 0, Skipped: 0, Time elapsed: 0.436 sec
Running org.apache.hadoop.conf.TestConfServlet
Tests run: 3, Failures: 0, Errors: 0, Skipped: 0, Time elapsed: 0.407 sec
Running org.apache.hadoop.conf.TestConfigurationSubclass
Tests run: 3, Failures: 0, Errors: 0, Skipped: 0, Time elapsed: 0.302 sec
Running org.apache.hadoop.conf.TestGetInstances
Tests run: 1, Failures: 0, Errors: 0, Skipped: 0, Time elapsed: 0.245 sec
Running org.apache.hadoop.conf.TestReconfiguration
Tests run: 3, Failures: 0, Errors: 0, Skipped: 0, Time elapsed: 0.986 sec
Running org.apache.hadoop.conf.TestDeprecatedKeys
Tests run: 3, Failures: 0, Errors: 0, Skipped: 0, Time elapsed: 0.354 sec
Running org.apache.hadoop.log.TestLogLevel
Tests run: 1, Failures: 0, Errors: 0, Skipped: 0, Time elapsed: 0.599 sec
Running org.apache.hadoop.log.TestLog4Json
Tests run: 5, Failures: 0, Errors: 0, Skipped: 0, Time elapsed: 0.363 sec
Running org.apache.hadoop.cli.TestCLI
Tests run: 1, Failures: 0, Errors: 0, Skipped: 0, Time elapsed: 0.937 sec
Running org.apache.hadoop.util.TestHostsFileReader
Tests run: 5, Failures: 0, Errors: 0, Skipped: 0, Time elapsed: 0.19 sec
Running org.apache.hadoop.util.TestPureJavaCrc32
Tests run: 1, Failures: 0, Errors: 0, Skipped: 0, Time elapsed: 1.306 sec
Running org.apache.hadoop.util.TestProtoUtil
Tests run: 1, Failures: 0, Errors: 0, Skipped: 0, Time elapsed: 0.078 sec
Running org.apache.hadoop.util.TestStringUtils
Tests run: 9, Failures: 0, Errors: 0, Skipped: 0, Time elapsed: 0.136 sec
Running org.apache.hadoop.util.TestStringInterner
Tests run: 3, Failures: 0, Errors: 0, Skipped: 0, Time elapsed: 0.114 sec
Running org.apache.hadoop.util.TestRunJar
Tests run: 2, Failures: 0, Errors: 0, Skipped: 0, Time elapsed: 0.127 sec
Running org.apache.hadoop.util.TestReflectionUtils
Tests run: 4, Failures: 0, Errors: 0, Skipped: 0, Time elapsed: 0.504 sec
Running org.apache.hadoop.util.TestIndexedSort
Tests run: 2, Failures: 0, Errors: 0, Skipped: 0, Time elapsed: 1.581 sec
Running org.apache.hadoop.util.TestAsyncDiskService
Tests run: 1, Failures: 0, Errors: 0, Skipped: 0, Time elapsed: 0.125 sec
Running org.apache.hadoop.util.TestShutdownHookManager
Tests run: 1, Failures: 0, Errors: 0, Skipped: 0, Time elapsed: 0.144 sec
Running org.apache.hadoop.util.TestDataChecksum
Tests run: 3, Failures: 0, Errors: 0, Skipped: 0, Time elapsed: 0.187 sec
Running org.apache.hadoop.util.TestOptions
Tests run: 2, Failures: 0, Errors: 0, Skipped: 0, Time elapsed: 0.08 sec
Running org.apache.hadoop.util.TestShell
Tests run: 4, Failures: 0, Errors: 0, Skipped: 0, Time elapsed: 5.203 sec
Running org.apache.hadoop.util.TestGenericsUtil
Tests run: 6, Failures: 0, Errors: 0, Skipped: 0, Time elapsed: 0.26 sec
Running org.apache.hadoop.util.TestDiskChecker
Tests run: 9, Failures: 0, Errors: 0, Skipped: 0, Time elapsed: 0.49 sec
Running org.apache.hadoop.util.TestJarFinder
Tests run: 1, Failures: 0, Errors: 0, Skipped: 0, Time elapsed: 8.847 sec
Running org.apache.hadoop.util.TestGenericOptionsParser
Tests run: 4, Failures: 0, Errors: 0, Skipped: 0, Time elapsed: 0.691 sec
Running org.apache.hadoop.record.TestBuffer
Tests run: 6, Failures: 0, Errors: 0, Skipped: 0, Time elapsed: 0.054 sec
Running org.apache.hadoop.record.TestRecordVersioning
Tests run: 2, Failures: 0, Errors: 0, Skipped: 0, Time elapsed: 5.239 sec
Running org.apache.hadoop.record.TestRecordIO
Tests run: 5, Failures: 0, Errors: 0, Skipped: 0, Time elapsed: 5.255 sec
Running org.apache.hadoop.http.TestGlobalFilter
Tests run: 1, Failures: 0, Errors: 0, Skipped: 0, Time elapsed: 0.767 sec
Running org.apache.hadoop.http.TestPathFilter
Tests run: 1, Failures: 0, Errors: 0, Skipped: 0, Time elapsed: 0.741 sec
Running org.apache.hadoop.http.TestServletFilter
Tests run: 2, Failures: 0, Errors: 0, Skipped: 0, Time elapsed: 1.023 sec
Running org.apache.hadoop.http.TestHttpRequestLogAppender
Tests run: 1, Failures: 0, Errors: 0, Skipped: 0, Time elapsed: 0.081 sec
Running org.apache.hadoop.http.TestHttpServerLifecycle
Tests run: 6, Failures: 0, Errors: 0, Skipped: 0, Time elapsed: 1.206 sec
Running org.apache.hadoop.http.lib.TestStaticUserWebFilter
Tests run: 3, Failures: 0, Errors: 0, Skipped: 0, Time elapsed: 0.51 sec
Running org.apache.hadoop.http.TestHttpRequestLog
Tests run: 2, Failures: 0, Errors: 0, Skipped: 0, Time elapsed: 0.152 sec
Running org.apache.hadoop.http.TestHtmlQuoting
Tests run: 4, Failures: 0, Errors: 0, Skipped: 0, Time elapsed: 0.272 sec
Running org.apache.hadoop.http.TestHttpServerWebapps
Tests run: 2, Failures: 0, Errors: 0, Skipped: 0, Time elapsed: 0.424 sec
Running org.apache.hadoop.http.TestHttpServer
Tests run: 11, Failures: 0, Errors: 0, Skipped: 0, Time elapsed: 3.571 sec

Results :

Failed tests:   testSnappyCodec(org.apache.hadoop.io.compress.TestCodec): Snappy native available
but Hadoop native not
  testRealUserIPAuthorizationFailure(org.apache.hadoop.security.TestDoAsEffectiveUser): The
RPC must have failed proxyUser (auth:PROXY) via realUser1@HADOOP.APACHE.ORG (auth:SIMPLE)
  testRealUserIPNotSpecified(org.apache.hadoop.security.TestDoAsEffectiveUser): The RPC must
have failed proxyUser (auth:PROXY) via realUser1@HADOOP.APACHE.ORG (auth:SIMPLE)
  testRealUserGroupNotSpecified(org.apache.hadoop.security.TestDoAsEffectiveUser): The RPC
must have failed proxyUser (auth:PROXY) via realUser1@HADOOP.APACHE.ORG (auth:SIMPLE)
  testRealUserGroupAuthorizationFailure(org.apache.hadoop.security.TestDoAsEffectiveUser):
The RPC must have failed proxyUser (auth:PROXY) via realUser1@HADOOP.APACHE.ORG (auth:SIMPLE)

Tests in error: 
  testConnectionIdleTimeouts(org.apache.hadoop.ipc.TestIPC): test timed out after 30000 milliseconds
  testIpcWithReaderQueuing(org.apache.hadoop.ipc.TestIPC): test timed out after 60000 milliseconds
  testSocketReadTimeoutWithChannel(org.apache.hadoop.net.TestNetUtils): asf905.gq1.ygridcore.net:
asf905.gq1.ygridcore.net
  testSocketReadTimeoutWithoutChannel(org.apache.hadoop.net.TestNetUtils): asf905.gq1.ygridcore.net:
asf905.gq1.ygridcore.net
  testRealUserSetup(org.apache.hadoop.security.TestDoAsEffectiveUser): test timed out after
4000 milliseconds
  testRealUserAuthorizationSuccess(org.apache.hadoop.security.TestDoAsEffectiveUser): test
timed out after 4000 milliseconds

Tests run: 1640, Failures: 5, Errors: 6, Skipped: 34

[INFO] ------------------------------------------------------------------------
[INFO] Reactor Summary:
[INFO] 
[INFO] Apache Hadoop Annotations ......................... SUCCESS [  6.076 s]
[INFO] Apache Hadoop Auth ................................ SUCCESS [  9.096 s]
[INFO] Apache Hadoop Auth Examples ....................... SUCCESS [  1.495 s]
[INFO] Apache Hadoop Common .............................. FAILURE [26:53 min]
[INFO] Apache Hadoop Common Project ...................... SKIPPED
[INFO] ------------------------------------------------------------------------
[INFO] BUILD FAILURE
[INFO] ------------------------------------------------------------------------
[INFO] Total time: 27:10 min
[INFO] Finished at: 2014-07-22T09:28:40+00:00
[INFO] Final Memory: 32M/959M
[INFO] ------------------------------------------------------------------------
[ERROR] Failed to execute goal org.apache.maven.plugins:maven-surefire-plugin:2.12.3:test
(default-test) on project hadoop-common: There are test failures.
[ERROR] 
[ERROR] Please refer to <https://builds.apache.org/job/Hadoop-Common-0.23-Build/ws/trunk/hadoop-common-project/hadoop-common/target/surefire-reports>
for the individual test results.
[ERROR] -> [Help 1]
[ERROR] 
[ERROR] To see the full stack trace of the errors, re-run Maven with the -e switch.
[ERROR] Re-run Maven using the -X switch to enable full debug logging.
[ERROR] 
[ERROR] For more information about the errors and possible solutions, please read the following
articles:
[ERROR] [Help 1] http://cwiki.apache.org/confluence/display/MAVEN/MojoFailureException
[ERROR] 
[ERROR] After correcting the problems, you can resume the build with the command
[ERROR]   mvn <goals> -rf :hadoop-common
Build step 'Execute shell' marked build as failure
[WARNINGS] Skipping publisher since build result is FAILURE
Archiving artifacts
Recording fingerprints
Publishing Javadoc
Recording test results

Mime
View raw message