hadoop-common-dev mailing list archives

Site index · List index
Message view « Date » · « Thread »
Top « Date » · « Thread »
From Apache Jenkins Server <jenk...@builds.apache.org>
Subject Build failed in Jenkins: Hadoop-Common-0.23-Build #846
Date Tue, 07 Jan 2014 09:02:27 GMT
See <https://builds.apache.org/job/Hadoop-Common-0.23-Build/846/>

------------------------------------------
[...truncated 10424 lines...]
11190/11447 KB   
11194/11447 KB   
11198/11447 KB   
11202/11447 KB   
11206/11447 KB   
11210/11447 KB   
11214/11447 KB   
11218/11447 KB   
11222/11447 KB   
11226/11447 KB   
11230/11447 KB   
11234/11447 KB   
11238/11447 KB   
11242/11447 KB   
11246/11447 KB   
11250/11447 KB   
11254/11447 KB   
11258/11447 KB   
11262/11447 KB   
11266/11447 KB   
11270/11447 KB   
11274/11447 KB   
11278/11447 KB   
11282/11447 KB   
11286/11447 KB   
11290/11447 KB   
11294/11447 KB   
11298/11447 KB   
11302/11447 KB   
11306/11447 KB   
11310/11447 KB   
11314/11447 KB   
11318/11447 KB   
11322/11447 KB   
11326/11447 KB   
11330/11447 KB   
11334/11447 KB   
11338/11447 KB   
11342/11447 KB   
11346/11447 KB   
11350/11447 KB   
11354/11447 KB   
11358/11447 KB   
11362/11447 KB   
11366/11447 KB   
11370/11447 KB   
11374/11447 KB   
11378/11447 KB   
11382/11447 KB   
11386/11447 KB   
11390/11447 KB   
11394/11447 KB   
11398/11447 KB   
11402/11447 KB   
11406/11447 KB   
11410/11447 KB   
11414/11447 KB   
11418/11447 KB   
11422/11447 KB   
11426/11447 KB   
11430/11447 KB   
11434/11447 KB   
11438/11447 KB   
11442/11447 KB   
11446/11447 KB   
11447/11447 KB   
                 
Downloaded: http://repo.maven.apache.org/maven2/com/cenqua/clover/clover/3.0.2/clover-3.0.2.jar
(11447 KB at 16518.0 KB/sec)
[INFO] Clover Version 3.0.2, built on April 13 2010 (build-790)
[INFO] Loaded from: /home/jenkins/.m2/repository/com/cenqua/clover/clover/3.0.2/clover-3.0.2.jar
[INFO] Clover: Open Source License registered to Apache.
[INFO] Creating new database at '<https://builds.apache.org/job/Hadoop-Common-0.23-Build/ws/trunk/hadoop-common-project/hadoop-annotations/target/clover/hadoop-coverage.db'.>
[INFO] Processing files at 1.6 source level.
[INFO] Clover all over. Instrumented 8 files (2 packages).
[INFO] Elapsed time = 0.198 secs. (40.404 files/sec, 3,090.909 srclines/sec)
[INFO] No Clover instrumentation done on source files in: [<https://builds.apache.org/job/Hadoop-Common-0.23-Build/ws/trunk/hadoop-common-project/hadoop-annotations/src/test/java]>
as no matching sources files found
[INFO] 
[INFO] --- maven-resources-plugin:2.2:resources (default-resources) @ hadoop-annotations ---
[INFO] Using default encoding to copy filtered resources.
[INFO] 
[INFO] --- maven-compiler-plugin:2.5.1:compile (default-compile) @ hadoop-annotations ---
[INFO] Compiling 8 source files to <https://builds.apache.org/job/Hadoop-Common-0.23-Build/ws/trunk/hadoop-common-project/hadoop-annotations/target/classes>
[INFO] 
[INFO] --- maven-resources-plugin:2.2:testResources (default-testResources) @ hadoop-annotations
---
[INFO] Using default encoding to copy filtered resources.
[INFO] 
[INFO] --- maven-compiler-plugin:2.5.1:testCompile (default-testCompile) @ hadoop-annotations
---
[INFO] No sources to compile
[INFO] 
[INFO] --- maven-surefire-plugin:2.12.3:test (default-test) @ hadoop-annotations ---
[INFO] No tests to run.
[INFO] 
[INFO] --- maven-clover2-plugin:3.0.5:clover (clover) @ hadoop-annotations ---
[INFO] Setting property: classpath.resource.loader.class => 'org.codehaus.plexus.velocity.ContextClassLoaderResourceLoader'.
[INFO] Setting property: velocimacro.messages.on => 'false'.
[INFO] Setting property: resource.loader => 'classpath'.
[INFO] Setting property: resource.manager.logwhenfound => 'false'.
[INFO] ************************************************************** 
[INFO] Starting Jakarta Velocity v1.4
[INFO] RuntimeInstance initializing.
[INFO] Default Properties File: org/apache/velocity/runtime/defaults/velocity.properties
[INFO] Default ResourceManager initializing. (class org.apache.velocity.runtime.resource.ResourceManagerImpl)
[INFO] Resource Loader Instantiated: org.codehaus.plexus.velocity.ContextClassLoaderResourceLoader
[INFO] ClasspathResourceLoader : initialization starting.
[INFO] ClasspathResourceLoader : initialization complete.
[INFO] ResourceCache : initialized. (class org.apache.velocity.runtime.resource.ResourceCacheImpl)
[INFO] Default ResourceManager initialization complete.
[INFO] Loaded System Directive: org.apache.velocity.runtime.directive.Literal
[INFO] Loaded System Directive: org.apache.velocity.runtime.directive.Macro
[INFO] Loaded System Directive: org.apache.velocity.runtime.directive.Parse
[INFO] Loaded System Directive: org.apache.velocity.runtime.directive.Include
[INFO] Loaded System Directive: org.apache.velocity.runtime.directive.Foreach
[INFO] Created: 20 parsers.
[INFO] Velocimacro : initialization starting.
[INFO] Velocimacro : adding VMs from VM library template : VM_global_library.vm
[ERROR] ResourceManager : unable to find resource 'VM_global_library.vm' in any resource loader.
[INFO] Velocimacro : error using  VM library template VM_global_library.vm : org.apache.velocity.exception.ResourceNotFoundException:
Unable to find resource 'VM_global_library.vm'
[INFO] Velocimacro :  VM library template macro registration complete.
[INFO] Velocimacro : allowInline = true : VMs can be defined inline in templates
[INFO] Velocimacro : allowInlineToOverride = false : VMs defined inline may NOT replace previous
VM definitions
[INFO] Velocimacro : allowInlineLocal = false : VMs defined inline will be  global in scope
if allowed.
[INFO] Velocimacro : initialization complete.
[INFO] Velocity successfully started.
[INFO] Using /default-clover-report descriptor.
[INFO] Using Clover report descriptor: /tmp/mvn8861750050349468524resource
[INFO] Clover Version 3.0.2, built on April 13 2010 (build-790)
[INFO] Loaded from: /home/jenkins/.m2/repository/com/cenqua/clover/clover/3.0.2/clover-3.0.2.jar
[INFO] Clover: Open Source License registered to Apache.
[INFO] Clover is enabled with initstring '<https://builds.apache.org/job/Hadoop-Common-0.23-Build/ws/trunk/hadoop-common-project/hadoop-annotations/target/clover/hadoop-coverage.db'>
[WARNING] Clover historical directory [<https://builds.apache.org/job/Hadoop-Common-0.23-Build/ws/trunk/hadoop-common-project/hadoop-annotations/target/clover/history]>
does not exist, skipping Clover historical report generation ([<https://builds.apache.org/job/Hadoop-Common-0.23-Build/ws/trunk/hadoop-common-project/hadoop-annotations/target/clover])>
[INFO] Clover Version 3.0.2, built on April 13 2010 (build-790)
[INFO] Loaded from: /home/jenkins/.m2/repository/com/cenqua/clover/clover/3.0.2/clover-3.0.2.jar
[INFO] Clover: Open Source License registered to Apache.
[INFO] Loading coverage database from: '<https://builds.apache.org/job/Hadoop-Common-0.23-Build/ws/trunk/hadoop-common-project/hadoop-annotations/target/clover/hadoop-coverage.db'>
[INFO] Writing HTML report to '<https://builds.apache.org/job/Hadoop-Common-0.23-Build/ws/trunk/hadoop-common-project/hadoop-annotations/target/clover'>
[INFO] Done. Processed 2 packages in 1299ms (649ms per package).
[INFO] Clover Version 3.0.2, built on April 13 2010 (build-790)
[INFO] Loaded from: /home/jenkins/.m2/repository/com/cenqua/clover/clover/3.0.2/clover-3.0.2.jar
[INFO] Clover: Open Source License registered to Apache.
[INFO] Clover is enabled with initstring '<https://builds.apache.org/job/Hadoop-Common-0.23-Build/ws/trunk/hadoop-common-project/hadoop-annotations/target/clover/hadoop-coverage.db'>
[WARNING] Clover historical directory [<https://builds.apache.org/job/Hadoop-Common-0.23-Build/ws/trunk/hadoop-common-project/hadoop-annotations/target/clover/history]>
does not exist, skipping Clover historical report generation ([<https://builds.apache.org/job/Hadoop-Common-0.23-Build/ws/trunk/hadoop-common-project/hadoop-annotations/target/clover/clover.xml])>
[INFO] Clover Version 3.0.2, built on April 13 2010 (build-790)
[INFO] Loaded from: /home/jenkins/.m2/repository/com/cenqua/clover/clover/3.0.2/clover-3.0.2.jar
[INFO] Clover: Open Source License registered to Apache.
[INFO] Loading coverage database from: '<https://builds.apache.org/job/Hadoop-Common-0.23-Build/ws/trunk/hadoop-common-project/hadoop-annotations/target/clover/hadoop-coverage.db'>
[INFO] Writing report to '<https://builds.apache.org/job/Hadoop-Common-0.23-Build/ws/trunk/hadoop-common-project/hadoop-annotations/target/clover/clover.xml'>
[INFO]                                                                         
[INFO] ------------------------------------------------------------------------
[INFO] Building Apache Hadoop Auth 0.23.11-SNAPSHOT
[INFO] ------------------------------------------------------------------------
[INFO] 
[INFO] --- maven-antrun-plugin:1.6:run (create-testdirs) @ hadoop-auth ---
[INFO] Executing tasks

main:
[INFO] Executed tasks
[INFO] 
[INFO] --- maven-dependency-plugin:2.1:build-classpath (build-classpath) @ hadoop-auth ---
[INFO] Wrote classpath file '<https://builds.apache.org/job/Hadoop-Common-0.23-Build/ws/trunk/hadoop-common-project/hadoop-auth/target/classes/mrapp-generated-classpath'.>
[INFO] 
[INFO] --- maven-clover2-plugin:3.0.5:setup (setup) @ hadoop-auth ---
[INFO] Clover Version 3.0.2, built on April 13 2010 (build-790)
[INFO] Loaded from: /home/jenkins/.m2/repository/com/cenqua/clover/clover/3.0.2/clover-3.0.2.jar
[INFO] Clover: Open Source License registered to Apache.
[INFO] Creating new database at '<https://builds.apache.org/job/Hadoop-Common-0.23-Build/ws/trunk/hadoop-common-project/hadoop-auth/target/clover/hadoop-coverage.db'.>
[INFO] Processing files at 1.6 source level.
[INFO] Clover all over. Instrumented 14 files (3 packages).
[INFO] Elapsed time = 0.181 secs. (77.348 files/sec, 13,872.929 srclines/sec)
[INFO] Clover Version 3.0.2, built on April 13 2010 (build-790)
[INFO] Loaded from: /home/jenkins/.m2/repository/com/cenqua/clover/clover/3.0.2/clover-3.0.2.jar
[INFO] Clover: Open Source License registered to Apache.
[INFO] Updating existing database at '<https://builds.apache.org/job/Hadoop-Common-0.23-Build/ws/trunk/hadoop-common-project/hadoop-auth/target/clover/hadoop-coverage.db'.>
[INFO] Processing files at 1.6 source level.
[INFO] Clover all over. Instrumented 12 files (4 packages).
[INFO] 56 test methods detected.
[INFO] Elapsed time = 0.272 secs. (44.118 files/sec, 6,838.235 srclines/sec)
[INFO] 
[INFO] --- maven-resources-plugin:2.2:resources (default-resources) @ hadoop-auth ---
[INFO] Using default encoding to copy filtered resources.
[INFO] 
[INFO] --- maven-compiler-plugin:2.5.1:compile (default-compile) @ hadoop-auth ---
[INFO] Compiling 14 source files to <https://builds.apache.org/job/Hadoop-Common-0.23-Build/ws/trunk/hadoop-common-project/hadoop-auth/target/classes>
[INFO] 
[INFO] --- maven-resources-plugin:2.2:testResources (default-testResources) @ hadoop-auth
---
[INFO] Using default encoding to copy filtered resources.
[INFO] 
[INFO] --- maven-compiler-plugin:2.5.1:testCompile (default-testCompile) @ hadoop-auth ---
[INFO] Compiling 12 source files to <https://builds.apache.org/job/Hadoop-Common-0.23-Build/ws/trunk/hadoop-common-project/hadoop-auth/target/test-classes>
[INFO] -------------------------------------------------------------
[ERROR] COMPILATION ERROR : 
[INFO] -------------------------------------------------------------
[ERROR] <https://builds.apache.org/job/Hadoop-Common-0.23-Build/ws/trunk/hadoop-common-project/hadoop-auth/target/clover/src-test-instrumented/org/apache/hadoop/security/authentication/client/AuthenticatorTestCase.java>:[84,47]
cannot access org.mortbay.component.AbstractLifeCycle
class file for org.mortbay.component.AbstractLifeCycle not found
    __CLR3_0_2pgpghq4xjqzg.R.inc(935);server = new Server(0);
[ERROR] <https://builds.apache.org/job/Hadoop-Common-0.23-Build/ws/trunk/hadoop-common-project/hadoop-auth/target/clover/src-test-instrumented/org/apache/hadoop/security/authentication/client/AuthenticatorTestCase.java>:[94,63]
cannot access org.mortbay.component.LifeCycle
class file for org.mortbay.component.LifeCycle not found
    __CLR3_0_2pgpghq4xjqzg.R.inc(945);server.getConnectors()[0].setHost(host);
[ERROR] <https://builds.apache.org/job/Hadoop-Common-0.23-Build/ws/trunk/hadoop-common-project/hadoop-auth/target/clover/src-test-instrumented/org/apache/hadoop/security/authentication/client/AuthenticatorTestCase.java>:[96,44]
cannot find symbol
symbol  : method start()
location: class org.mortbay.jetty.Server
[ERROR] <https://builds.apache.org/job/Hadoop-Common-0.23-Build/ws/trunk/hadoop-common-project/hadoop-auth/target/clover/src-test-instrumented/org/apache/hadoop/security/authentication/client/AuthenticatorTestCase.java>:[102,46]
cannot find symbol
symbol  : method stop()
location: class org.mortbay.jetty.Server
[INFO] 4 errors 
[INFO] -------------------------------------------------------------
[INFO] ------------------------------------------------------------------------
[INFO] Reactor Summary:
[INFO] 
[INFO] Apache Hadoop Annotations ......................... SUCCESS [9.018s]
[INFO] Apache Hadoop Auth ................................ FAILURE [2.399s]
[INFO] Apache Hadoop Auth Examples ....................... SKIPPED
[INFO] Apache Hadoop Common .............................. SKIPPED
[INFO] Apache Hadoop Common Project ...................... SKIPPED
[INFO] ------------------------------------------------------------------------
[INFO] BUILD FAILURE
[INFO] ------------------------------------------------------------------------
[INFO] Total time: 11.864s
[INFO] Finished at: Tue Jan 07 09:02:25 UTC 2014
[INFO] Final Memory: 21M/152M
[INFO] ------------------------------------------------------------------------
[ERROR] Failed to execute goal org.apache.maven.plugins:maven-compiler-plugin:2.5.1:testCompile
(default-testCompile) on project hadoop-auth: Compilation failure: Compilation failure:
[ERROR] <https://builds.apache.org/job/Hadoop-Common-0.23-Build/ws/trunk/hadoop-common-project/hadoop-auth/target/clover/src-test-instrumented/org/apache/hadoop/security/authentication/client/AuthenticatorTestCase.java>:[84,47]
cannot access org.mortbay.component.AbstractLifeCycle
[ERROR] class file for org.mortbay.component.AbstractLifeCycle not found
[ERROR] __CLR3_0_2pgpghq4xjqzg.R.inc(935);server = new Server(0);
[ERROR] <https://builds.apache.org/job/Hadoop-Common-0.23-Build/ws/trunk/hadoop-common-project/hadoop-auth/target/clover/src-test-instrumented/org/apache/hadoop/security/authentication/client/AuthenticatorTestCase.java>:[94,63]
cannot access org.mortbay.component.LifeCycle
[ERROR] class file for org.mortbay.component.LifeCycle not found
[ERROR] __CLR3_0_2pgpghq4xjqzg.R.inc(945);server.getConnectors()[0].setHost(host);
[ERROR] <https://builds.apache.org/job/Hadoop-Common-0.23-Build/ws/trunk/hadoop-common-project/hadoop-auth/target/clover/src-test-instrumented/org/apache/hadoop/security/authentication/client/AuthenticatorTestCase.java>:[96,44]
cannot find symbol
[ERROR] symbol  : method start()
[ERROR] location: class org.mortbay.jetty.Server
[ERROR] <https://builds.apache.org/job/Hadoop-Common-0.23-Build/ws/trunk/hadoop-common-project/hadoop-auth/target/clover/src-test-instrumented/org/apache/hadoop/security/authentication/client/AuthenticatorTestCase.java>:[102,46]
cannot find symbol
[ERROR] symbol  : method stop()
[ERROR] location: class org.mortbay.jetty.Server
[ERROR] -> [Help 1]
[ERROR] 
[ERROR] To see the full stack trace of the errors, re-run Maven with the -e switch.
[ERROR] Re-run Maven using the -X switch to enable full debug logging.
[ERROR] 
[ERROR] For more information about the errors and possible solutions, please read the following
articles:
[ERROR] [Help 1] http://cwiki.apache.org/confluence/display/MAVEN/MojoFailureException
[ERROR] 
[ERROR] After correcting the problems, you can resume the build with the command
[ERROR]   mvn <goals> -rf :hadoop-auth
Build step 'Execute shell' marked build as failure
[WARNINGS] Skipping publisher since build result is FAILURE
Archiving artifacts
Recording fingerprints
Publishing Javadoc
Recording test results

Mime
View raw message