hadoop-common-dev mailing list archives

Site index · List index
Message view « Date » · « Thread »
Top « Date » · « Thread »
From Apache Jenkins Server <jenk...@builds.apache.org>
Subject Build failed in Jenkins: Hadoop-Common-trunk #948
Date Sun, 10 Nov 2013 09:25:15 GMT
See <https://builds.apache.org/job/Hadoop-Common-trunk/948/changes>

Changes:

[brandonli] HDFS-5469. Add configuration property for the sub-directroy export path. Contributed by Brandon Li

------------------------------------------
[...truncated 15544 lines...]
[DEBUG] Source directories: [<https://builds.apache.org/job/Hadoop-Common-trunk/ws/trunk/hadoop-common-project/hadoop-auth/src/test/java]>
[DEBUG] Classpath: [<https://builds.apache.org/job/Hadoop-Common-trunk/ws/trunk/hadoop-common-project/hadoop-auth/target/test-classes>
 <https://builds.apache.org/job/Hadoop-Common-trunk/ws/trunk/hadoop-common-project/hadoop-auth/target/classes>
 <https://builds.apache.org/job/Hadoop-Common-trunk/ws/trunk/hadoop-common-project/hadoop-annotations/target/hadoop-annotations-3.0.0-SNAPSHOT.jar>
 /home/jenkins/tools/java/jdk1.6.0_26/jre/../lib/tools.jar
 /home/jenkins/.m2/repository/junit/junit/4.10/junit-4.10.jar
 /home/jenkins/.m2/repository/org/hamcrest/hamcrest-core/1.1/hamcrest-core-1.1.jar
 /home/jenkins/.m2/repository/org/mockito/mockito-all/1.8.5/mockito-all-1.8.5.jar
 /home/jenkins/.m2/repository/org/mortbay/jetty/jetty/6.1.26/jetty-6.1.26.jar
 /home/jenkins/.m2/repository/org/mortbay/jetty/jetty-util/6.1.26/jetty-util-6.1.26.jar
 /home/jenkins/.m2/repository/javax/servlet/servlet-api/2.5/servlet-api-2.5.jar
 /home/jenkins/.m2/repository/org/slf4j/slf4j-api/1.7.5/slf4j-api-1.7.5.jar
 /home/jenkins/.m2/repository/commons-codec/commons-codec/1.4/commons-codec-1.4.jar
 /home/jenkins/.m2/repository/log4j/log4j/1.2.17/log4j-1.2.17.jar
 /home/jenkins/.m2/repository/org/slf4j/slf4j-log4j12/1.7.5/slf4j-log4j12-1.7.5.jar
 <https://builds.apache.org/job/Hadoop-Common-trunk/ws/trunk/hadoop-common-project/hadoop-minikdc/target/hadoop-minikdc-3.0.0-SNAPSHOT.jar>
 /home/jenkins/.m2/repository/commons-io/commons-io/2.1/commons-io-2.1.jar
 /home/jenkins/.m2/repository/org/apache/directory/server/apacheds-all/2.0.0-M15/apacheds-all-2.0.0-M15.jar]
[DEBUG] Output directory: <https://builds.apache.org/job/Hadoop-Common-trunk/ws/trunk/hadoop-common-project/hadoop-auth/target/test-classes>
[DEBUG] CompilerReuseStrategy: reuseCreated
[DEBUG] Classpath:
[DEBUG]  <https://builds.apache.org/job/Hadoop-Common-trunk/ws/trunk/hadoop-common-project/hadoop-auth/target/test-classes>
[DEBUG]  <https://builds.apache.org/job/Hadoop-Common-trunk/ws/trunk/hadoop-common-project/hadoop-auth/target/classes>
[DEBUG]  <https://builds.apache.org/job/Hadoop-Common-trunk/ws/trunk/hadoop-common-project/hadoop-annotations/target/hadoop-annotations-3.0.0-SNAPSHOT.jar>
[DEBUG]  /home/jenkins/tools/java/jdk1.6.0_26/jre/../lib/tools.jar
[DEBUG]  /home/jenkins/.m2/repository/junit/junit/4.10/junit-4.10.jar
[DEBUG]  /home/jenkins/.m2/repository/org/hamcrest/hamcrest-core/1.1/hamcrest-core-1.1.jar
[DEBUG]  /home/jenkins/.m2/repository/org/mockito/mockito-all/1.8.5/mockito-all-1.8.5.jar
[DEBUG]  /home/jenkins/.m2/repository/org/mortbay/jetty/jetty/6.1.26/jetty-6.1.26.jar
[DEBUG]  /home/jenkins/.m2/repository/org/mortbay/jetty/jetty-util/6.1.26/jetty-util-6.1.26.jar
[DEBUG]  /home/jenkins/.m2/repository/javax/servlet/servlet-api/2.5/servlet-api-2.5.jar
[DEBUG]  /home/jenkins/.m2/repository/org/slf4j/slf4j-api/1.7.5/slf4j-api-1.7.5.jar
[DEBUG]  /home/jenkins/.m2/repository/commons-codec/commons-codec/1.4/commons-codec-1.4.jar
[DEBUG]  /home/jenkins/.m2/repository/log4j/log4j/1.2.17/log4j-1.2.17.jar
[DEBUG]  /home/jenkins/.m2/repository/org/slf4j/slf4j-log4j12/1.7.5/slf4j-log4j12-1.7.5.jar
[DEBUG]  <https://builds.apache.org/job/Hadoop-Common-trunk/ws/trunk/hadoop-common-project/hadoop-minikdc/target/hadoop-minikdc-3.0.0-SNAPSHOT.jar>
[DEBUG]  /home/jenkins/.m2/repository/commons-io/commons-io/2.1/commons-io-2.1.jar
[DEBUG]  /home/jenkins/.m2/repository/org/apache/directory/server/apacheds-all/2.0.0-M15/apacheds-all-2.0.0-M15.jar
[DEBUG] Source roots:
[DEBUG]  <https://builds.apache.org/job/Hadoop-Common-trunk/ws/trunk/hadoop-common-project/hadoop-auth/src/test/java>
[DEBUG] Command line options:
[DEBUG] -d <https://builds.apache.org/job/Hadoop-Common-trunk/ws/trunk/hadoop-common-project/hadoop-auth/target/test-classes> -classpath <https://builds.apache.org/job/Hadoop-Common-trunk/ws/trunk/hadoop-common-project/hadoop-auth/target/test-classes>:<https://builds.apache.org/job/Hadoop-Common-trunk/ws/trunk/hadoop-common-project/hadoop-auth/target/classes>:<https://builds.apache.org/job/Hadoop-Common-trunk/ws/trunk/hadoop-common-project/hadoop-annotations/target/hadoop-annotations-3.0.0-SNAPSHOT.jar>:/home/jenkins/tools/java/jdk1.6.0_26/jre/../lib/tools.jar:/home/jenkins/.m2/repository/junit/junit/4.10/junit-4.10.jar:/home/jenkins/.m2/repository/org/hamcrest/hamcrest-core/1.1/hamcrest-core-1.1.jar:/home/jenkins/.m2/repository/org/mockito/mockito-all/1.8.5/mockito-all-1.8.5.jar:/home/jenkins/.m2/repository/org/mortbay/jetty/jetty/6.1.26/jetty-6.1.26.jar:/home/jenkins/.m2/repository/org/mortbay/jetty/jetty-util/6.1.26/jetty-util-6.1.26.jar:/home/jenkins/.m2/repository/javax/servlet/servlet-api/2.5/servlet-api-2.5.jar:/home/jenkins/.m2/repository/org/slf4j/slf4j-api/1.7.5/slf4j-api-1.7.5.jar:/home/jenkins/.m2/repository/commons-codec/commons-codec/1.4/commons-codec-1.4.jar:/home/jenkins/.m2/repository/log4j/log4j/1.2.17/log4j-1.2.17.jar:/home/jenkins/.m2/repository/org/slf4j/slf4j-log4j12/1.7.5/slf4j-log4j12-1.7.5.jar:<https://builds.apache.org/job/Hadoop-Common-trunk/ws/trunk/hadoop-common-project/hadoop-minikdc/target/hadoop-minikdc-3.0.0-SNAPSHOT.jar>:/home/jenkins/.m2/repository/commons-io/commons-io/2.1/commons-io-2.1.jar:/home/jenkins/.m2/repository/org/apache/directory/server/apacheds-all/2.0.0-M15/apacheds-all-2.0.0-M15.jar: -sourcepath <https://builds.apache.org/job/Hadoop-Common-trunk/ws/trunk/hadoop-common-project/hadoop-auth/src/test/java>: <https://builds.apache.org/job/Hadoop-Common-trunk/ws/trunk/hadoop-common-project/hadoop-auth/src/test/java/org/apache/hadoop/security/authentication/server/TestAuthenticationFilter.java> <https://builds.apache.org/job/Hadoop-Common-trunk/ws/trunk/hadoop-common-project/hadoop-auth/src/test/java/org/apache/hadoop/security/authentication/util/TestSigner.java> <https://builds.apache.org/job/Hadoop-Common-trunk/ws/trunk/hadoop-common-project/hadoop-auth/src/test/java/org/apache/hadoop/security/authentication/server/TestAuthenticationToken.java> <https://builds.apache.org/job/Hadoop-Common-trunk/ws/trunk/hadoop-common-project/hadoop-auth/src/test/java/org/apache/hadoop/security/authentication/server/TestKerberosAuthenticationHandler.java> <https://builds.apache.org/job/Hadoop-Common-trunk/ws/trunk/hadoop-common-project/hadoop-auth/src/test/java/org/apache/hadoop/security/authentication/KerberosTestUtils.java> <https://builds.apache.org/job/Hadoop-Common-trunk/ws/trunk/hadoop-common-project/hadoop-auth/src/test/java/org/apache/hadoop/security/authentication/util/TestKerberosUtil.java> <https://builds.apache.org/job/Hadoop-Common-trunk/ws/trunk/hadoop-common-project/hadoop-auth/src/test/java/org/apache/hadoop/security/authentication/server/TestAltKerberosAuthenticationHandler.java> <https://builds.apache.org/job/Hadoop-Common-trunk/ws/trunk/hadoop-common-project/hadoop-auth/src/test/java/org/apache/hadoop/security/authentication/client/TestKerberosAuthenticator.java> <https://builds.apache.org/job/Hadoop-Common-trunk/ws/trunk/hadoop-common-project/hadoop-auth/src/test/java/org/apache/hadoop/security/authentication/util/TestKerberosName.java> <https://builds.apache.org/job/Hadoop-Common-trunk/ws/trunk/hadoop-common-project/hadoop-auth/src/test/java/org/apache/hadoop/security/authentication/client/TestPseudoAuthenticator.java> <https://builds.apache.org/job/Hadoop-Common-trunk/ws/trunk/hadoop-common-project/hadoop-auth/src/test/java/org/apache/hadoop/security/authentication/client/TestAuthenticatedURL.java> <https://builds.apache.org/job/Hadoop-Common-trunk/ws/trunk/hadoop-common-project/hadoop-auth/src/test/java/org/apache/hadoop/security/authentication/server/TestPseudoAuthenticationHandler.java> <https://builds.apache.org/job/Hadoop-Common-trunk/ws/trunk/hadoop-common-project/hadoop-auth/src/test/java/org/apache/hadoop/security/authentication/client/AuthenticatorTestCase.java> -s <https://builds.apache.org/job/Hadoop-Common-trunk/ws/trunk/hadoop-common-project/hadoop-auth/target/generated-test-sources/test-annotations> -g -nowarn -target 1.6 -source 1.6 -encoding UTF-8
[INFO] Compiling 13 source files to <https://builds.apache.org/job/Hadoop-Common-trunk/ws/trunk/hadoop-common-project/hadoop-auth/target/test-classes>
[INFO] 
[INFO] --- maven-surefire-plugin:2.16:test (default-test) @ hadoop-auth ---
[DEBUG] Configuring mojo org.apache.maven.plugins:maven-surefire-plugin:2.16:test from plugin realm ClassRealm[plugin>org.apache.maven.plugins:maven-surefire-plugin:2.16, parent: sun.misc.Launcher$AppClassLoader@126b249]
[DEBUG] Configuring mojo 'org.apache.maven.plugins:maven-surefire-plugin:2.16:test' with basic configurator -->
[DEBUG]   (s) additionalClasspathElements = []
[DEBUG]   (s) argLine = -Xmx1024m -XX:+HeapDumpOnOutOfMemoryError
[DEBUG]   (s) basedir = <https://builds.apache.org/job/Hadoop-Common-trunk/ws/trunk/hadoop-common-project/hadoop-auth>
[DEBUG]   (s) childDelegation = false
[DEBUG]   (s) classesDirectory = <https://builds.apache.org/job/Hadoop-Common-trunk/ws/trunk/hadoop-common-project/hadoop-auth/target/classes>
[DEBUG]   (s) classpathDependencyExcludes = []
[DEBUG]   (s) dependenciesToScan = []
[DEBUG]   (s) disableXmlReport = false
[DEBUG]   (s) enableAssertions = true
[DEBUG]   (s) environmentVariables = {HADOOP_HOME=<https://builds.apache.org/job/Hadoop-Common-trunk/ws/trunk/hadoop-common-project/hadoop-auth/../../hadoop-common-project/hadoop-common/target,> LD_LIBRARY_PATH=/home/jenkins/tools/java/jdk1.6.0_26/jre/lib/i386/server:/home/jenkins/tools/java/jdk1.6.0_26/jre/lib/i386:/home/jenkins/tools/java/jdk1.6.0_26/jre/../lib/i386:<https://builds.apache.org/job/Hadoop-Common-trunk/ws/trunk/hadoop-common-project/hadoop-auth/target/native/target/usr/local/lib>:<https://builds.apache.org/job/Hadoop-Common-trunk/ws/trunk/hadoop-common-project/hadoop-auth/../../hadoop-common-project/hadoop-common/target/native/target/usr/local/lib,> MALLOC_ARENA_MAX=4}
[DEBUG]   (s) excludes = [**/_.java, _, **/Test*$*.java]
[DEBUG]   (s) failIfNoTests = false
[DEBUG]   (f) forkCount = 1
[DEBUG]   (s) forkMode = once
[DEBUG]   (s) forkedProcessTimeoutInSeconds = 900
[DEBUG]   (s) includes = [**/Test*.java]
[DEBUG]   (s) junitArtifactName = junit:junit
[DEBUG]   (s) localRepository =        id: local
      url: file:///home/jenkins/.m2/repository/
   layout: none

[DEBUG]   (f) parallelMavenExecution = false
[DEBUG]   (s) perCoreThreadCount = true
[DEBUG]   (s) pluginArtifactMap = {org.apache.maven.plugins:maven-surefire-plugin=org.apache.maven.plugins:maven-surefire-plugin:maven-plugin:2.16:, org.apache.maven.surefire:maven-surefire-common=org.apache.maven.surefire:maven-surefire-common:jar:2.16:compile, org.apache.maven.surefire:surefire-booter=org.apache.maven.surefire:surefire-booter:jar:2.16:compile, org.codehaus.plexus:plexus-utils=org.codehaus.plexus:plexus-utils:jar:1.5.1:compile, org.apache.maven.reporting:maven-reporting-api=org.apache.maven.reporting:maven-reporting-api:jar:2.0.9:compile, org.apache.commons:commons-lang3=org.apache.commons:commons-lang3:jar:3.1:compile, org.apache.maven.surefire:surefire-api=org.apache.maven.surefire:surefire-api:jar:2.16:compile, org.apache.maven.plugin-tools:maven-plugin-annotations=org.apache.maven.plugin-tools:maven-plugin-annotations:jar:3.2:compile}
[DEBUG]   (f) pluginDescriptor = Component Descriptor: role: 'org.apache.maven.plugin.Mojo', implementation: 'org.apache.maven.plugin.surefire.SurefirePlugin', role hint: 'org.apache.maven.plugins:maven-surefire-plugin:2.16:test'
role: 'org.apache.maven.plugin.Mojo', implementation: 'org.apache.maven.plugin.surefire.HelpMojo', role hint: 'org.apache.maven.plugins:maven-surefire-plugin:2.16:help'
---
[DEBUG]   (s) printSummary = true
[DEBUG]   (s) projectArtifactMap = {org.apache.hadoop:hadoop-annotations=org.apache.hadoop:hadoop-annotations:jar:3.0.0-SNAPSHOT:provided, jdk.tools:jdk.tools=jdk.tools:jdk.tools:jar:1.6:system, junit:junit=junit:junit:jar:4.10:test, org.hamcrest:hamcrest-core=org.hamcrest:hamcrest-core:jar:1.1:test, org.mockito:mockito-all=org.mockito:mockito-all:jar:1.8.5:test, org.mortbay.jetty:jetty=org.mortbay.jetty:jetty:jar:6.1.26:test, org.mortbay.jetty:jetty-util=org.mortbay.jetty:jetty-util:jar:6.1.26:test, javax.servlet:servlet-api=javax.servlet:servlet-api:jar:2.5:provided, org.slf4j:slf4j-api=org.slf4j:slf4j-api:jar:1.7.5:compile, commons-codec:commons-codec=commons-codec:commons-codec:jar:1.4:compile, log4j:log4j=log4j:log4j:jar:1.2.17:runtime, org.slf4j:slf4j-log4j12=org.slf4j:slf4j-log4j12:jar:1.7.5:runtime, org.apache.hadoop:hadoop-minikdc=org.apache.hadoop:hadoop-minikdc:jar:3.0.0-SNAPSHOT:test, commons-io:commons-io=commons-io:commons-io:jar:2.1:test, org.apache.directory.server:apacheds-all=org.apache.directory.server:apacheds-all:jar:2.0.0-M15:test}
[DEBUG]   (s) redirectTestOutputToFile = true
[DEBUG]   (s) remoteRepositories = [       id: central
      url: http://repo1.maven.org/maven2
   layout: default
snapshots: [enabled => false, update => daily]
 releases: [enabled => true, update => never]
]
[DEBUG]   (s) reportFormat = brief
[DEBUG]   (s) reportsDirectory = <https://builds.apache.org/job/Hadoop-Common-trunk/ws/trunk/hadoop-common-project/hadoop-auth/target/surefire-reports>
[DEBUG]   (f) reuseForks = false
[DEBUG]   (s) runOrder = filesystem
[DEBUG]   (s) skip = false
[DEBUG]   (s) skipTests = false
[DEBUG]   (s) systemPropertyVariables = {hadoop.log.dir=null, hadoop.tmp.dir=null, java.net.preferIPv4Stack=true, java.security.egd=file:///dev/urandom, java.security.krb5.conf=<https://builds.apache.org/job/Hadoop-Common-trunk/ws/trunk/hadoop-common-project/hadoop-auth/src/test/resources/krb5.conf,> require.test.libhadoop=null, test.build.classes=null, test.build.data=<https://builds.apache.org/job/Hadoop-Common-trunk/ws/trunk/hadoop-common-project/hadoop-auth/target/test-dir,> test.build.dir=<https://builds.apache.org/job/Hadoop-Common-trunk/ws/trunk/hadoop-common-project/hadoop-auth/target/test-dir,> test.build.webapps=null, test.cache.data=null}
[DEBUG]   (s) testClassesDirectory = <https://builds.apache.org/job/Hadoop-Common-trunk/ws/trunk/hadoop-common-project/hadoop-auth/target/test-classes>
[DEBUG]   (s) testFailureIgnore = false
[DEBUG]   (s) testNGArtifactName = org.testng:testng
[DEBUG]   (s) testSourceDirectory = <https://builds.apache.org/job/Hadoop-Common-trunk/ws/trunk/hadoop-common-project/hadoop-auth/src/test/java>
[DEBUG]   (s) threadCountClasses = 0
[DEBUG]   (s) threadCountMethods = 0
[DEBUG]   (s) threadCountSuites = 0
[DEBUG]   (s) trimStackTrace = true
[DEBUG]   (s) useFile = true
[DEBUG]   (s) useManifestOnlyJar = true
[DEBUG]   (s) useSystemClassLoader = true
[DEBUG]   (s) useUnlimitedThreads = false
[DEBUG]   (s) workingDirectory = <https://builds.apache.org/job/Hadoop-Common-trunk/ws/trunk/hadoop-common-project/hadoop-auth>
[DEBUG]   (s) project = MavenProject: org.apache.hadoop:hadoop-auth:3.0.0-SNAPSHOT @ <https://builds.apache.org/job/Hadoop-Common-trunk/ws/trunk/hadoop-common-project/hadoop-auth/pom.xml>
[DEBUG]   (s) session = org.apache.maven.execution.MavenSession@2423ad
[DEBUG] -- end configuration --
[INFO] Surefire report directory: <https://builds.apache.org/job/Hadoop-Common-trunk/ws/trunk/hadoop-common-project/hadoop-auth/target/surefire-reports>
[DEBUG] Setting system property [java.net.preferIPv4Stack]=[true]
[DEBUG] Setting system property [java.security.krb5.conf]=[<https://builds.apache.org/job/Hadoop-Common-trunk/ws/trunk/hadoop-common-project/hadoop-auth/src/test/resources/krb5.conf]>
[DEBUG] Setting system property [tar]=[true]
[DEBUG] Setting system property [test.build.data]=[<https://builds.apache.org/job/Hadoop-Common-trunk/ws/trunk/hadoop-common-project/hadoop-auth/target/test-dir]>
[DEBUG] Setting system property [user.dir]=[<https://builds.apache.org/job/Hadoop-Common-trunk/ws/trunk/hadoop-common-project/hadoop-auth]>
[DEBUG] Setting system property [localRepository]=[/home/jenkins/.m2/repository]
[DEBUG] Setting system property [test.build.dir]=[<https://builds.apache.org/job/Hadoop-Common-trunk/ws/trunk/hadoop-common-project/hadoop-auth/target/test-dir]>
[DEBUG] Setting system property [basedir]=[<https://builds.apache.org/job/Hadoop-Common-trunk/ws/trunk/hadoop-common-project/hadoop-auth]>
[DEBUG] Setting system property [java.security.egd]=[file:///dev/urandom]
[DEBUG] Using JVM: /home/jenkins/tools/java/jdk1.6.0_26/jre/bin/java
[DEBUG] Setting environment variable [HADOOP_HOME]=[<https://builds.apache.org/job/Hadoop-Common-trunk/ws/trunk/hadoop-common-project/hadoop-auth/../../hadoop-common-project/hadoop-common/target]>
[DEBUG] Setting environment variable [LD_LIBRARY_PATH]=[/home/jenkins/tools/java/jdk1.6.0_26/jre/lib/i386/server:/home/jenkins/tools/java/jdk1.6.0_26/jre/lib/i386:/home/jenkins/tools/java/jdk1.6.0_26/jre/../lib/i386:<https://builds.apache.org/job/Hadoop-Common-trunk/ws/trunk/hadoop-common-project/hadoop-auth/target/native/target/usr/local/lib>:<https://builds.apache.org/job/Hadoop-Common-trunk/ws/trunk/hadoop-common-project/hadoop-auth/../../hadoop-common-project/hadoop-common/target/native/target/usr/local/lib]>
[DEBUG] Setting environment variable [MALLOC_ARENA_MAX]=[4]
[DEBUG] test classpath:  <https://builds.apache.org/job/Hadoop-Common-trunk/ws/trunk/hadoop-common-project/hadoop-auth/target/test-classes>  <https://builds.apache.org/job/Hadoop-Common-trunk/ws/trunk/hadoop-common-project/hadoop-auth/target/classes>  <https://builds.apache.org/job/Hadoop-Common-trunk/ws/trunk/hadoop-common-project/hadoop-annotations/target/hadoop-annotations-3.0.0-SNAPSHOT.jar>  /home/jenkins/tools/java/jdk1.6.0_26/jre/../lib/tools.jar  /home/jenkins/.m2/repository/junit/junit/4.10/junit-4.10.jar  /home/jenkins/.m2/repository/org/hamcrest/hamcrest-core/1.1/hamcrest-core-1.1.jar  /home/jenkins/.m2/repository/org/mockito/mockito-all/1.8.5/mockito-all-1.8.5.jar  /home/jenkins/.m2/repository/org/mortbay/jetty/jetty/6.1.26/jetty-6.1.26.jar  /home/jenkins/.m2/repository/org/mortbay/jetty/jetty-util/6.1.26/jetty-util-6.1.26.jar  /home/jenkins/.m2/repository/javax/servlet/servlet-api/2.5/servlet-api-2.5.jar  /home/jenkins/.m2/repository/org/slf4j/slf4j-api/1.7.5/slf4j-api-1.7.5.jar  /home/jenkins/.m2/repository/commons-codec/commons-codec/1.4/commons-codec-1.4.jar  /home/jenkins/.m2/repository/log4j/log4j/1.2.17/log4j-1.2.17.jar  /home/jenkins/.m2/repository/org/slf4j/slf4j-log4j12/1.7.5/slf4j-log4j12-1.7.5.jar  <https://builds.apache.org/job/Hadoop-Common-trunk/ws/trunk/hadoop-common-project/hadoop-minikdc/target/hadoop-minikdc-3.0.0-SNAPSHOT.jar>  /home/jenkins/.m2/repository/commons-io/commons-io/2.1/commons-io-2.1.jar  /home/jenkins/.m2/repository/org/apache/directory/server/apacheds-all/2.0.0-M15/apacheds-all-2.0.0-M15.jar
[DEBUG] provider classpath:  /home/jenkins/.m2/repository/org/apache/maven/surefire/surefire-junit4/2.16/surefire-junit4-2.16.jar  /home/jenkins/.m2/repository/org/apache/maven/surefire/surefire-api/2.16/surefire-api-2.16.jar
[DEBUG] test(compact) classpath:  test-classes  classes  hadoop-annotations-3.0.0-SNAPSHOT.jar  tools.jar  junit-4.10.jar  hamcrest-core-1.1.jar  mockito-all-1.8.5.jar  jetty-6.1.26.jar  jetty-util-6.1.26.jar  servlet-api-2.5.jar  slf4j-api-1.7.5.jar  commons-codec-1.4.jar  log4j-1.2.17.jar  slf4j-log4j12-1.7.5.jar  hadoop-minikdc-3.0.0-SNAPSHOT.jar  commons-io-2.1.jar  apacheds-all-2.0.0-M15.jar
[DEBUG] provider(compact) classpath:  surefire-junit4-2.16.jar  surefire-api-2.16.jar

-------------------------------------------------------
 T E S T S
-------------------------------------------------------

-------------------------------------------------------
 T E S T S
-------------------------------------------------------
[DEBUG] boot classpath:  /home/jenkins/.m2/repository/org/apache/maven/surefire/surefire-booter/2.16/surefire-booter-2.16.jar  /home/jenkins/.m2/repository/org/apache/maven/surefire/surefire-api/2.16/surefire-api-2.16.jar  <https://builds.apache.org/job/Hadoop-Common-trunk/ws/trunk/hadoop-common-project/hadoop-auth/target/test-classes>  <https://builds.apache.org/job/Hadoop-Common-trunk/ws/trunk/hadoop-common-project/hadoop-auth/target/classes>  <https://builds.apache.org/job/Hadoop-Common-trunk/ws/trunk/hadoop-common-project/hadoop-annotations/target/hadoop-annotations-3.0.0-SNAPSHOT.jar>  /home/jenkins/tools/java/jdk1.6.0_26/jre/../lib/tools.jar  /home/jenkins/.m2/repository/junit/junit/4.10/junit-4.10.jar  /home/jenkins/.m2/repository/org/hamcrest/hamcrest-core/1.1/hamcrest-core-1.1.jar  /home/jenkins/.m2/repository/org/mockito/mockito-all/1.8.5/mockito-all-1.8.5.jar  /home/jenkins/.m2/repository/org/mortbay/jetty/jetty/6.1.26/jetty-6.1.26.jar  /home/jenkins/.m2/repository/org/mortbay/jetty/jetty-util/6.1.26/jetty-util-6.1.26.jar  /home/jenkins/.m2/repository/javax/servlet/servlet-api/2.5/servlet-api-2.5.jar  /home/jenkins/.m2/repository/org/slf4j/slf4j-api/1.7.5/slf4j-api-1.7.5.jar  /home/jenkins/.m2/repository/commons-codec/commons-codec/1.4/commons-codec-1.4.jar  /home/jenkins/.m2/repository/log4j/log4j/1.2.17/log4j-1.2.17.jar  /home/jenkins/.m2/repository/org/slf4j/slf4j-log4j12/1.7.5/slf4j-log4j12-1.7.5.jar  <https://builds.apache.org/job/Hadoop-Common-trunk/ws/trunk/hadoop-common-project/hadoop-minikdc/target/hadoop-minikdc-3.0.0-SNAPSHOT.jar>  /home/jenkins/.m2/repository/commons-io/commons-io/2.1/commons-io-2.1.jar  /home/jenkins/.m2/repository/org/apache/directory/server/apacheds-all/2.0.0-M15/apacheds-all-2.0.0-M15.jar  /home/jenkins/.m2/repository/org/apache/maven/surefire/surefire-junit4/2.16/surefire-junit4-2.16.jar
[DEBUG] boot(compact) classpath:  surefire-booter-2.16.jar  surefire-api-2.16.jar  test-classes  classes  hadoop-annotations-3.0.0-SNAPSHOT.jar  tools.jar  junit-4.10.jar  hamcrest-core-1.1.jar  mockito-all-1.8.5.jar  jetty-6.1.26.jar  jetty-util-6.1.26.jar  servlet-api-2.5.jar  slf4j-api-1.7.5.jar  commons-codec-1.4.jar  log4j-1.2.17.jar  slf4j-log4j12-1.7.5.jar  hadoop-minikdc-3.0.0-SNAPSHOT.jar  commons-io-2.1.jar  apacheds-all-2.0.0-M15.jar  surefire-junit4-2.16.jar
Forking command line: /bin/sh -c cd <https://builds.apache.org/job/Hadoop-Common-trunk/ws/trunk/hadoop-common-project/hadoop-auth> && /home/jenkins/tools/java/jdk1.6.0_26/jre/bin/java -Xmx1024m -XX:+HeapDumpOnOutOfMemoryError -jar <https://builds.apache.org/job/Hadoop-Common-trunk/ws/trunk/hadoop-common-project/hadoop-auth/target/surefire/surefirebooter4694744500285947802.jar> <https://builds.apache.org/job/Hadoop-Common-trunk/ws/trunk/hadoop-common-project/hadoop-auth/target/surefire/surefire6311710749443300083tmp> <https://builds.apache.org/job/Hadoop-Common-trunk/ws/trunk/hadoop-common-project/hadoop-auth/target/surefire/surefire_14592515576878431666tmp>
Running org.apache.hadoop.security.authentication.client.TestPseudoAuthenticator
[DEBUG] boot classpath:  /home/jenkins/.m2/repository/org/apache/maven/surefire/surefire-booter/2.16/surefire-booter-2.16.jar  /home/jenkins/.m2/repository/org/apache/maven/surefire/surefire-api/2.16/surefire-api-2.16.jar  <https://builds.apache.org/job/Hadoop-Common-trunk/ws/trunk/hadoop-common-project/hadoop-auth/target/test-classes>  <https://builds.apache.org/job/Hadoop-Common-trunk/ws/trunk/hadoop-common-project/hadoop-auth/target/classes>  <https://builds.apache.org/job/Hadoop-Common-trunk/ws/trunk/hadoop-common-project/hadoop-annotations/target/hadoop-annotations-3.0.0-SNAPSHOT.jar>  /home/jenkins/tools/java/jdk1.6.0_26/jre/../lib/tools.jar  /home/jenkins/.m2/repository/junit/junit/4.10/junit-4.10.jar  /home/jenkins/.m2/repository/org/hamcrest/hamcrest-core/1.1/hamcrest-core-1.1.jar  /home/jenkins/.m2/repository/org/mockito/mockito-all/1.8.5/mockito-all-1.8.5.jar  /home/jenkins/.m2/repository/org/mortbay/jetty/jetty/6.1.26/jetty-6.1.26.jar  /home/jenkins/.m2/repository/org/mortbay/jetty/jetty-util/6.1.26/jetty-util-6.1.26.jar  /home/jenkins/.m2/repository/javax/servlet/servlet-api/2.5/servlet-api-2.5.jar  /home/jenkins/.m2/repository/org/slf4j/slf4j-api/1.7.5/slf4j-api-1.7.5.jar  /home/jenkins/.m2/repository/commons-codec/commons-codec/1.4/commons-codec-1.4.jar  /home/jenkins/.m2/repository/log4j/log4j/1.2.17/log4j-1.2.17.jar  /home/jenkins/.m2/repository/org/slf4j/slf4j-log4j12/1.7.5/slf4j-log4j12-1.7.5.jar  <https://builds.apache.org/job/Hadoop-Common-trunk/ws/trunk/hadoop-common-project/hadoop-minikdc/target/hadoop-minikdc-3.0.0-SNAPSHOT.jar>  /home/jenkins/.m2/repository/commons-io/commons-io/2.1/commons-io-2.1.jar  /home/jenkins/.m2/repository/org/apache/directory/server/apacheds-all/2.0.0-M15/apacheds-all-2.0.0-M15.jar  /home/jenkins/.m2/repository/org/apache/maven/surefire/surefire-junit4/2.16/surefire-junit4-2.16.jar
[DEBUG] boot(compact) classpath:  surefire-booter-2.16.jar  surefire-api-2.16.jar  test-classes  classes  hadoop-annotations-3.0.0-SNAPSHOT.jar  tools.jar  junit-4.10.jar  hamcrest-core-1.1.jar  mockito-all-1.8.5.jar  jetty-6.1.26.jar  jetty-util-6.1.26.jar  servlet-api-2.5.jar  slf4j-api-1.7.5.jar  commons-codec-1.4.jar  log4j-1.2.17.jar  slf4j-log4j12-1.7.5.jar  hadoop-minikdc-3.0.0-SNAPSHOT.jar  commons-io-2.1.jar  apacheds-all-2.0.0-M15.jar  surefire-junit4-2.16.jar
Forking command line: /bin/sh -c cd <https://builds.apache.org/job/Hadoop-Common-trunk/ws/trunk/hadoop-common-project/hadoop-auth> && /home/jenkins/tools/java/jdk1.6.0_26/jre/bin/java -Xmx1024m -XX:+HeapDumpOnOutOfMemoryError -jar <https://builds.apache.org/job/Hadoop-Common-trunk/ws/trunk/hadoop-common-project/hadoop-auth/target/surefire/surefirebooter3013201710856426073.jar> <https://builds.apache.org/job/Hadoop-Common-trunk/ws/trunk/hadoop-common-project/hadoop-auth/target/surefire/surefire185804019922247638tmp> <https://builds.apache.org/job/Hadoop-Common-trunk/ws/trunk/hadoop-common-project/hadoop-auth/target/surefire/surefire_23555186216141698722tmp>
Running org.apache.hadoop.security.authentication.client.TestAuthenticatedURL
Tests run: 5, Failures: 0, Errors: 0, Skipped: 0, Time elapsed: 0.347 sec - in org.apache.hadoop.security.authentication.client.TestAuthenticatedURL
[DEBUG] boot classpath:  /home/jenkins/.m2/repository/org/apache/maven/surefire/surefire-booter/2.16/surefire-booter-2.16.jar  /home/jenkins/.m2/repository/org/apache/maven/surefire/surefire-api/2.16/surefire-api-2.16.jar  <https://builds.apache.org/job/Hadoop-Common-trunk/ws/trunk/hadoop-common-project/hadoop-auth/target/test-classes>  <https://builds.apache.org/job/Hadoop-Common-trunk/ws/trunk/hadoop-common-project/hadoop-auth/target/classes>  <https://builds.apache.org/job/Hadoop-Common-trunk/ws/trunk/hadoop-common-project/hadoop-annotations/target/hadoop-annotations-3.0.0-SNAPSHOT.jar>  /home/jenkins/tools/java/jdk1.6.0_26/jre/../lib/tools.jar  /home/jenkins/.m2/repository/junit/junit/4.10/junit-4.10.jar  /home/jenkins/.m2/repository/org/hamcrest/hamcrest-core/1.1/hamcrest-core-1.1.jar  /home/jenkins/.m2/repository/org/mockito/mockito-all/1.8.5/mockito-all-1.8.5.jar  /home/jenkins/.m2/repository/org/mortbay/jetty/jetty/6.1.26/jetty-6.1.26.jar  /home/jenkins/.m2/repository/org/mortbay/jetty/jetty-util/6.1.26/jetty-util-6.1.26.jar  /home/jenkins/.m2/repository/javax/servlet/servlet-api/2.5/servlet-api-2.5.jar  /home/jenkins/.m2/repository/org/slf4j/slf4j-api/1.7.5/slf4j-api-1.7.5.jar  /home/jenkins/.m2/repository/commons-codec/commons-codec/1.4/commons-codec-1.4.jar  /home/jenkins/.m2/repository/log4j/log4j/1.2.17/log4j-1.2.17.jar  /home/jenkins/.m2/repository/org/slf4j/slf4j-log4j12/1.7.5/slf4j-log4j12-1.7.5.jar  <https://builds.apache.org/job/Hadoop-Common-trunk/ws/trunk/hadoop-common-project/hadoop-minikdc/target/hadoop-minikdc-3.0.0-SNAPSHOT.jar>  /home/jenkins/.m2/repository/commons-io/commons-io/2.1/commons-io-2.1.jar  /home/jenkins/.m2/repository/org/apache/directory/server/apacheds-all/2.0.0-M15/apacheds-all-2.0.0-M15.jar  /home/jenkins/.m2/repository/org/apache/maven/surefire/surefire-junit4/2.16/surefire-junit4-2.16.jar
[DEBUG] boot(compact) classpath:  surefire-booter-2.16.jar  surefire-api-2.16.jar  test-classes  classes  hadoop-annotations-3.0.0-SNAPSHOT.jar  tools.jar  junit-4.10.jar  hamcrest-core-1.1.jar  mockito-all-1.8.5.jar  jetty-6.1.26.jar  jetty-util-6.1.26.jar  servlet-api-2.5.jar  slf4j-api-1.7.5.jar  commons-codec-1.4.jar  log4j-1.2.17.jar  slf4j-log4j12-1.7.5.jar  hadoop-minikdc-3.0.0-SNAPSHOT.jar  commons-io-2.1.jar  apacheds-all-2.0.0-M15.jar  surefire-junit4-2.16.jar
Forking command line: /bin/sh -c cd <https://builds.apache.org/job/Hadoop-Common-trunk/ws/trunk/hadoop-common-project/hadoop-auth> && /home/jenkins/tools/java/jdk1.6.0_26/jre/bin/java -Xmx1024m -XX:+HeapDumpOnOutOfMemoryError -jar <https://builds.apache.org/job/Hadoop-Common-trunk/ws/trunk/hadoop-common-project/hadoop-auth/target/surefire/surefirebooter1927873885182392867.jar> <https://builds.apache.org/job/Hadoop-Common-trunk/ws/trunk/hadoop-common-project/hadoop-auth/target/surefire/surefire24640518840023207tmp> <https://builds.apache.org/job/Hadoop-Common-trunk/ws/trunk/hadoop-common-project/hadoop-auth/target/surefire/surefire_38788350016821322390tmp>
Running org.apache.hadoop.security.authentication.client.TestKerberosAuthenticator
Tests run: 5, Failures: 0, Errors: 0, Skipped: 0, Time elapsed: 16.704 sec - in org.apache.hadoop.security.authentication.client.TestKerberosAuthenticator
[DEBUG] boot classpath:  /home/jenkins/.m2/repository/org/apache/maven/surefire/surefire-booter/2.16/surefire-booter-2.16.jar  /home/jenkins/.m2/repository/org/apache/maven/surefire/surefire-api/2.16/surefire-api-2.16.jar  <https://builds.apache.org/job/Hadoop-Common-trunk/ws/trunk/hadoop-common-project/hadoop-auth/target/test-classes>  <https://builds.apache.org/job/Hadoop-Common-trunk/ws/trunk/hadoop-common-project/hadoop-auth/target/classes>  <https://builds.apache.org/job/Hadoop-Common-trunk/ws/trunk/hadoop-common-project/hadoop-annotations/target/hadoop-annotations-3.0.0-SNAPSHOT.jar>  /home/jenkins/tools/java/jdk1.6.0_26/jre/../lib/tools.jar  /home/jenkins/.m2/repository/junit/junit/4.10/junit-4.10.jar  /home/jenkins/.m2/repository/org/hamcrest/hamcrest-core/1.1/hamcrest-core-1.1.jar  /home/jenkins/.m2/repository/org/mockito/mockito-all/1.8.5/mockito-all-1.8.5.jar  /home/jenkins/.m2/repository/org/mortbay/jetty/jetty/6.1.26/jetty-6.1.26.jar  /home/jenkins/.m2/repository/org/mortbay/jetty/jetty-util/6.1.26/jetty-util-6.1.26.jar  /home/jenkins/.m2/repository/javax/servlet/servlet-api/2.5/servlet-api-2.5.jar  /home/jenkins/.m2/repository/org/slf4j/slf4j-api/1.7.5/slf4j-api-1.7.5.jar  /home/jenkins/.m2/repository/commons-codec/commons-codec/1.4/commons-codec-1.4.jar  /home/jenkins/.m2/repository/log4j/log4j/1.2.17/log4j-1.2.17.jar  /home/jenkins/.m2/repository/org/slf4j/slf4j-log4j12/1.7.5/slf4j-log4j12-1.7.5.jar  <https://builds.apache.org/job/Hadoop-Common-trunk/ws/trunk/hadoop-common-project/hadoop-minikdc/target/hadoop-minikdc-3.0.0-SNAPSHOT.jar>  /home/jenkins/.m2/repository/commons-io/commons-io/2.1/commons-io-2.1.jar  /home/jenkins/.m2/repository/org/apache/directory/server/apacheds-all/2.0.0-M15/apacheds-all-2.0.0-M15.jar  /home/jenkins/.m2/repository/org/apache/maven/surefire/surefire-junit4/2.16/surefire-junit4-2.16.jar
[DEBUG] boot(compact) classpath:  surefire-booter-2.16.jar  surefire-api-2.16.jar  test-classes  classes  hadoop-annotations-3.0.0-SNAPSHOT.jar  tools.jar  junit-4.10.jar  hamcrest-core-1.1.jar  mockito-all-1.8.5.jar  jetty-6.1.26.jar  jetty-util-6.1.26.jar  servlet-api-2.5.jar  slf4j-api-1.7.5.jar  commons-codec-1.4.jar  log4j-1.2.17.jar  slf4j-log4j12-1.7.5.jar  hadoop-minikdc-3.0.0-SNAPSHOT.jar  commons-io-2.1.jar  apacheds-all-2.0.0-M15.jar  surefire-junit4-2.16.jar
Forking command line: /bin/sh -c cd <https://builds.apache.org/job/Hadoop-Common-trunk/ws/trunk/hadoop-common-project/hadoop-auth> && /home/jenkins/tools/java/jdk1.6.0_26/jre/bin/java -Xmx1024m -XX:+HeapDumpOnOutOfMemoryError -jar <https://builds.apache.org/job/Hadoop-Common-trunk/ws/trunk/hadoop-common-project/hadoop-auth/target/surefire/surefirebooter3426482005301353766.jar> <https://builds.apache.org/job/Hadoop-Common-trunk/ws/trunk/hadoop-common-project/hadoop-auth/target/surefire/surefire8590019585351678700tmp> <https://builds.apache.org/job/Hadoop-Common-trunk/ws/trunk/hadoop-common-project/hadoop-auth/target/surefire/surefire_41434296554784924999tmp>
Running org.apache.hadoop.security.authentication.util.TestKerberosName
Tests run: 2, Failures: 0, Errors: 0, Skipped: 0, Time elapsed: 0.16 sec - in org.apache.hadoop.security.authentication.util.TestKerberosName
[DEBUG] boot classpath:  /home/jenkins/.m2/repository/org/apache/maven/surefire/surefire-booter/2.16/surefire-booter-2.16.jar  /home/jenkins/.m2/repository/org/apache/maven/surefire/surefire-api/2.16/surefire-api-2.16.jar  <https://builds.apache.org/job/Hadoop-Common-trunk/ws/trunk/hadoop-common-project/hadoop-auth/target/test-classes>  <https://builds.apache.org/job/Hadoop-Common-trunk/ws/trunk/hadoop-common-project/hadoop-auth/target/classes>  <https://builds.apache.org/job/Hadoop-Common-trunk/ws/trunk/hadoop-common-project/hadoop-annotations/target/hadoop-annotations-3.0.0-SNAPSHOT.jar>  /home/jenkins/tools/java/jdk1.6.0_26/jre/../lib/tools.jar  /home/jenkins/.m2/repository/junit/junit/4.10/junit-4.10.jar  /home/jenkins/.m2/repository/org/hamcrest/hamcrest-core/1.1/hamcrest-core-1.1.jar  /home/jenkins/.m2/repository/org/mockito/mockito-all/1.8.5/mockito-all-1.8.5.jar  /home/jenkins/.m2/repository/org/mortbay/jetty/jetty/6.1.26/jetty-6.1.26.jar  /home/jenkins/.m2/repository/org/mortbay/jetty/jetty-util/6.1.26/jetty-util-6.1.26.jar  /home/jenkins/.m2/repository/javax/servlet/servlet-api/2.5/servlet-api-2.5.jar  /home/jenkins/.m2/repository/org/slf4j/slf4j-api/1.7.5/slf4j-api-1.7.5.jar  /home/jenkins/.m2/repository/commons-codec/commons-codec/1.4/commons-codec-1.4.jar  /home/jenkins/.m2/repository/log4j/log4j/1.2.17/log4j-1.2.17.jar  /home/jenkins/.m2/repository/org/slf4j/slf4j-log4j12/1.7.5/slf4j-log4j12-1.7.5.jar  <https://builds.apache.org/job/Hadoop-Common-trunk/ws/trunk/hadoop-common-project/hadoop-minikdc/target/hadoop-minikdc-3.0.0-SNAPSHOT.jar>  /home/jenkins/.m2/repository/commons-io/commons-io/2.1/commons-io-2.1.jar  /home/jenkins/.m2/repository/org/apache/directory/server/apacheds-all/2.0.0-M15/apacheds-all-2.0.0-M15.jar  /home/jenkins/.m2/repository/org/apache/maven/surefire/surefire-junit4/2.16/surefire-junit4-2.16.jar
[DEBUG] boot(compact) classpath:  surefire-booter-2.16.jar  surefire-api-2.16.jar  test-classes  classes  hadoop-annotations-3.0.0-SNAPSHOT.jar  tools.jar  junit-4.10.jar  hamcrest-core-1.1.jar  mockito-all-1.8.5.jar  jetty-6.1.26.jar  jetty-util-6.1.26.jar  servlet-api-2.5.jar  slf4j-api-1.7.5.jar  commons-codec-1.4.jar  log4j-1.2.17.jar  slf4j-log4j12-1.7.5.jar  hadoop-minikdc-3.0.0-SNAPSHOT.jar  commons-io-2.1.jar  apacheds-all-2.0.0-M15.jar  surefire-junit4-2.16.jar
Forking command line: /bin/sh -c cd <https://builds.apache.org/job/Hadoop-Common-trunk/ws/trunk/hadoop-common-project/hadoop-auth> && /home/jenkins/tools/java/jdk1.6.0_26/jre/bin/java -Xmx1024m -XX:+HeapDumpOnOutOfMemoryError -jar <https://builds.apache.org/job/Hadoop-Common-trunk/ws/trunk/hadoop-common-project/hadoop-auth/target/surefire/surefirebooter1469851336734239896.jar> <https://builds.apache.org/job/Hadoop-Common-trunk/ws/trunk/hadoop-common-project/hadoop-auth/target/surefire/surefire3705204324424643541tmp> <https://builds.apache.org/job/Hadoop-Common-trunk/ws/trunk/hadoop-common-project/hadoop-auth/target/surefire/surefire_51159013039497780348tmp>
Running org.apache.hadoop.security.authentication.util.TestKerberosUtil
Tests run: 1, Failures: 0, Errors: 0, Skipped: 0, Time elapsed: 0.063 sec - in org.apache.hadoop.security.authentication.util.TestKerberosUtil
[DEBUG] boot classpath:  /home/jenkins/.m2/repository/org/apache/maven/surefire/surefire-booter/2.16/surefire-booter-2.16.jar  /home/jenkins/.m2/repository/org/apache/maven/surefire/surefire-api/2.16/surefire-api-2.16.jar  <https://builds.apache.org/job/Hadoop-Common-trunk/ws/trunk/hadoop-common-project/hadoop-auth/target/test-classes>  <https://builds.apache.org/job/Hadoop-Common-trunk/ws/trunk/hadoop-common-project/hadoop-auth/target/classes>  <https://builds.apache.org/job/Hadoop-Common-trunk/ws/trunk/hadoop-common-project/hadoop-annotations/target/hadoop-annotations-3.0.0-SNAPSHOT.jar>  /home/jenkins/tools/java/jdk1.6.0_26/jre/../lib/tools.jar  /home/jenkins/.m2/repository/junit/junit/4.10/junit-4.10.jar  /home/jenkins/.m2/repository/org/hamcrest/hamcrest-core/1.1/hamcrest-core-1.1.jar  /home/jenkins/.m2/repository/org/mockito/mockito-all/1.8.5/mockito-all-1.8.5.jar  /home/jenkins/.m2/repository/org/mortbay/jetty/jetty/6.1.26/jetty-6.1.26.jar  /home/jenkins/.m2/repository/org/mortbay/jetty/jetty-util/6.1.26/jetty-util-6.1.26.jar  /home/jenkins/.m2/repository/javax/servlet/servlet-api/2.5/servlet-api-2.5.jar  /home/jenkins/.m2/repository/org/slf4j/slf4j-api/1.7.5/slf4j-api-1.7.5.jar  /home/jenkins/.m2/repository/commons-codec/commons-codec/1.4/commons-codec-1.4.jar  /home/jenkins/.m2/repository/log4j/log4j/1.2.17/log4j-1.2.17.jar  /home/jenkins/.m2/repository/org/slf4j/slf4j-log4j12/1.7.5/slf4j-log4j12-1.7.5.jar  <https://builds.apache.org/job/Hadoop-Common-trunk/ws/trunk/hadoop-common-project/hadoop-minikdc/target/hadoop-minikdc-3.0.0-SNAPSHOT.jar>  /home/jenkins/.m2/repository/commons-io/commons-io/2.1/commons-io-2.1.jar  /home/jenkins/.m2/repository/org/apache/directory/server/apacheds-all/2.0.0-M15/apacheds-all-2.0.0-M15.jar  /home/jenkins/.m2/repository/org/apache/maven/surefire/surefire-junit4/2.16/surefire-junit4-2.16.jar
[DEBUG] boot(compact) classpath:  surefire-booter-2.16.jar  surefire-api-2.16.jar  test-classes  classes  hadoop-annotations-3.0.0-SNAPSHOT.jar  tools.jar  junit-4.10.jar  hamcrest-core-1.1.jar  mockito-all-1.8.5.jar  jetty-6.1.26.jar  jetty-util-6.1.26.jar  servlet-api-2.5.jar  slf4j-api-1.7.5.jar  commons-codec-1.4.jar  log4j-1.2.17.jar  slf4j-log4j12-1.7.5.jar  hadoop-minikdc-3.0.0-SNAPSHOT.jar  commons-io-2.1.jar  apacheds-all-2.0.0-M15.jar  surefire-junit4-2.16.jar
Forking command line: /bin/sh -c cd <https://builds.apache.org/job/Hadoop-Common-trunk/ws/trunk/hadoop-common-project/hadoop-auth> && /home/jenkins/tools/java/jdk1.6.0_26/jre/bin/java -Xmx1024m -XX:+HeapDumpOnOutOfMemoryError -jar <https://builds.apache.org/job/Hadoop-Common-trunk/ws/trunk/hadoop-common-project/hadoop-auth/target/surefire/surefirebooter1757000461023689910.jar> <https://builds.apache.org/job/Hadoop-Common-trunk/ws/trunk/hadoop-common-project/hadoop-auth/target/surefire/surefire1663143752897190017tmp> <https://builds.apache.org/job/Hadoop-Common-trunk/ws/trunk/hadoop-common-project/hadoop-auth/target/surefire/surefire_67598232142493300438tmp>
Running org.apache.hadoop.security.authentication.util.TestSigner
Tests run: 6, Failures: 0, Errors: 0, Skipped: 0, Time elapsed: 0.072 sec - in org.apache.hadoop.security.authentication.util.TestSigner
[DEBUG] boot classpath:  /home/jenkins/.m2/repository/org/apache/maven/surefire/surefire-booter/2.16/surefire-booter-2.16.jar  /home/jenkins/.m2/repository/org/apache/maven/surefire/surefire-api/2.16/surefire-api-2.16.jar  <https://builds.apache.org/job/Hadoop-Common-trunk/ws/trunk/hadoop-common-project/hadoop-auth/target/test-classes>  <https://builds.apache.org/job/Hadoop-Common-trunk/ws/trunk/hadoop-common-project/hadoop-auth/target/classes>  <https://builds.apache.org/job/Hadoop-Common-trunk/ws/trunk/hadoop-common-project/hadoop-annotations/target/hadoop-annotations-3.0.0-SNAPSHOT.jar>  /home/jenkins/tools/java/jdk1.6.0_26/jre/../lib/tools.jar  /home/jenkins/.m2/repository/junit/junit/4.10/junit-4.10.jar  /home/jenkins/.m2/repository/org/hamcrest/hamcrest-core/1.1/hamcrest-core-1.1.jar  /home/jenkins/.m2/repository/org/mockito/mockito-all/1.8.5/mockito-all-1.8.5.jar  /home/jenkins/.m2/repository/org/mortbay/jetty/jetty/6.1.26/jetty-6.1.26.jar  /home/jenkins/.m2/repository/org/mortbay/jetty/jetty-util/6.1.26/jetty-util-6.1.26.jar  /home/jenkins/.m2/repository/javax/servlet/servlet-api/2.5/servlet-api-2.5.jar  /home/jenkins/.m2/repository/org/slf4j/slf4j-api/1.7.5/slf4j-api-1.7.5.jar  /home/jenkins/.m2/repository/commons-codec/commons-codec/1.4/commons-codec-1.4.jar  /home/jenkins/.m2/repository/log4j/log4j/1.2.17/log4j-1.2.17.jar  /home/jenkins/.m2/repository/org/slf4j/slf4j-log4j12/1.7.5/slf4j-log4j12-1.7.5.jar  <https://builds.apache.org/job/Hadoop-Common-trunk/ws/trunk/hadoop-common-project/hadoop-minikdc/target/hadoop-minikdc-3.0.0-SNAPSHOT.jar>  /home/jenkins/.m2/repository/commons-io/commons-io/2.1/commons-io-2.1.jar  /home/jenkins/.m2/repository/org/apache/directory/server/apacheds-all/2.0.0-M15/apacheds-all-2.0.0-M15.jar  /home/jenkins/.m2/repository/org/apache/maven/surefire/surefire-junit4/2.16/surefire-junit4-2.16.jar
[DEBUG] boot(compact) classpath:  surefire-booter-2.16.jar  surefire-api-2.16.jar  test-classes  classes  hadoop-annotations-3.0.0-SNAPSHOT.jar  tools.jar  junit-4.10.jar  hamcrest-core-1.1.jar  mockito-all-1.8.5.jar  jetty-6.1.26.jar  jetty-util-6.1.26.jar  servlet-api-2.5.jar  slf4j-api-1.7.5.jar  commons-codec-1.4.jar  log4j-1.2.17.jar  slf4j-log4j12-1.7.5.jar  hadoop-minikdc-3.0.0-SNAPSHOT.jar  commons-io-2.1.jar  apacheds-all-2.0.0-M15.jar  surefire-junit4-2.16.jar
Forking command line: /bin/sh -c cd <https://builds.apache.org/job/Hadoop-Common-trunk/ws/trunk/hadoop-common-project/hadoop-auth> && /home/jenkins/tools/java/jdk1.6.0_26/jre/bin/java -Xmx1024m -XX:+HeapDumpOnOutOfMemoryError -jar <https://builds.apache.org/job/Hadoop-Common-trunk/ws/trunk/hadoop-common-project/hadoop-auth/target/surefire/surefirebooter7536259392008172532.jar> <https://builds.apache.org/job/Hadoop-Common-trunk/ws/trunk/hadoop-common-project/hadoop-auth/target/surefire/surefire5789013664089003118tmp> <https://builds.apache.org/job/Hadoop-Common-trunk/ws/trunk/hadoop-common-project/hadoop-auth/target/surefire/surefire_76299494162372172202tmp>
Running org.apache.hadoop.security.authentication.server.TestAuthenticationFilter
Tests run: 16, Failures: 0, Errors: 0, Skipped: 0, Time elapsed: 0.487 sec - in org.apache.hadoop.security.authentication.server.TestAuthenticationFilter
[DEBUG] boot classpath:  /home/jenkins/.m2/repository/org/apache/maven/surefire/surefire-booter/2.16/surefire-booter-2.16.jar  /home/jenkins/.m2/repository/org/apache/maven/surefire/surefire-api/2.16/surefire-api-2.16.jar  <https://builds.apache.org/job/Hadoop-Common-trunk/ws/trunk/hadoop-common-project/hadoop-auth/target/test-classes>  <https://builds.apache.org/job/Hadoop-Common-trunk/ws/trunk/hadoop-common-project/hadoop-auth/target/classes>  <https://builds.apache.org/job/Hadoop-Common-trunk/ws/trunk/hadoop-common-project/hadoop-annotations/target/hadoop-annotations-3.0.0-SNAPSHOT.jar>  /home/jenkins/tools/java/jdk1.6.0_26/jre/../lib/tools.jar  /home/jenkins/.m2/repository/junit/junit/4.10/junit-4.10.jar  /home/jenkins/.m2/repository/org/hamcrest/hamcrest-core/1.1/hamcrest-core-1.1.jar  /home/jenkins/.m2/repository/org/mockito/mockito-all/1.8.5/mockito-all-1.8.5.jar  /home/jenkins/.m2/repository/org/mortbay/jetty/jetty/6.1.26/jetty-6.1.26.jar  /home/jenkins/.m2/repository/org/mortbay/jetty/jetty-util/6.1.26/jetty-util-6.1.26.jar  /home/jenkins/.m2/repository/javax/servlet/servlet-api/2.5/servlet-api-2.5.jar  /home/jenkins/.m2/repository/org/slf4j/slf4j-api/1.7.5/slf4j-api-1.7.5.jar  /home/jenkins/.m2/repository/commons-codec/commons-codec/1.4/commons-codec-1.4.jar  /home/jenkins/.m2/repository/log4j/log4j/1.2.17/log4j-1.2.17.jar  /home/jenkins/.m2/repository/org/slf4j/slf4j-log4j12/1.7.5/slf4j-log4j12-1.7.5.jar  <https://builds.apache.org/job/Hadoop-Common-trunk/ws/trunk/hadoop-common-project/hadoop-minikdc/target/hadoop-minikdc-3.0.0-SNAPSHOT.jar>  /home/jenkins/.m2/repository/commons-io/commons-io/2.1/commons-io-2.1.jar  /home/jenkins/.m2/repository/org/apache/directory/server/apacheds-all/2.0.0-M15/apacheds-all-2.0.0-M15.jar  /home/jenkins/.m2/repository/org/apache/maven/surefire/surefire-junit4/2.16/surefire-junit4-2.16.jar
[DEBUG] boot(compact) classpath:  surefire-booter-2.16.jar  surefire-api-2.16.jar  test-classes  classes  hadoop-annotations-3.0.0-SNAPSHOT.jar  tools.jar  junit-4.10.jar  hamcrest-core-1.1.jar  mockito-all-1.8.5.jar  jetty-6.1.26.jar  jetty-util-6.1.26.jar  servlet-api-2.5.jar  slf4j-api-1.7.5.jar  commons-codec-1.4.jar  log4j-1.2.17.jar  slf4j-log4j12-1.7.5.jar  hadoop-minikdc-3.0.0-SNAPSHOT.jar  commons-io-2.1.jar  apacheds-all-2.0.0-M15.jar  surefire-junit4-2.16.jar
Forking command line: /bin/sh -c cd <https://builds.apache.org/job/Hadoop-Common-trunk/ws/trunk/hadoop-common-project/hadoop-auth> && /home/jenkins/tools/java/jdk1.6.0_26/jre/bin/java -Xmx1024m -XX:+HeapDumpOnOutOfMemoryError -jar <https://builds.apache.org/job/Hadoop-Common-trunk/ws/trunk/hadoop-common-project/hadoop-auth/target/surefire/surefirebooter8102107245425861871.jar> <https://builds.apache.org/job/Hadoop-Common-trunk/ws/trunk/hadoop-common-project/hadoop-auth/target/surefire/surefire9074806834377258376tmp> <https://builds.apache.org/job/Hadoop-Common-trunk/ws/trunk/hadoop-common-project/hadoop-auth/target/surefire/surefire_81520084167321726722tmp>
Running org.apache.hadoop.security.authentication.server.TestPseudoAuthenticationHandler
Tests run: 6, Failures: 0, Errors: 0, Skipped: 0, Time elapsed: 0.267 sec - in org.apache.hadoop.security.authentication.server.TestPseudoAuthenticationHandler
[DEBUG] boot classpath:  /home/jenkins/.m2/repository/org/apache/maven/surefire/surefire-booter/2.16/surefire-booter-2.16.jar  /home/jenkins/.m2/repository/org/apache/maven/surefire/surefire-api/2.16/surefire-api-2.16.jar  <https://builds.apache.org/job/Hadoop-Common-trunk/ws/trunk/hadoop-common-project/hadoop-auth/target/test-classes>  <https://builds.apache.org/job/Hadoop-Common-trunk/ws/trunk/hadoop-common-project/hadoop-auth/target/classes>  <https://builds.apache.org/job/Hadoop-Common-trunk/ws/trunk/hadoop-common-project/hadoop-annotations/target/hadoop-annotations-3.0.0-SNAPSHOT.jar>  /home/jenkins/tools/java/jdk1.6.0_26/jre/../lib/tools.jar  /home/jenkins/.m2/repository/junit/junit/4.10/junit-4.10.jar  /home/jenkins/.m2/repository/org/hamcrest/hamcrest-core/1.1/hamcrest-core-1.1.jar  /home/jenkins/.m2/repository/org/mockito/mockito-all/1.8.5/mockito-all-1.8.5.jar  /home/jenkins/.m2/repository/org/mortbay/jetty/jetty/6.1.26/jetty-6.1.26.jar  /home/jenkins/.m2/repository/org/mortbay/jetty/jetty-util/6.1.26/jetty-util-6.1.26.jar  /home/jenkins/.m2/repository/javax/servlet/servlet-api/2.5/servlet-api-2.5.jar  /home/jenkins/.m2/repository/org/slf4j/slf4j-api/1.7.5/slf4j-api-1.7.5.jar  /home/jenkins/.m2/repository/commons-codec/commons-codec/1.4/commons-codec-1.4.jar  /home/jenkins/.m2/repository/log4j/log4j/1.2.17/log4j-1.2.17.jar  /home/jenkins/.m2/repository/org/slf4j/slf4j-log4j12/1.7.5/slf4j-log4j12-1.7.5.jar  <https://builds.apache.org/job/Hadoop-Common-trunk/ws/trunk/hadoop-common-project/hadoop-minikdc/target/hadoop-minikdc-3.0.0-SNAPSHOT.jar>  /home/jenkins/.m2/repository/commons-io/commons-io/2.1/commons-io-2.1.jar  /home/jenkins/.m2/repository/org/apache/directory/server/apacheds-all/2.0.0-M15/apacheds-all-2.0.0-M15.jar  /home/jenkins/.m2/repository/org/apache/maven/surefire/surefire-junit4/2.16/surefire-junit4-2.16.jar
[DEBUG] boot(compact) classpath:  surefire-booter-2.16.jar  surefire-api-2.16.jar  test-classes  classes  hadoop-annotations-3.0.0-SNAPSHOT.jar  tools.jar  junit-4.10.jar  hamcrest-core-1.1.jar  mockito-all-1.8.5.jar  jetty-6.1.26.jar  jetty-util-6.1.26.jar  servlet-api-2.5.jar  slf4j-api-1.7.5.jar  commons-codec-1.4.jar  log4j-1.2.17.jar  slf4j-log4j12-1.7.5.jar  hadoop-minikdc-3.0.0-SNAPSHOT.jar  commons-io-2.1.jar  apacheds-all-2.0.0-M15.jar  surefire-junit4-2.16.jar
Forking command line: /bin/sh -c cd <https://builds.apache.org/job/Hadoop-Common-trunk/ws/trunk/hadoop-common-project/hadoop-auth> && /home/jenkins/tools/java/jdk1.6.0_26/jre/bin/java -Xmx1024m -XX:+HeapDumpOnOutOfMemoryError -jar <https://builds.apache.org/job/Hadoop-Common-trunk/ws/trunk/hadoop-common-project/hadoop-auth/target/surefire/surefirebooter5899481960990477921.jar> <https://builds.apache.org/job/Hadoop-Common-trunk/ws/trunk/hadoop-common-project/hadoop-auth/target/surefire/surefire2661272193056050718tmp> <https://builds.apache.org/job/Hadoop-Common-trunk/ws/trunk/hadoop-common-project/hadoop-auth/target/surefire/surefire_96432368035449749823tmp>
Running org.apache.hadoop.security.authentication.server.TestAltKerberosAuthenticationHandler
Tests run: 7, Failures: 0, Errors: 0, Skipped: 0, Time elapsed: 21.47 sec - in org.apache.hadoop.security.authentication.server.TestAltKerberosAuthenticationHandler
[DEBUG] boot classpath:  /home/jenkins/.m2/repository/org/apache/maven/surefire/surefire-booter/2.16/surefire-booter-2.16.jar  /home/jenkins/.m2/repository/org/apache/maven/surefire/surefire-api/2.16/surefire-api-2.16.jar  <https://builds.apache.org/job/Hadoop-Common-trunk/ws/trunk/hadoop-common-project/hadoop-auth/target/test-classes>  <https://builds.apache.org/job/Hadoop-Common-trunk/ws/trunk/hadoop-common-project/hadoop-auth/target/classes>  <https://builds.apache.org/job/Hadoop-Common-trunk/ws/trunk/hadoop-common-project/hadoop-annotations/target/hadoop-annotations-3.0.0-SNAPSHOT.jar>  /home/jenkins/tools/java/jdk1.6.0_26/jre/../lib/tools.jar  /home/jenkins/.m2/repository/junit/junit/4.10/junit-4.10.jar  /home/jenkins/.m2/repository/org/hamcrest/hamcrest-core/1.1/hamcrest-core-1.1.jar  /home/jenkins/.m2/repository/org/mockito/mockito-all/1.8.5/mockito-all-1.8.5.jar  /home/jenkins/.m2/repository/org/mortbay/jetty/jetty/6.1.26/jetty-6.1.26.jar  /home/jenkins/.m2/repository/org/mortbay/jetty/jetty-util/6.1.26/jetty-util-6.1.26.jar  /home/jenkins/.m2/repository/javax/servlet/servlet-api/2.5/servlet-api-2.5.jar  /home/jenkins/.m2/repository/org/slf4j/slf4j-api/1.7.5/slf4j-api-1.7.5.jar  /home/jenkins/.m2/repository/commons-codec/commons-codec/1.4/commons-codec-1.4.jar  /home/jenkins/.m2/repository/log4j/log4j/1.2.17/log4j-1.2.17.jar  /home/jenkins/.m2/repository/org/slf4j/slf4j-log4j12/1.7.5/slf4j-log4j12-1.7.5.jar  <https://builds.apache.org/job/Hadoop-Common-trunk/ws/trunk/hadoop-common-project/hadoop-minikdc/target/hadoop-minikdc-3.0.0-SNAPSHOT.jar>  /home/jenkins/.m2/repository/commons-io/commons-io/2.1/commons-io-2.1.jar  /home/jenkins/.m2/repository/org/apache/directory/server/apacheds-all/2.0.0-M15/apacheds-all-2.0.0-M15.jar  /home/jenkins/.m2/repository/org/apache/maven/surefire/surefire-junit4/2.16/surefire-junit4-2.16.jar
[DEBUG] boot(compact) classpath:  surefire-booter-2.16.jar  surefire-api-2.16.jar  test-classes  classes  hadoop-annotations-3.0.0-SNAPSHOT.jar  tools.jar  junit-4.10.jar  hamcrest-core-1.1.jar  mockito-all-1.8.5.jar  jetty-6.1.26.jar  jetty-util-6.1.26.jar  servlet-api-2.5.jar  slf4j-api-1.7.5.jar  commons-codec-1.4.jar  log4j-1.2.17.jar  slf4j-log4j12-1.7.5.jar  hadoop-minikdc-3.0.0-SNAPSHOT.jar  commons-io-2.1.jar  apacheds-all-2.0.0-M15.jar  surefire-junit4-2.16.jar
Forking command line: /bin/sh -c cd <https://builds.apache.org/job/Hadoop-Common-trunk/ws/trunk/hadoop-common-project/hadoop-auth> && /home/jenkins/tools/java/jdk1.6.0_26/jre/bin/java -Xmx1024m -XX:+HeapDumpOnOutOfMemoryError -jar <https://builds.apache.org/job/Hadoop-Common-trunk/ws/trunk/hadoop-common-project/hadoop-auth/target/surefire/surefirebooter5092164435851454671.jar> <https://builds.apache.org/job/Hadoop-Common-trunk/ws/trunk/hadoop-common-project/hadoop-auth/target/surefire/surefire7958689518701008859tmp> <https://builds.apache.org/job/Hadoop-Common-trunk/ws/trunk/hadoop-common-project/hadoop-auth/target/surefire/surefire_107712730946123048920tmp>
Running org.apache.hadoop.security.authentication.server.TestKerberosAuthenticationHandler
Tests run: 4, Failures: 0, Errors: 0, Skipped: 0, Time elapsed: 13.78 sec - in org.apache.hadoop.security.authentication.server.TestKerberosAuthenticationHandler
[DEBUG] boot classpath:  /home/jenkins/.m2/repository/org/apache/maven/surefire/surefire-booter/2.16/surefire-booter-2.16.jar  /home/jenkins/.m2/repository/org/apache/maven/surefire/surefire-api/2.16/surefire-api-2.16.jar  <https://builds.apache.org/job/Hadoop-Common-trunk/ws/trunk/hadoop-common-project/hadoop-auth/target/test-classes>  <https://builds.apache.org/job/Hadoop-Common-trunk/ws/trunk/hadoop-common-project/hadoop-auth/target/classes>  <https://builds.apache.org/job/Hadoop-Common-trunk/ws/trunk/hadoop-common-project/hadoop-annotations/target/hadoop-annotations-3.0.0-SNAPSHOT.jar>  /home/jenkins/tools/java/jdk1.6.0_26/jre/../lib/tools.jar  /home/jenkins/.m2/repository/junit/junit/4.10/junit-4.10.jar  /home/jenkins/.m2/repository/org/hamcrest/hamcrest-core/1.1/hamcrest-core-1.1.jar  /home/jenkins/.m2/repository/org/mockito/mockito-all/1.8.5/mockito-all-1.8.5.jar  /home/jenkins/.m2/repository/org/mortbay/jetty/jetty/6.1.26/jetty-6.1.26.jar  /home/jenkins/.m2/repository/org/mortbay/jetty/jetty-util/6.1.26/jetty-util-6.1.26.jar  /home/jenkins/.m2/repository/javax/servlet/servlet-api/2.5/servlet-api-2.5.jar  /home/jenkins/.m2/repository/org/slf4j/slf4j-api/1.7.5/slf4j-api-1.7.5.jar  /home/jenkins/.m2/repository/commons-codec/commons-codec/1.4/commons-codec-1.4.jar  /home/jenkins/.m2/repository/log4j/log4j/1.2.17/log4j-1.2.17.jar  /home/jenkins/.m2/repository/org/slf4j/slf4j-log4j12/1.7.5/slf4j-log4j12-1.7.5.jar  <https://builds.apache.org/job/Hadoop-Common-trunk/ws/trunk/hadoop-common-project/hadoop-minikdc/target/hadoop-minikdc-3.0.0-SNAPSHOT.jar>  /home/jenkins/.m2/repository/commons-io/commons-io/2.1/commons-io-2.1.jar  /home/jenkins/.m2/repository/org/apache/directory/server/apacheds-all/2.0.0-M15/apacheds-all-2.0.0-M15.jar  /home/jenkins/.m2/repository/org/apache/maven/surefire/surefire-junit4/2.16/surefire-junit4-2.16.jar
[DEBUG] boot(compact) classpath:  surefire-booter-2.16.jar  surefire-api-2.16.jar  test-classes  classes  hadoop-annotations-3.0.0-SNAPSHOT.jar  tools.jar  junit-4.10.jar  hamcrest-core-1.1.jar  mockito-all-1.8.5.jar  jetty-6.1.26.jar  jetty-util-6.1.26.jar  servlet-api-2.5.jar  slf4j-api-1.7.5.jar  commons-codec-1.4.jar  log4j-1.2.17.jar  slf4j-log4j12-1.7.5.jar  hadoop-minikdc-3.0.0-SNAPSHOT.jar  commons-io-2.1.jar  apacheds-all-2.0.0-M15.jar  surefire-junit4-2.16.jar
Forking command line: /bin/sh -c cd <https://builds.apache.org/job/Hadoop-Common-trunk/ws/trunk/hadoop-common-project/hadoop-auth> && /home/jenkins/tools/java/jdk1.6.0_26/jre/bin/java -Xmx1024m -XX:+HeapDumpOnOutOfMemoryError -jar <https://builds.apache.org/job/Hadoop-Common-trunk/ws/trunk/hadoop-common-project/hadoop-auth/target/surefire/surefirebooter5772998212693071867.jar> <https://builds.apache.org/job/Hadoop-Common-trunk/ws/trunk/hadoop-common-project/hadoop-auth/target/surefire/surefire6487556635213711084tmp> <https://builds.apache.org/job/Hadoop-Common-trunk/ws/trunk/hadoop-common-project/hadoop-auth/target/surefire/surefire_115560610598813458908tmp>
Running org.apache.hadoop.security.authentication.server.TestAuthenticationToken
Tests run: 5, Failures: 0, Errors: 0, Skipped: 0, Time elapsed: 0.199 sec - in org.apache.hadoop.security.authentication.server.TestAuthenticationToken

Results :

Tests run: 57, Failures: 0, Errors: 0, Skipped: 0

[INFO] ------------------------------------------------------------------------
[INFO] Reactor Summary:
[INFO] 
[INFO] Apache Hadoop Annotations ......................... SUCCESS [10.230s]
[INFO] Apache Hadoop MiniKDC ............................. SUCCESS [15.032s]
[INFO] Apache Hadoop Auth ................................ FAILURE [15:57.504s]
[INFO] Apache Hadoop Auth Examples ....................... SKIPPED
[INFO] Apache Hadoop Common .............................. SKIPPED
[INFO] Apache Hadoop NFS ................................. SKIPPED
[INFO] Apache Hadoop Common Project ...................... SKIPPED
[INFO] ------------------------------------------------------------------------
[INFO] BUILD FAILURE
[INFO] ------------------------------------------------------------------------
[INFO] Total time: 16:24.275s
[INFO] Finished at: Sun Nov 10 09:24:36 UTC 2013
[INFO] Final Memory: 37M/456M
[INFO] ------------------------------------------------------------------------
[ERROR] Failed to execute goal org.apache.maven.plugins:maven-surefire-plugin:2.16:test (default-test) on project hadoop-auth: There was a timeout or other error in the fork -> [Help 1]
org.apache.maven.lifecycle.LifecycleExecutionException: Failed to execute goal org.apache.maven.plugins:maven-surefire-plugin:2.16:test (default-test) on project hadoop-auth: There was a timeout or other error in the fork
	at org.apache.maven.lifecycle.internal.MojoExecutor.execute(MojoExecutor.java:213)
	at org.apache.maven.lifecycle.internal.MojoExecutor.execute(MojoExecutor.java:153)
	at org.apache.maven.lifecycle.internal.MojoExecutor.execute(MojoExecutor.java:145)
	at org.apache.maven.lifecycle.internal.LifecycleModuleBuilder.buildProject(LifecycleModuleBuilder.java:84)
	at org.apache.maven.lifecycle.internal.LifecycleModuleBuilder.buildProject(LifecycleModuleBuilder.java:59)
	at org.apache.maven.lifecycle.internal.LifecycleStarter.singleThreadedBuild(LifecycleStarter.java:183)
	at org.apache.maven.lifecycle.internal.LifecycleStarter.execute(LifecycleStarter.java:161)
	at org.apache.maven.DefaultMaven.doExecute(DefaultMaven.java:319)
	at org.apache.maven.DefaultMaven.execute(DefaultMaven.java:156)
	at org.apache.maven.cli.MavenCli.execute(MavenCli.java:537)
	at org.apache.maven.cli.MavenCli.doMain(MavenCli.java:196)
	at org.apache.maven.cli.MavenCli.main(MavenCli.java:141)
	at sun.reflect.NativeMethodAccessorImpl.invoke0(Native Method)
	at sun.reflect.NativeMethodAccessorImpl.invoke(NativeMethodAccessorImpl.java:39)
	at sun.reflect.DelegatingMethodAccessorImpl.invoke(DelegatingMethodAccessorImpl.java:25)
	at java.lang.reflect.Method.invoke(Method.java:597)
	at org.codehaus.plexus.classworlds.launcher.Launcher.launchEnhanced(Launcher.java:290)
	at org.codehaus.plexus.classworlds.launcher.Launcher.launch(Launcher.java:230)
	at org.codehaus.plexus.classworlds.launcher.Launcher.mainWithExitCode(Launcher.java:409)
	at org.codehaus.plexus.classworlds.launcher.Launcher.main(Launcher.java:352)
Caused by: org.apache.maven.plugin.MojoFailureException: There was a timeout or other error in the fork
	at org.apache.maven.plugin.surefire.SurefireHelper.reportExecution(SurefireHelper.java:82)
	at org.apache.maven.plugin.surefire.SurefirePlugin.handleSummary(SurefirePlugin.java:190)
	at org.apache.maven.plugin.surefire.AbstractSurefireMojo.executeAfterPreconditionsChecked(AbstractSurefireMojo.java:852)
	at org.apache.maven.plugin.surefire.AbstractSurefireMojo.execute(AbstractSurefireMojo.java:720)
	at org.apache.maven.plugin.DefaultBuildPluginManager.executeMojo(DefaultBuildPluginManager.java:101)
	at org.apache.maven.lifecycle.internal.MojoExecutor.execute(MojoExecutor.java:209)
	... 19 more
[ERROR] 
[ERROR] 
[ERROR] For more information about the errors and possible solutions, please read the following articles:
[ERROR] [Help 1] http://cwiki.apache.org/confluence/display/MAVEN/MojoFailureException
[ERROR] 
[ERROR] After correcting the problems, you can resume the build with the command
[ERROR]   mvn <goals> -rf :hadoop-auth
+ /home/jenkins/tools/maven/latest/bin/mvn -eaf test -Pclover -DcloverLicenseLocation=/home/jenkins/tools/clover/latest/lib/clover.license
Build step 'Execute shell' marked build as failure
Archiving artifacts
Recording test results

Mime
View raw message