hadoop-common-dev mailing list archives

Site index · List index
Message view « Date » · « Thread »
Top « Date » · « Thread »
From Apache Jenkins Server <jenk...@builds.apache.org>
Subject Build failed in Jenkins: Hadoop-Common-0.23-Build #800
Date Fri, 22 Nov 2013 09:28:59 GMT
See <https://builds.apache.org/job/Hadoop-Common-0.23-Build/800/>

------------------------------------------
[...truncated 6578 lines...]
[ERROR] <https://builds.apache.org/job/Hadoop-Common-0.23-Build/ws/trunk/hadoop-common-project/hadoop-auth/src/test/java/org/apache/hadoop/security/authentication/client/AuthenticatorTestCase.java>:[102,12]
cannot find symbol
symbol  : method stop()
location: class org.mortbay.jetty.Server
[INFO] 4 errors 
[INFO] -------------------------------------------------------------
[INFO] ------------------------------------------------------------------------
[INFO] Reactor Summary:
[INFO] 
[INFO] Apache Hadoop Annotations ......................... SUCCESS [23.923s]
[INFO] Apache Hadoop Auth ................................ FAILURE [0.994s]
[INFO] Apache Hadoop Auth Examples ....................... SKIPPED
[INFO] Apache Hadoop Common .............................. SKIPPED
[INFO] Apache Hadoop Common Project ...................... SKIPPED
[INFO] ------------------------------------------------------------------------
[INFO] BUILD FAILURE
[INFO] ------------------------------------------------------------------------
[INFO] Total time: 26.190s
[INFO] Finished at: Fri Nov 22 09:28:44 UTC 2013
[INFO] Final Memory: 35M/309M
[INFO] ------------------------------------------------------------------------
[ERROR] Failed to execute goal org.apache.maven.plugins:maven-compiler-plugin:2.5.1:testCompile
(default-testCompile) on project hadoop-auth: Compilation failure: Compilation failure:
[ERROR] <https://builds.apache.org/job/Hadoop-Common-0.23-Build/ws/trunk/hadoop-common-project/hadoop-auth/src/test/java/org/apache/hadoop/security/authentication/client/AuthenticatorTestCase.java>:[84,13]
cannot access org.mortbay.component.AbstractLifeCycle
[ERROR] class file for org.mortbay.component.AbstractLifeCycle not found
[ERROR] server = new Server(0);
[ERROR] <https://builds.apache.org/job/Hadoop-Common-0.23-Build/ws/trunk/hadoop-common-project/hadoop-auth/src/test/java/org/apache/hadoop/security/authentication/client/AuthenticatorTestCase.java>:[94,29]
cannot access org.mortbay.component.LifeCycle
[ERROR] class file for org.mortbay.component.LifeCycle not found
[ERROR] server.getConnectors()[0].setHost(host);
[ERROR] <https://builds.apache.org/job/Hadoop-Common-0.23-Build/ws/trunk/hadoop-common-project/hadoop-auth/src/test/java/org/apache/hadoop/security/authentication/client/AuthenticatorTestCase.java>:[96,10]
cannot find symbol
[ERROR] symbol  : method start()
[ERROR] location: class org.mortbay.jetty.Server
[ERROR] <https://builds.apache.org/job/Hadoop-Common-0.23-Build/ws/trunk/hadoop-common-project/hadoop-auth/src/test/java/org/apache/hadoop/security/authentication/client/AuthenticatorTestCase.java>:[102,12]
cannot find symbol
[ERROR] symbol  : method stop()
[ERROR] location: class org.mortbay.jetty.Server
[ERROR] -> [Help 1]
[ERROR] 
[ERROR] To see the full stack trace of the errors, re-run Maven with the -e switch.
[ERROR] Re-run Maven using the -X switch to enable full debug logging.
[ERROR] 
[ERROR] For more information about the errors and possible solutions, please read the following
articles:
[ERROR] [Help 1] http://cwiki.apache.org/confluence/display/MAVEN/MojoFailureException
[ERROR] 
[ERROR] After correcting the problems, you can resume the build with the command
[ERROR]   mvn <goals> -rf :hadoop-auth
+ /home/jenkins/tools/maven/latest/bin/mvn test -Pclover -DcloverLicenseLocation=/home/jenkins/tools/clover/latest/lib/clover.license
[INFO] Scanning for projects...
[INFO] ------------------------------------------------------------------------
[INFO] Reactor Build Order:
[INFO] 
[INFO] Apache Hadoop Annotations
[INFO] Apache Hadoop Auth
[INFO] Apache Hadoop Auth Examples
[INFO] Apache Hadoop Common
[INFO] Apache Hadoop Common Project
[INFO]                                                                         
[INFO] ------------------------------------------------------------------------
[INFO] Building Apache Hadoop Annotations 0.23.10-SNAPSHOT
[INFO] ------------------------------------------------------------------------
[INFO] 
[INFO] --- maven-antrun-plugin:1.6:run (create-testdirs) @ hadoop-annotations ---
[INFO] Executing tasks

main:
[INFO] Executed tasks
[INFO] 
[INFO] --- maven-dependency-plugin:2.1:build-classpath (build-classpath) @ hadoop-annotations
---
[INFO] Skipped writing classpath file '<https://builds.apache.org/job/Hadoop-Common-0.23-Build/ws/trunk/hadoop-common-project/hadoop-annotations/target/classes/mrapp-generated-classpath'.>
 No changes found.
[INFO] 
[INFO] --- maven-clover2-plugin:3.0.5:setup (setup) @ hadoop-annotations ---
[INFO] Clover Version 3.0.2, built on April 13 2010 (build-790)
[INFO] Loaded from: /home/jenkins/.m2/repository/com/cenqua/clover/clover/3.0.2/clover-3.0.2.jar
[INFO] Clover: Open Source License registered to Apache.
[INFO] Creating new database at '<https://builds.apache.org/job/Hadoop-Common-0.23-Build/ws/trunk/hadoop-common-project/hadoop-annotations/target/clover/hadoop-coverage.db'.>
[INFO] Processing files at 1.6 source level.
[INFO] Clover all over. Instrumented 8 files (2 packages).
[INFO] Elapsed time = 0.243 secs. (32.922 files/sec, 2,518.519 srclines/sec)
[INFO] No Clover instrumentation done on source files in: [<https://builds.apache.org/job/Hadoop-Common-0.23-Build/ws/trunk/hadoop-common-project/hadoop-annotations/src/test/java]>
as no matching sources files found
[INFO] 
[INFO] --- maven-resources-plugin:2.2:resources (default-resources) @ hadoop-annotations ---
[INFO] Using default encoding to copy filtered resources.
[INFO] 
[INFO] --- maven-compiler-plugin:2.5.1:compile (default-compile) @ hadoop-annotations ---
[INFO] Compiling 8 source files to <https://builds.apache.org/job/Hadoop-Common-0.23-Build/ws/trunk/hadoop-common-project/hadoop-annotations/target/classes>
[INFO] 
[INFO] --- maven-resources-plugin:2.2:testResources (default-testResources) @ hadoop-annotations
---
[INFO] Using default encoding to copy filtered resources.
[INFO] 
[INFO] --- maven-compiler-plugin:2.5.1:testCompile (default-testCompile) @ hadoop-annotations
---
[INFO] No sources to compile
[INFO] 
[INFO] --- maven-surefire-plugin:2.12.3:test (default-test) @ hadoop-annotations ---
[INFO] No tests to run.
[INFO] 
[INFO] --- maven-clover2-plugin:3.0.5:clover (clover) @ hadoop-annotations ---
[INFO] Setting property: classpath.resource.loader.class => 'org.codehaus.plexus.velocity.ContextClassLoaderResourceLoader'.
[INFO] Setting property: velocimacro.messages.on => 'false'.
[INFO] Setting property: resource.loader => 'classpath'.
[INFO] Setting property: resource.manager.logwhenfound => 'false'.
[INFO] ************************************************************** 
[INFO] Starting Jakarta Velocity v1.4
[INFO] RuntimeInstance initializing.
[INFO] Default Properties File: org/apache/velocity/runtime/defaults/velocity.properties
[INFO] Default ResourceManager initializing. (class org.apache.velocity.runtime.resource.ResourceManagerImpl)
[INFO] Resource Loader Instantiated: org.codehaus.plexus.velocity.ContextClassLoaderResourceLoader
[INFO] ClasspathResourceLoader : initialization starting.
[INFO] ClasspathResourceLoader : initialization complete.
[INFO] ResourceCache : initialized. (class org.apache.velocity.runtime.resource.ResourceCacheImpl)
[INFO] Default ResourceManager initialization complete.
[INFO] Loaded System Directive: org.apache.velocity.runtime.directive.Literal
[INFO] Loaded System Directive: org.apache.velocity.runtime.directive.Macro
[INFO] Loaded System Directive: org.apache.velocity.runtime.directive.Parse
[INFO] Loaded System Directive: org.apache.velocity.runtime.directive.Include
[INFO] Loaded System Directive: org.apache.velocity.runtime.directive.Foreach
[INFO] Created: 20 parsers.
[INFO] Velocimacro : initialization starting.
[INFO] Velocimacro : adding VMs from VM library template : VM_global_library.vm
[ERROR] ResourceManager : unable to find resource 'VM_global_library.vm' in any resource loader.
[INFO] Velocimacro : error using  VM library template VM_global_library.vm : org.apache.velocity.exception.ResourceNotFoundException:
Unable to find resource 'VM_global_library.vm'
[INFO] Velocimacro :  VM library template macro registration complete.
[INFO] Velocimacro : allowInline = true : VMs can be defined inline in templates
[INFO] Velocimacro : allowInlineToOverride = false : VMs defined inline may NOT replace previous
VM definitions
[INFO] Velocimacro : allowInlineLocal = false : VMs defined inline will be  global in scope
if allowed.
[INFO] Velocimacro : initialization complete.
[INFO] Velocity successfully started.
[INFO] Using /default-clover-report descriptor.
[INFO] Using Clover report descriptor: /tmp/mvn7381684505405040159resource
[INFO] Clover Version 3.0.2, built on April 13 2010 (build-790)
[INFO] Loaded from: /home/jenkins/.m2/repository/com/cenqua/clover/clover/3.0.2/clover-3.0.2.jar
[INFO] Clover: Open Source License registered to Apache.
[INFO] Clover is enabled with initstring '<https://builds.apache.org/job/Hadoop-Common-0.23-Build/ws/trunk/hadoop-common-project/hadoop-annotations/target/clover/hadoop-coverage.db'>
[WARNING] Clover historical directory [<https://builds.apache.org/job/Hadoop-Common-0.23-Build/ws/trunk/hadoop-common-project/hadoop-annotations/target/clover/history]>
does not exist, skipping Clover historical report generation ([<https://builds.apache.org/job/Hadoop-Common-0.23-Build/ws/trunk/hadoop-common-project/hadoop-annotations/target/clover])>
[INFO] Clover Version 3.0.2, built on April 13 2010 (build-790)
[INFO] Loaded from: /home/jenkins/.m2/repository/com/cenqua/clover/clover/3.0.2/clover-3.0.2.jar
[INFO] Clover: Open Source License registered to Apache.
[INFO] Loading coverage database from: '<https://builds.apache.org/job/Hadoop-Common-0.23-Build/ws/trunk/hadoop-common-project/hadoop-annotations/target/clover/hadoop-coverage.db'>
[INFO] Writing HTML report to '<https://builds.apache.org/job/Hadoop-Common-0.23-Build/ws/trunk/hadoop-common-project/hadoop-annotations/target/clover'>
[INFO] Done. Processed 2 packages in 1218ms (609ms per package).
[INFO] Clover Version 3.0.2, built on April 13 2010 (build-790)
[INFO] Loaded from: /home/jenkins/.m2/repository/com/cenqua/clover/clover/3.0.2/clover-3.0.2.jar
[INFO] Clover: Open Source License registered to Apache.
[INFO] Clover is enabled with initstring '<https://builds.apache.org/job/Hadoop-Common-0.23-Build/ws/trunk/hadoop-common-project/hadoop-annotations/target/clover/hadoop-coverage.db'>
[WARNING] Clover historical directory [<https://builds.apache.org/job/Hadoop-Common-0.23-Build/ws/trunk/hadoop-common-project/hadoop-annotations/target/clover/history]>
does not exist, skipping Clover historical report generation ([<https://builds.apache.org/job/Hadoop-Common-0.23-Build/ws/trunk/hadoop-common-project/hadoop-annotations/target/clover/clover.xml])>
[INFO] Clover Version 3.0.2, built on April 13 2010 (build-790)
[INFO] Loaded from: /home/jenkins/.m2/repository/com/cenqua/clover/clover/3.0.2/clover-3.0.2.jar
[INFO] Clover: Open Source License registered to Apache.
[INFO] Loading coverage database from: '<https://builds.apache.org/job/Hadoop-Common-0.23-Build/ws/trunk/hadoop-common-project/hadoop-annotations/target/clover/hadoop-coverage.db'>
[INFO] Writing report to '<https://builds.apache.org/job/Hadoop-Common-0.23-Build/ws/trunk/hadoop-common-project/hadoop-annotations/target/clover/clover.xml'>
[INFO]                                                                         
[INFO] ------------------------------------------------------------------------
[INFO] Building Apache Hadoop Auth 0.23.10-SNAPSHOT
[INFO] ------------------------------------------------------------------------
[INFO] 
[INFO] --- maven-antrun-plugin:1.6:run (create-testdirs) @ hadoop-auth ---
[INFO] Executing tasks

main:
[INFO] Executed tasks
[INFO] 
[INFO] --- maven-dependency-plugin:2.1:build-classpath (build-classpath) @ hadoop-auth ---
[INFO] Wrote classpath file '<https://builds.apache.org/job/Hadoop-Common-0.23-Build/ws/trunk/hadoop-common-project/hadoop-auth/target/classes/mrapp-generated-classpath'.>
[INFO] 
[INFO] --- maven-clover2-plugin:3.0.5:setup (setup) @ hadoop-auth ---
[INFO] Clover Version 3.0.2, built on April 13 2010 (build-790)
[INFO] Loaded from: /home/jenkins/.m2/repository/com/cenqua/clover/clover/3.0.2/clover-3.0.2.jar
[INFO] Clover: Open Source License registered to Apache.
[INFO] Creating new database at '<https://builds.apache.org/job/Hadoop-Common-0.23-Build/ws/trunk/hadoop-common-project/hadoop-auth/target/clover/hadoop-coverage.db'.>
[INFO] Processing files at 1.6 source level.
[INFO] Clover all over. Instrumented 14 files (3 packages).
[INFO] Elapsed time = 0.184 secs. (76.087 files/sec, 13,646.739 srclines/sec)
[INFO] Clover Version 3.0.2, built on April 13 2010 (build-790)
[INFO] Loaded from: /home/jenkins/.m2/repository/com/cenqua/clover/clover/3.0.2/clover-3.0.2.jar
[INFO] Clover: Open Source License registered to Apache.
[INFO] Updating existing database at '<https://builds.apache.org/job/Hadoop-Common-0.23-Build/ws/trunk/hadoop-common-project/hadoop-auth/target/clover/hadoop-coverage.db'.>
[INFO] Processing files at 1.6 source level.
[INFO] Clover all over. Instrumented 12 files (4 packages).
[INFO] 56 test methods detected.
[INFO] Elapsed time = 0.274 secs. (43.796 files/sec, 6,788.321 srclines/sec)
[INFO] 
[INFO] --- maven-resources-plugin:2.2:resources (default-resources) @ hadoop-auth ---
[INFO] Using default encoding to copy filtered resources.
[INFO] 
[INFO] --- maven-compiler-plugin:2.5.1:compile (default-compile) @ hadoop-auth ---
[INFO] Compiling 14 source files to <https://builds.apache.org/job/Hadoop-Common-0.23-Build/ws/trunk/hadoop-common-project/hadoop-auth/target/classes>
[INFO] 
[INFO] --- maven-resources-plugin:2.2:testResources (default-testResources) @ hadoop-auth
---
[INFO] Using default encoding to copy filtered resources.
[INFO] 
[INFO] --- maven-compiler-plugin:2.5.1:testCompile (default-testCompile) @ hadoop-auth ---
[INFO] Compiling 12 source files to <https://builds.apache.org/job/Hadoop-Common-0.23-Build/ws/trunk/hadoop-common-project/hadoop-auth/target/test-classes>
[INFO] -------------------------------------------------------------
[ERROR] COMPILATION ERROR : 
[INFO] -------------------------------------------------------------
[ERROR] <https://builds.apache.org/job/Hadoop-Common-0.23-Build/ws/trunk/hadoop-common-project/hadoop-auth/target/clover/src-test-instrumented/org/apache/hadoop/security/authentication/client/AuthenticatorTestCase.java>:[84,47]
cannot access org.mortbay.component.AbstractLifeCycle
class file for org.mortbay.component.AbstractLifeCycle not found
    __CLR3_0_2pgpghob88o2b.R.inc(935);server = new Server(0);
[ERROR] <https://builds.apache.org/job/Hadoop-Common-0.23-Build/ws/trunk/hadoop-common-project/hadoop-auth/target/clover/src-test-instrumented/org/apache/hadoop/security/authentication/client/AuthenticatorTestCase.java>:[94,63]
cannot access org.mortbay.component.LifeCycle
class file for org.mortbay.component.LifeCycle not found
    __CLR3_0_2pgpghob88o2b.R.inc(945);server.getConnectors()[0].setHost(host);
[ERROR] <https://builds.apache.org/job/Hadoop-Common-0.23-Build/ws/trunk/hadoop-common-project/hadoop-auth/target/clover/src-test-instrumented/org/apache/hadoop/security/authentication/client/AuthenticatorTestCase.java>:[96,44]
cannot find symbol
symbol  : method start()
location: class org.mortbay.jetty.Server
[ERROR] <https://builds.apache.org/job/Hadoop-Common-0.23-Build/ws/trunk/hadoop-common-project/hadoop-auth/target/clover/src-test-instrumented/org/apache/hadoop/security/authentication/client/AuthenticatorTestCase.java>:[102,46]
cannot find symbol
symbol  : method stop()
location: class org.mortbay.jetty.Server
[INFO] 4 errors 
[INFO] -------------------------------------------------------------
[INFO] ------------------------------------------------------------------------
[INFO] Reactor Summary:
[INFO] 
[INFO] Apache Hadoop Annotations ......................... SUCCESS [8.376s]
[INFO] Apache Hadoop Auth ................................ FAILURE [2.344s]
[INFO] Apache Hadoop Auth Examples ....................... SKIPPED
[INFO] Apache Hadoop Common .............................. SKIPPED
[INFO] Apache Hadoop Common Project ...................... SKIPPED
[INFO] ------------------------------------------------------------------------
[INFO] BUILD FAILURE
[INFO] ------------------------------------------------------------------------
[INFO] Total time: 11.168s
[INFO] Finished at: Fri Nov 22 09:28:56 UTC 2013
[INFO] Final Memory: 20M/153M
[INFO] ------------------------------------------------------------------------
[ERROR] Failed to execute goal org.apache.maven.plugins:maven-compiler-plugin:2.5.1:testCompile
(default-testCompile) on project hadoop-auth: Compilation failure: Compilation failure:
[ERROR] <https://builds.apache.org/job/Hadoop-Common-0.23-Build/ws/trunk/hadoop-common-project/hadoop-auth/target/clover/src-test-instrumented/org/apache/hadoop/security/authentication/client/AuthenticatorTestCase.java>:[84,47]
cannot access org.mortbay.component.AbstractLifeCycle
[ERROR] class file for org.mortbay.component.AbstractLifeCycle not found
[ERROR] __CLR3_0_2pgpghob88o2b.R.inc(935);server = new Server(0);
[ERROR] <https://builds.apache.org/job/Hadoop-Common-0.23-Build/ws/trunk/hadoop-common-project/hadoop-auth/target/clover/src-test-instrumented/org/apache/hadoop/security/authentication/client/AuthenticatorTestCase.java>:[94,63]
cannot access org.mortbay.component.LifeCycle
[ERROR] class file for org.mortbay.component.LifeCycle not found
[ERROR] __CLR3_0_2pgpghob88o2b.R.inc(945);server.getConnectors()[0].setHost(host);
[ERROR] <https://builds.apache.org/job/Hadoop-Common-0.23-Build/ws/trunk/hadoop-common-project/hadoop-auth/target/clover/src-test-instrumented/org/apache/hadoop/security/authentication/client/AuthenticatorTestCase.java>:[96,44]
cannot find symbol
[ERROR] symbol  : method start()
[ERROR] location: class org.mortbay.jetty.Server
[ERROR] <https://builds.apache.org/job/Hadoop-Common-0.23-Build/ws/trunk/hadoop-common-project/hadoop-auth/target/clover/src-test-instrumented/org/apache/hadoop/security/authentication/client/AuthenticatorTestCase.java>:[102,46]
cannot find symbol
[ERROR] symbol  : method stop()
[ERROR] location: class org.mortbay.jetty.Server
[ERROR] -> [Help 1]
[ERROR] 
[ERROR] To see the full stack trace of the errors, re-run Maven with the -e switch.
[ERROR] Re-run Maven using the -X switch to enable full debug logging.
[ERROR] 
[ERROR] For more information about the errors and possible solutions, please read the following
articles:
[ERROR] [Help 1] http://cwiki.apache.org/confluence/display/MAVEN/MojoFailureException
[ERROR] 
[ERROR] After correcting the problems, you can resume the build with the command
[ERROR]   mvn <goals> -rf :hadoop-auth
Build step 'Execute shell' marked build as failure
[WARNINGS] Skipping publisher since build result is FAILURE
Archiving artifacts
Recording fingerprints
Publishing Javadoc
Recording test results

Mime
View raw message