hadoop-common-dev mailing list archives

Site index · List index
Message view « Date » · « Thread »
Top « Date » · « Thread »
From "samar.opensource" <samar.opensou...@gmail.com>
Subject Re: build failure: A required class is missing: org/apache/maven/surefire/util/NestedCheckedException
Date Thu, 09 May 2013 06:35:32 GMT
Apache Maven 3.0.3

On 09/05/13 11:49 AM, Harsh J wrote:
> What version of Apache Maven are you using?
>
> On Thu, May 9, 2013 at 11:44 AM, samar.opensource
> <samar.opensource@gmail.com> wrote:
>> Hi Devs,
>>
>>   I am getting the following error building the trunk .
>> [ERROR] Failed to execute goal
>> org.apache.maven.plugins:maven-surefire-plugin:2.12.3:test
>> (default-test) on project hadoop-annotations: Execution default-test of
>> goal org.apache.maven.plugins:maven-surefire-plugin:2.12.3:test failed:
>> Unable to load the mojo 'test' in the plugin
>> 'org.apache.maven.plugins:maven-surefire-plugin:2.12.3'. A required
>> class is missing: org/apache/maven/surefire/util/NestedCheckedException
>> [ERROR] -----------------------------------------------------
>> [ERROR] realm = plugin>org.apache.maven.plugins:maven-surefire-plugin:2.12.3
>> [ERROR] strategy =
>> org.codehaus.plexus.classworlds.strategy.SelfFirstStrategy
>>
>> I have pulled the code from git(https://github.com/apache/hadoop-common.git)
>>
>> I used mvn clean install to build
>>
>> I tried deleting my local maven repository but dint seem to help
>> much(http://jira.codehaus.org/browse/SUREFIRE-85)
>>
>>
>>
>> Regards,
>> Samar
>>
>>
>>
>
>


Mime
  • Unnamed multipart/alternative (inline, None, 0 bytes)
View raw message