hadoop-common-dev mailing list archives

Site index · List index
Message view « Date » · « Thread »
Top « Date » · « Thread »
From Apache Jenkins Server <jenk...@builds.apache.org>
Subject Build failed in Jenkins: Hadoop-Common-trunk #643
Date Fri, 04 Jan 2013 09:08:11 GMT
See <https://builds.apache.org/job/Hadoop-Common-trunk/643/changes>

Changes:

[szetszwo] HDFS-4270. Introduce soft and hard limits for max replication so that replications
of the highest priority are allowed to choose a source datanode that has reached its soft
limit but not the hard limit.  Contributed by Derek Dagit

[todd] HDFS-4352. Encapsulate arguments to BlockReaderFactory in a class. Contributed by Colin
Patrick McCabe.

[todd] HDFS-4302. Fix fatal exception when starting NameNode with DEBUG logs. Contributed
by Eugene Koontz.

[atm] Add file which was accidentally missed during commit of HDFS-4346.

[sseth] YARN-103. Add a yarn AM-RM client module. Contributed by Bikas Saha.

[bobby] MAPREDUCE-4279. getClusterStatus() fails with null pointer exception when running
jobs in local mode (Devaraj K via bobby)

[tomwhite] YARN-301. Fair scheduler throws ConcurrentModificationException when iterating
over app's priorities. Contributed by Sandy Ryza.

[tomwhite] YARN-300. After YARN-271, fair scheduler can infinite loop and not schedule any
application. Contributed by Sandy Ryza.

[tomwhite] YARN-288. Fair scheduler queue doesn't accept any jobs when ACLs are configured.
Contributed by Sandy Ryza.

[tomwhite] YARN-192. Node update causes NPE in the fair scheduler. Contributed by Sandy Ryza

------------------------------------------
[...truncated 25959 lines...]
   layout: none
Setting project property: settings.localRepository -> /home/jenkins/.m2/repository
Setting project property: org.apache.hadoop:hadoop-annotations:jar -> <https://builds.apache.org/job/Hadoop-Common-trunk/ws/trunk/hadoop-common-project/hadoop-annotations/target/hadoop-annotations-3.0.0-SNAPSHOT.jar>
Setting project property: com.google.guava:guava:jar -> /home/jenkins/.m2/repository/com/google/guava/guava/11.0.2/guava-11.0.2.jar
Setting project property: com.google.code.findbugs:jsr305:jar -> /home/jenkins/.m2/repository/com/google/code/findbugs/jsr305/1.3.9/jsr305-1.3.9.jar
Setting project property: commons-cli:commons-cli:jar -> /home/jenkins/.m2/repository/commons-cli/commons-cli/1.2/commons-cli-1.2.jar
Setting project property: org.apache.commons:commons-math:jar -> /home/jenkins/.m2/repository/org/apache/commons/commons-math/2.1/commons-math-2.1.jar
Setting project property: xmlenc:xmlenc:jar -> /home/jenkins/.m2/repository/xmlenc/xmlenc/0.52/xmlenc-0.52.jar
Setting project property: commons-httpclient:commons-httpclient:jar -> /home/jenkins/.m2/repository/commons-httpclient/commons-httpclient/3.1/commons-httpclient-3.1.jar
Setting project property: commons-codec:commons-codec:jar -> /home/jenkins/.m2/repository/commons-codec/commons-codec/1.4/commons-codec-1.4.jar
Setting project property: commons-io:commons-io:jar -> /home/jenkins/.m2/repository/commons-io/commons-io/2.1/commons-io-2.1.jar
Setting project property: commons-net:commons-net:jar -> /home/jenkins/.m2/repository/commons-net/commons-net/3.1/commons-net-3.1.jar
Setting project property: javax.servlet:servlet-api:jar -> /home/jenkins/.m2/repository/javax/servlet/servlet-api/2.5/servlet-api-2.5.jar
Setting project property: org.mortbay.jetty:jetty:jar -> /home/jenkins/.m2/repository/org/mortbay/jetty/jetty/6.1.26/jetty-6.1.26.jar
Setting project property: org.mortbay.jetty:jetty-util:jar -> /home/jenkins/.m2/repository/org/mortbay/jetty/jetty-util/6.1.26/jetty-util-6.1.26.jar
Setting project property: com.sun.jersey:jersey-core:jar -> /home/jenkins/.m2/repository/com/sun/jersey/jersey-core/1.8/jersey-core-1.8.jar
Setting project property: com.sun.jersey:jersey-json:jar -> /home/jenkins/.m2/repository/com/sun/jersey/jersey-json/1.8/jersey-json-1.8.jar
Setting project property: org.codehaus.jettison:jettison:jar -> /home/jenkins/.m2/repository/org/codehaus/jettison/jettison/1.1/jettison-1.1.jar
Setting project property: stax:stax-api:jar -> /home/jenkins/.m2/repository/stax/stax-api/1.0.1/stax-api-1.0.1.jar
Setting project property: com.sun.xml.bind:jaxb-impl:jar -> /home/jenkins/.m2/repository/com/sun/xml/bind/jaxb-impl/2.2.3-1/jaxb-impl-2.2.3-1.jar
Setting project property: javax.xml.bind:jaxb-api:jar -> /home/jenkins/.m2/repository/javax/xml/bind/jaxb-api/2.2.2/jaxb-api-2.2.2.jar
Setting project property: javax.activation:activation:jar -> /home/jenkins/.m2/repository/javax/activation/activation/1.1/activation-1.1.jar
Setting project property: org.codehaus.jackson:jackson-jaxrs:jar -> /home/jenkins/.m2/repository/org/codehaus/jackson/jackson-jaxrs/1.8.8/jackson-jaxrs-1.8.8.jar
Setting project property: org.codehaus.jackson:jackson-xc:jar -> /home/jenkins/.m2/repository/org/codehaus/jackson/jackson-xc/1.8.8/jackson-xc-1.8.8.jar
Setting project property: com.sun.jersey:jersey-server:jar -> /home/jenkins/.m2/repository/com/sun/jersey/jersey-server/1.8/jersey-server-1.8.jar
Setting project property: asm:asm:jar -> /home/jenkins/.m2/repository/asm/asm/3.2/asm-3.2.jar
Setting project property: tomcat:jasper-compiler:jar -> /home/jenkins/.m2/repository/tomcat/jasper-compiler/5.5.23/jasper-compiler-5.5.23.jar
Setting project property: tomcat:jasper-runtime:jar -> /home/jenkins/.m2/repository/tomcat/jasper-runtime/5.5.23/jasper-runtime-5.5.23.jar
Setting project property: javax.servlet.jsp:jsp-api:jar -> /home/jenkins/.m2/repository/javax/servlet/jsp/jsp-api/2.1/jsp-api-2.1.jar
Setting project property: commons-el:commons-el:jar -> /home/jenkins/.m2/repository/commons-el/commons-el/1.0/commons-el-1.0.jar
Setting project property: commons-logging:commons-logging:jar -> /home/jenkins/.m2/repository/commons-logging/commons-logging/1.1.1/commons-logging-1.1.1.jar
Setting project property: log4j:log4j:jar -> /home/jenkins/.m2/repository/log4j/log4j/1.2.17/log4j-1.2.17.jar
Setting project property: net.java.dev.jets3t:jets3t:jar -> /home/jenkins/.m2/repository/net/java/dev/jets3t/jets3t/0.6.1/jets3t-0.6.1.jar
Setting project property: junit:junit:jar -> /home/jenkins/.m2/repository/junit/junit/4.8.2/junit-4.8.2.jar
Setting project property: commons-lang:commons-lang:jar -> /home/jenkins/.m2/repository/commons-lang/commons-lang/2.5/commons-lang-2.5.jar
Setting project property: commons-configuration:commons-configuration:jar -> /home/jenkins/.m2/repository/commons-configuration/commons-configuration/1.6/commons-configuration-1.6.jar
Setting project property: commons-collections:commons-collections:jar -> /home/jenkins/.m2/repository/commons-collections/commons-collections/3.2.1/commons-collections-3.2.1.jar
Setting project property: commons-digester:commons-digester:jar -> /home/jenkins/.m2/repository/commons-digester/commons-digester/1.8/commons-digester-1.8.jar
Setting project property: commons-beanutils:commons-beanutils:jar -> /home/jenkins/.m2/repository/commons-beanutils/commons-beanutils/1.7.0/commons-beanutils-1.7.0.jar
Setting project property: commons-beanutils:commons-beanutils-core:jar -> /home/jenkins/.m2/repository/commons-beanutils/commons-beanutils-core/1.8.0/commons-beanutils-core-1.8.0.jar
Setting project property: org.slf4j:slf4j-api:jar -> /home/jenkins/.m2/repository/org/slf4j/slf4j-api/1.6.1/slf4j-api-1.6.1.jar
Setting project property: org.slf4j:slf4j-log4j12:jar -> /home/jenkins/.m2/repository/org/slf4j/slf4j-log4j12/1.6.1/slf4j-log4j12-1.6.1.jar
Setting project property: org.codehaus.jackson:jackson-core-asl:jar -> /home/jenkins/.m2/repository/org/codehaus/jackson/jackson-core-asl/1.8.8/jackson-core-asl-1.8.8.jar
Setting project property: org.codehaus.jackson:jackson-mapper-asl:jar -> /home/jenkins/.m2/repository/org/codehaus/jackson/jackson-mapper-asl/1.8.8/jackson-mapper-asl-1.8.8.jar
Setting project property: org.mockito:mockito-all:jar -> /home/jenkins/.m2/repository/org/mockito/mockito-all/1.8.5/mockito-all-1.8.5.jar
Setting project property: org.apache.avro:avro:jar -> /home/jenkins/.m2/repository/org/apache/avro/avro/1.5.3/avro-1.5.3.jar
Setting project property: com.thoughtworks.paranamer:paranamer:jar -> /home/jenkins/.m2/repository/com/thoughtworks/paranamer/paranamer/2.3/paranamer-2.3.jar
Setting project property: org.xerial.snappy:snappy-java:jar -> /home/jenkins/.m2/repository/org/xerial/snappy/snappy-java/1.0.3.2/snappy-java-1.0.3.2.jar
Setting project property: org.apache.ant:ant:jar -> /home/jenkins/.m2/repository/org/apache/ant/ant/1.8.1/ant-1.8.1.jar
Setting project property: org.apache.ant:ant-launcher:jar -> /home/jenkins/.m2/repository/org/apache/ant/ant-launcher/1.8.1/ant-launcher-1.8.1.jar
Setting project property: com.google.protobuf:protobuf-java:jar -> /home/jenkins/.m2/repository/com/google/protobuf/protobuf-java/2.4.0a/protobuf-java-2.4.0a.jar
Setting project property: org.apache.hadoop:hadoop-auth:jar -> <https://builds.apache.org/job/Hadoop-Common-trunk/ws/trunk/hadoop-common-project/hadoop-auth/target/hadoop-auth-3.0.0-SNAPSHOT.jar>
Setting project property: com.jcraft:jsch:jar -> /home/jenkins/.m2/repository/com/jcraft/jsch/0.1.42/jsch-0.1.42.jar
Setting project property: org.apache.zookeeper:zookeeper:jar -> /home/jenkins/.m2/repository/org/apache/zookeeper/zookeeper/3.4.2/zookeeper-3.4.2.jar
Setting project property: jline:jline:jar -> /home/jenkins/.m2/repository/jline/jline/0.9.94/jline-0.9.94.jar
Setting project property: org.jboss.netty:netty:jar -> /home/jenkins/.m2/repository/org/jboss/netty/netty/3.2.4.Final/netty-3.2.4.Final.jar
Setting project property: org.apache.zookeeper:zookeeper:test-jar:tests -> /home/jenkins/.m2/repository/org/apache/zookeeper/zookeeper/3.4.2/zookeeper-3.4.2-tests.jar
Setting project property: jdk.tools:jdk.tools:jar -> /home/jenkins/tools/java/jdk1.6.0_26/jre/../lib/tools.jar
Setting project property: maven.project.dependencies.versions -> 3.0.0-SNAPSHOT:11.0.2:1.3.9:1.2:2.1:0.52:3.1:1.4:2.1:3.1:2.5:6.1.26:6.1.26:1.8:1.8:1.1:1.0.1:2.2.3-1:2.2.2:1.1:1.8.8:1.8.8:1.8:3.2:5.5.23:5.5.23:2.1:1.0:1.1.1:1.2.17:0.6.1:4.8.2:2.5:1.6:3.2.1:1.8:1.7.0:1.8.0:1.6.1:1.6.1:1.8.8:1.8.8:1.8.5:1.5.3:2.3:1.0.3.2:1.8.1:1.8.1:2.4.0a:3.0.0-SNAPSHOT:0.1.42:3.4.2:0.9.94:3.2.4.Final:3.4.2:1.6:
Setting project property: maven.dependency.org.apache.hadoop.hadoop-annotations.jar.path ->
<https://builds.apache.org/job/Hadoop-Common-trunk/ws/trunk/hadoop-common-project/hadoop-annotations/target/hadoop-annotations-3.0.0-SNAPSHOT.jar>
Setting project property: maven.dependency.com.google.guava.guava.jar.path -> /home/jenkins/.m2/repository/com/google/guava/guava/11.0.2/guava-11.0.2.jar
Setting project property: maven.dependency.com.google.code.findbugs.jsr305.jar.path ->
/home/jenkins/.m2/repository/com/google/code/findbugs/jsr305/1.3.9/jsr305-1.3.9.jar
Setting project property: maven.dependency.commons-cli.commons-cli.jar.path -> /home/jenkins/.m2/repository/commons-cli/commons-cli/1.2/commons-cli-1.2.jar
Setting project property: maven.dependency.org.apache.commons.commons-math.jar.path ->
/home/jenkins/.m2/repository/org/apache/commons/commons-math/2.1/commons-math-2.1.jar
Setting project property: maven.dependency.xmlenc.xmlenc.jar.path -> /home/jenkins/.m2/repository/xmlenc/xmlenc/0.52/xmlenc-0.52.jar
Setting project property: maven.dependency.commons-httpclient.commons-httpclient.jar.path
-> /home/jenkins/.m2/repository/commons-httpclient/commons-httpclient/3.1/commons-httpclient-3.1.jar
Setting project property: maven.dependency.commons-codec.commons-codec.jar.path -> /home/jenkins/.m2/repository/commons-codec/commons-codec/1.4/commons-codec-1.4.jar
Setting project property: maven.dependency.commons-io.commons-io.jar.path -> /home/jenkins/.m2/repository/commons-io/commons-io/2.1/commons-io-2.1.jar
Setting project property: maven.dependency.commons-net.commons-net.jar.path -> /home/jenkins/.m2/repository/commons-net/commons-net/3.1/commons-net-3.1.jar
Setting project property: maven.dependency.javax.servlet.servlet-api.jar.path -> /home/jenkins/.m2/repository/javax/servlet/servlet-api/2.5/servlet-api-2.5.jar
Setting project property: maven.dependency.org.mortbay.jetty.jetty.jar.path -> /home/jenkins/.m2/repository/org/mortbay/jetty/jetty/6.1.26/jetty-6.1.26.jar
Setting project property: maven.dependency.org.mortbay.jetty.jetty-util.jar.path -> /home/jenkins/.m2/repository/org/mortbay/jetty/jetty-util/6.1.26/jetty-util-6.1.26.jar
Setting project property: maven.dependency.com.sun.jersey.jersey-core.jar.path -> /home/jenkins/.m2/repository/com/sun/jersey/jersey-core/1.8/jersey-core-1.8.jar
Setting project property: maven.dependency.com.sun.jersey.jersey-json.jar.path -> /home/jenkins/.m2/repository/com/sun/jersey/jersey-json/1.8/jersey-json-1.8.jar
Setting project property: maven.dependency.org.codehaus.jettison.jettison.jar.path -> /home/jenkins/.m2/repository/org/codehaus/jettison/jettison/1.1/jettison-1.1.jar
Setting project property: maven.dependency.stax.stax-api.jar.path -> /home/jenkins/.m2/repository/stax/stax-api/1.0.1/stax-api-1.0.1.jar
Setting project property: maven.dependency.com.sun.xml.bind.jaxb-impl.jar.path -> /home/jenkins/.m2/repository/com/sun/xml/bind/jaxb-impl/2.2.3-1/jaxb-impl-2.2.3-1.jar
Setting project property: maven.dependency.javax.xml.bind.jaxb-api.jar.path -> /home/jenkins/.m2/repository/javax/xml/bind/jaxb-api/2.2.2/jaxb-api-2.2.2.jar
Setting project property: maven.dependency.javax.activation.activation.jar.path -> /home/jenkins/.m2/repository/javax/activation/activation/1.1/activation-1.1.jar
Setting project property: maven.dependency.org.codehaus.jackson.jackson-jaxrs.jar.path ->
/home/jenkins/.m2/repository/org/codehaus/jackson/jackson-jaxrs/1.8.8/jackson-jaxrs-1.8.8.jar
Setting project property: maven.dependency.org.codehaus.jackson.jackson-xc.jar.path ->
/home/jenkins/.m2/repository/org/codehaus/jackson/jackson-xc/1.8.8/jackson-xc-1.8.8.jar
Setting project property: maven.dependency.com.sun.jersey.jersey-server.jar.path -> /home/jenkins/.m2/repository/com/sun/jersey/jersey-server/1.8/jersey-server-1.8.jar
Setting project property: maven.dependency.asm.asm.jar.path -> /home/jenkins/.m2/repository/asm/asm/3.2/asm-3.2.jar
Setting project property: maven.dependency.tomcat.jasper-compiler.jar.path -> /home/jenkins/.m2/repository/tomcat/jasper-compiler/5.5.23/jasper-compiler-5.5.23.jar
Setting project property: maven.dependency.tomcat.jasper-runtime.jar.path -> /home/jenkins/.m2/repository/tomcat/jasper-runtime/5.5.23/jasper-runtime-5.5.23.jar
Setting project property: maven.dependency.javax.servlet.jsp.jsp-api.jar.path -> /home/jenkins/.m2/repository/javax/servlet/jsp/jsp-api/2.1/jsp-api-2.1.jar
Setting project property: maven.dependency.commons-el.commons-el.jar.path -> /home/jenkins/.m2/repository/commons-el/commons-el/1.0/commons-el-1.0.jar
Setting project property: maven.dependency.commons-logging.commons-logging.jar.path ->
/home/jenkins/.m2/repository/commons-logging/commons-logging/1.1.1/commons-logging-1.1.1.jar
Setting project property: maven.dependency.log4j.log4j.jar.path -> /home/jenkins/.m2/repository/log4j/log4j/1.2.17/log4j-1.2.17.jar
Setting project property: maven.dependency.net.java.dev.jets3t.jets3t.jar.path -> /home/jenkins/.m2/repository/net/java/dev/jets3t/jets3t/0.6.1/jets3t-0.6.1.jar
Setting project property: maven.dependency.junit.junit.jar.path -> /home/jenkins/.m2/repository/junit/junit/4.8.2/junit-4.8.2.jar
Setting project property: maven.dependency.commons-lang.commons-lang.jar.path -> /home/jenkins/.m2/repository/commons-lang/commons-lang/2.5/commons-lang-2.5.jar
Setting project property: maven.dependency.commons-configuration.commons-configuration.jar.path
-> /home/jenkins/.m2/repository/commons-configuration/commons-configuration/1.6/commons-configuration-1.6.jar
Setting project property: maven.dependency.commons-collections.commons-collections.jar.path
-> /home/jenkins/.m2/repository/commons-collections/commons-collections/3.2.1/commons-collections-3.2.1.jar
Setting project property: maven.dependency.commons-digester.commons-digester.jar.path ->
/home/jenkins/.m2/repository/commons-digester/commons-digester/1.8/commons-digester-1.8.jar
Setting project property: maven.dependency.commons-beanutils.commons-beanutils.jar.path ->
/home/jenkins/.m2/repository/commons-beanutils/commons-beanutils/1.7.0/commons-beanutils-1.7.0.jar
Setting project property: maven.dependency.commons-beanutils.commons-beanutils-core.jar.path
-> /home/jenkins/.m2/repository/commons-beanutils/commons-beanutils-core/1.8.0/commons-beanutils-core-1.8.0.jar
Setting project property: maven.dependency.org.slf4j.slf4j-api.jar.path -> /home/jenkins/.m2/repository/org/slf4j/slf4j-api/1.6.1/slf4j-api-1.6.1.jar
Setting project property: maven.dependency.org.slf4j.slf4j-log4j12.jar.path -> /home/jenkins/.m2/repository/org/slf4j/slf4j-log4j12/1.6.1/slf4j-log4j12-1.6.1.jar
Setting project property: maven.dependency.org.codehaus.jackson.jackson-core-asl.jar.path
-> /home/jenkins/.m2/repository/org/codehaus/jackson/jackson-core-asl/1.8.8/jackson-core-asl-1.8.8.jar
Setting project property: maven.dependency.org.codehaus.jackson.jackson-mapper-asl.jar.path
-> /home/jenkins/.m2/repository/org/codehaus/jackson/jackson-mapper-asl/1.8.8/jackson-mapper-asl-1.8.8.jar
Setting project property: maven.dependency.org.mockito.mockito-all.jar.path -> /home/jenkins/.m2/repository/org/mockito/mockito-all/1.8.5/mockito-all-1.8.5.jar
Setting project property: maven.dependency.org.apache.avro.avro.jar.path -> /home/jenkins/.m2/repository/org/apache/avro/avro/1.5.3/avro-1.5.3.jar
Setting project property: maven.dependency.com.thoughtworks.paranamer.paranamer.jar.path ->
/home/jenkins/.m2/repository/com/thoughtworks/paranamer/paranamer/2.3/paranamer-2.3.jar
Setting project property: maven.dependency.org.xerial.snappy.snappy-java.jar.path -> /home/jenkins/.m2/repository/org/xerial/snappy/snappy-java/1.0.3.2/snappy-java-1.0.3.2.jar
Setting project property: maven.dependency.org.apache.ant.ant.jar.path -> /home/jenkins/.m2/repository/org/apache/ant/ant/1.8.1/ant-1.8.1.jar
Setting project property: maven.dependency.org.apache.ant.ant-launcher.jar.path -> /home/jenkins/.m2/repository/org/apache/ant/ant-launcher/1.8.1/ant-launcher-1.8.1.jar
Setting project property: maven.dependency.com.google.protobuf.protobuf-java.jar.path ->
/home/jenkins/.m2/repository/com/google/protobuf/protobuf-java/2.4.0a/protobuf-java-2.4.0a.jar
Setting project property: maven.dependency.org.apache.hadoop.hadoop-auth.jar.path -> <https://builds.apache.org/job/Hadoop-Common-trunk/ws/trunk/hadoop-common-project/hadoop-auth/target/hadoop-auth-3.0.0-SNAPSHOT.jar>
Setting project property: maven.dependency.com.jcraft.jsch.jar.path -> /home/jenkins/.m2/repository/com/jcraft/jsch/0.1.42/jsch-0.1.42.jar
Setting project property: maven.dependency.org.apache.zookeeper.zookeeper.jar.path -> /home/jenkins/.m2/repository/org/apache/zookeeper/zookeeper/3.4.2/zookeeper-3.4.2.jar
Setting project property: maven.dependency.jline.jline.jar.path -> /home/jenkins/.m2/repository/jline/jline/0.9.94/jline-0.9.94.jar
Setting project property: maven.dependency.org.jboss.netty.netty.jar.path -> /home/jenkins/.m2/repository/org/jboss/netty/netty/3.2.4.Final/netty-3.2.4.Final.jar
Setting project property: maven.dependency.org.apache.zookeeper.zookeeper.tests.test-jar.path
-> /home/jenkins/.m2/repository/org/apache/zookeeper/zookeeper/3.4.2/zookeeper-3.4.2-tests.jar
Setting project property: maven.dependency.jdk.tools.jdk.tools.jar.path -> /home/jenkins/tools/java/jdk1.6.0_26/jre/../lib/tools.jar
[INFO] Executing tasks
Build sequence for target(s) `main' is [main]
Complete build sequence is [main, ]

main:
    [mkdir] Created dir: <https://builds.apache.org/job/Hadoop-Common-trunk/ws/trunk/hadoop-common-project/hadoop-common/target/generated-sources/java>
    [mkdir] Created dir: <https://builds.apache.org/job/Hadoop-Common-trunk/ws/trunk/hadoop-common-project/hadoop-common/target/generated-test-sources/java>
[INFO] Executed tasks
[INFO] 
[INFO] --- exec-maven-plugin:1.2:exec (compile-proto) @ hadoop-common ---
[DEBUG] org.codehaus.mojo:exec-maven-plugin:jar:1.2:
[DEBUG]    org.apache.maven:maven-toolchain:jar:1.0:compile
[DEBUG]    org.apache.maven:maven-project:jar:2.0.6:compile
[DEBUG]       org.apache.maven:maven-settings:jar:2.0.6:compile
[DEBUG]       org.apache.maven:maven-profile:jar:2.0.6:compile
[DEBUG]       org.apache.maven:maven-plugin-registry:jar:2.0.6:compile
[DEBUG]    org.apache.maven:maven-model:jar:2.0.6:compile
[DEBUG]    org.apache.maven:maven-artifact:jar:2.0.6:compile
[DEBUG]    org.apache.maven:maven-artifact-manager:jar:2.0.6:compile
[DEBUG]       org.apache.maven:maven-repository-metadata:jar:2.0.6:compile
[DEBUG]    org.apache.maven:maven-core:jar:2.0.6:compile
[DEBUG]       org.apache.maven:maven-plugin-parameter-documenter:jar:2.0.6:compile
[DEBUG]       org.apache.maven.reporting:maven-reporting-api:jar:2.0.6:compile
[DEBUG]          org.apache.maven.doxia:doxia-sink-api:jar:1.0-alpha-7:compile
[DEBUG]       org.apache.maven:maven-error-diagnostics:jar:2.0.6:compile
[DEBUG]       commons-cli:commons-cli:jar:1.0:compile
[DEBUG]       org.apache.maven:maven-plugin-descriptor:jar:2.0.6:compile
[DEBUG]       org.codehaus.plexus:plexus-interactivity-api:jar:1.0-alpha-4:compile
[DEBUG]       org.apache.maven:maven-monitor:jar:2.0.6:compile
[DEBUG]       classworlds:classworlds:jar:1.1:compile
[DEBUG]    org.apache.maven:maven-plugin-api:jar:2.0.6:compile
[DEBUG]    org.codehaus.plexus:plexus-utils:jar:2.0.5:compile
[DEBUG]    org.codehaus.plexus:plexus-container-default:jar:1.0-alpha-9:compile
[DEBUG]       junit:junit:jar:3.8.2:test (scope managed from compile) (version managed from
3.8.1)
[DEBUG]    org.apache.commons:commons-exec:jar:1.0.1:compile
[DEBUG] Created new class realm plugin>org.codehaus.mojo:exec-maven-plugin:1.2
[DEBUG] Importing foreign packages into class realm plugin>org.codehaus.mojo:exec-maven-plugin:1.2
[DEBUG]   Imported:  < maven.api
[DEBUG] Populating class realm plugin>org.codehaus.mojo:exec-maven-plugin:1.2
[DEBUG]   Included: org.codehaus.mojo:exec-maven-plugin:jar:1.2
[DEBUG]   Included: org.apache.maven.reporting:maven-reporting-api:jar:2.0.6
[DEBUG]   Included: org.apache.maven.doxia:doxia-sink-api:jar:1.0-alpha-7
[DEBUG]   Included: commons-cli:commons-cli:jar:1.0
[DEBUG]   Included: org.codehaus.plexus:plexus-interactivity-api:jar:1.0-alpha-4
[DEBUG]   Included: org.codehaus.plexus:plexus-utils:jar:2.0.5
[DEBUG]   Included: org.apache.commons:commons-exec:jar:1.0.1
[DEBUG]   Excluded: org.apache.maven:maven-toolchain:jar:1.0
[DEBUG]   Excluded: org.apache.maven:maven-project:jar:2.0.6
[DEBUG]   Excluded: org.apache.maven:maven-settings:jar:2.0.6
[DEBUG]   Excluded: org.apache.maven:maven-profile:jar:2.0.6
[DEBUG]   Excluded: org.apache.maven:maven-plugin-registry:jar:2.0.6
[DEBUG]   Excluded: org.apache.maven:maven-model:jar:2.0.6
[DEBUG]   Excluded: org.apache.maven:maven-artifact:jar:2.0.6
[DEBUG]   Excluded: org.apache.maven:maven-artifact-manager:jar:2.0.6
[DEBUG]   Excluded: org.apache.maven:maven-repository-metadata:jar:2.0.6
[DEBUG]   Excluded: org.apache.maven:maven-core:jar:2.0.6
[DEBUG]   Excluded: org.apache.maven:maven-plugin-parameter-documenter:jar:2.0.6
[DEBUG]   Excluded: org.apache.maven:maven-error-diagnostics:jar:2.0.6
[DEBUG]   Excluded: org.apache.maven:maven-plugin-descriptor:jar:2.0.6
[DEBUG]   Excluded: org.apache.maven:maven-monitor:jar:2.0.6
[DEBUG]   Excluded: classworlds:classworlds:jar:1.1
[DEBUG]   Excluded: org.apache.maven:maven-plugin-api:jar:2.0.6
[DEBUG]   Excluded: org.codehaus.plexus:plexus-container-default:jar:1.0-alpha-9
[DEBUG]   Excluded: junit:junit:jar:3.8.2
[DEBUG] Configuring mojo org.codehaus.mojo:exec-maven-plugin:1.2:exec from plugin realm ClassRealm[plugin>org.codehaus.mojo:exec-maven-plugin:1.2,
parent: sun.misc.Launcher$AppClassLoader@126b249]
[DEBUG] Configuring mojo 'org.codehaus.mojo:exec-maven-plugin:1.2:exec' with basic configurator
-->
[DEBUG]   (f) arguments = [-Isrc/main/proto/, --java_out=target/generated-sources/java, src/main/proto/HAServiceProtocol.proto,
src/main/proto/IpcConnectionContext.proto, src/main/proto/ProtocolInfo.proto, src/main/proto/RpcHeader.proto,
src/main/proto/ZKFCProtocol.proto, src/main/proto/ProtobufRpcEngine.proto]
[DEBUG]   (f) basedir = <https://builds.apache.org/job/Hadoop-Common-trunk/ws/trunk/hadoop-common-project/hadoop-common>
[DEBUG]   (f) classpathScope = runtime
[DEBUG]   (f) executable = protoc
[DEBUG]   (f) longClasspath = false
[DEBUG]   (f) project = MavenProject: org.apache.hadoop:hadoop-common:3.0.0-SNAPSHOT @ <https://builds.apache.org/job/Hadoop-Common-trunk/ws/trunk/hadoop-common-project/hadoop-common/pom.xml>
[DEBUG]   (f) session = org.apache.maven.execution.MavenSession@148ccb8
[DEBUG]   (f) skip = false
[DEBUG] -- end configuration --
[DEBUG] Executing command line: protoc -Isrc/main/proto/ --java_out=target/generated-sources/java
src/main/proto/HAServiceProtocol.proto src/main/proto/IpcConnectionContext.proto src/main/proto/ProtocolInfo.proto
src/main/proto/RpcHeader.proto src/main/proto/ZKFCProtocol.proto src/main/proto/ProtobufRpcEngine.proto
HAServiceProtocol.proto:21:8: Option "java_generic_services" unknown.
[INFO] ------------------------------------------------------------------------
[INFO] Reactor Summary:
[INFO] 
[INFO] Apache Hadoop Annotations ......................... SUCCESS [15.653s]
[INFO] Apache Hadoop Auth ................................ SUCCESS [19.274s]
[INFO] Apache Hadoop Auth Examples ....................... SUCCESS [2.122s]
[INFO] Apache Hadoop Common .............................. FAILURE [9.090s]
[INFO] Apache Hadoop Common Project ...................... SKIPPED
[INFO] ------------------------------------------------------------------------
[INFO] BUILD FAILURE
[INFO] ------------------------------------------------------------------------
[INFO] Total time: 48.378s
[INFO] Finished at: Fri Jan 04 09:07:40 UTC 2013
[INFO] Final Memory: 51M/579M
[INFO] ------------------------------------------------------------------------
[ERROR] Failed to execute goal org.codehaus.mojo:exec-maven-plugin:1.2:exec (compile-proto)
on project hadoop-common: Command execution failed. Process exited with an error: 1(Exit value:
1) -> [Help 1]
org.apache.maven.lifecycle.LifecycleExecutionException: Failed to execute goal org.codehaus.mojo:exec-maven-plugin:1.2:exec
(compile-proto) on project hadoop-common: Command execution failed.
	at org.apache.maven.lifecycle.internal.MojoExecutor.execute(MojoExecutor.java:217)
	at org.apache.maven.lifecycle.internal.MojoExecutor.execute(MojoExecutor.java:153)
	at org.apache.maven.lifecycle.internal.MojoExecutor.execute(MojoExecutor.java:145)
	at org.apache.maven.lifecycle.internal.LifecycleModuleBuilder.buildProject(LifecycleModuleBuilder.java:84)
	at org.apache.maven.lifecycle.internal.LifecycleModuleBuilder.buildProject(LifecycleModuleBuilder.java:59)
	at org.apache.maven.lifecycle.internal.LifecycleStarter.singleThreadedBuild(LifecycleStarter.java:183)
	at org.apache.maven.lifecycle.internal.LifecycleStarter.execute(LifecycleStarter.java:161)
	at org.apache.maven.DefaultMaven.doExecute(DefaultMaven.java:319)
	at org.apache.maven.DefaultMaven.execute(DefaultMaven.java:156)
	at org.apache.maven.cli.MavenCli.execute(MavenCli.java:537)
	at org.apache.maven.cli.MavenCli.doMain(MavenCli.java:196)
	at org.apache.maven.cli.MavenCli.main(MavenCli.java:141)
	at sun.reflect.NativeMethodAccessorImpl.invoke0(Native Method)
	at sun.reflect.NativeMethodAccessorImpl.invoke(NativeMethodAccessorImpl.java:39)
	at sun.reflect.DelegatingMethodAccessorImpl.invoke(DelegatingMethodAccessorImpl.java:25)
	at java.lang.reflect.Method.invoke(Method.java:597)
	at org.codehaus.plexus.classworlds.launcher.Launcher.launchEnhanced(Launcher.java:290)
	at org.codehaus.plexus.classworlds.launcher.Launcher.launch(Launcher.java:230)
	at org.codehaus.plexus.classworlds.launcher.Launcher.mainWithExitCode(Launcher.java:409)
	at org.codehaus.plexus.classworlds.launcher.Launcher.main(Launcher.java:352)
Caused by: org.apache.maven.plugin.MojoExecutionException: Command execution failed.
	at org.codehaus.mojo.exec.ExecMojo.execute(ExecMojo.java:345)
	at org.apache.maven.plugin.DefaultBuildPluginManager.executeMojo(DefaultBuildPluginManager.java:101)
	at org.apache.maven.lifecycle.internal.MojoExecutor.execute(MojoExecutor.java:209)
	... 19 more
Caused by: org.apache.commons.exec.ExecuteException: Process exited with an error: 1(Exit
value: 1)
	at org.apache.commons.exec.DefaultExecutor.executeInternal(DefaultExecutor.java:346)
	at org.apache.commons.exec.DefaultExecutor.execute(DefaultExecutor.java:149)
	at org.codehaus.mojo.exec.ExecMojo.executeCommandLine(ExecMojo.java:589)
	at org.codehaus.mojo.exec.ExecMojo.execute(ExecMojo.java:335)
	... 21 more
[ERROR] 
[ERROR] 
[ERROR] For more information about the errors and possible solutions, please read the following
articles:
[ERROR] [Help 1] http://cwiki.apache.org/confluence/display/MAVEN/MojoExecutionException
[ERROR] 
[ERROR] After correcting the problems, you can resume the build with the command
[ERROR]   mvn <goals> -rf :hadoop-common
Build step 'Execute shell' marked build as failure
Archiving artifacts

Mime
View raw message