hadoop-common-dev mailing list archives

Site index · List index
Message view « Date » · « Thread »
Top « Date » · « Thread »
From Apache Jenkins Server <jenk...@builds.apache.org>
Subject Build failed in Jenkins: Hadoop-Common-trunk #637
Date Sat, 29 Dec 2012 09:28:54 GMT
See <https://builds.apache.org/job/Hadoop-Common-trunk/637/changes>

Changes:

[shv] HDFS-4347. Avoid infinite waiting checkpoint to complete in TestBackupNode. Contributed
by Plamen Jeliazkov.

[shv] HDFS-4308. addBlock() should persist file blocks once. Contributed by Plamen Jeliazkov.

[bobby] MAPREDUCE-4813. AM timing out during job commit (jlowe via bobby)

[bobby] YARN-225. Proxy Link in RM UI thows NPE in Secure mode (Devaraj K via bobby)

------------------------------------------
[...truncated 57093 lines...]
     [exec] 
     [exec] unpack-plugin:
     [exec] 
     [exec] install-plugin:
     [exec] 
     [exec] configure-plugin:
     [exec] 
     [exec] configure-output-plugin:
     [exec] Mounting output plugin: org.apache.forrest.plugin.output.pdf
     [exec] Processing <https://builds.apache.org/job/Hadoop-Common-trunk/ws/trunk/hadoop-common-project/hadoop-common/target/docs-src/build/tmp/output.xmap>
to <https://builds.apache.org/job/Hadoop-Common-trunk/ws/trunk/hadoop-common-project/hadoop-common/target/docs-src/build/tmp/output.xmap.new>
     [exec] Loading stylesheet /home/jenkins/tools/forrest/latest/main/var/pluginMountSnippet.xsl
     [exec] Moving 1 file to <https://builds.apache.org/job/Hadoop-Common-trunk/ws/trunk/hadoop-common-project/hadoop-common/target/docs-src/build/tmp>
     [exec] 
     [exec] configure-plugin-locationmap:
     [exec] Mounting plugin locationmap for org.apache.forrest.plugin.output.pdf
     [exec] Processing <https://builds.apache.org/job/Hadoop-Common-trunk/ws/trunk/hadoop-common-project/hadoop-common/target/docs-src/build/tmp/locationmap.xml>
to <https://builds.apache.org/job/Hadoop-Common-trunk/ws/trunk/hadoop-common-project/hadoop-common/target/docs-src/build/tmp/locationmap.xml.new>
     [exec] Loading stylesheet /home/jenkins/tools/forrest/latest/main/var/pluginLmMountSnippet.xsl
     [exec] Moving 1 file to <https://builds.apache.org/job/Hadoop-Common-trunk/ws/trunk/hadoop-common-project/hadoop-common/target/docs-src/build/tmp>
     [exec] 
     [exec] init:
     [exec] 
     [exec] -prepare-classpath:
     [exec] 
     [exec] check-contentdir:
     [exec] 
     [exec] examine-proj:
     [exec] 
     [exec] validation-props:
     [exec] Using these catalog descriptors: /home/jenkins/tools/forrest/latest/main/webapp/resources/schema/catalog.xcat:/home/jenkins/tools/forrest/latest/build/plugins/catalog.xcat:<https://builds.apache.org/job/Hadoop-Common-trunk/ws/trunk/hadoop-common-project/hadoop-common/target/docs-src/src/documentation/resources/schema/catalog.xcat>
     [exec] 
     [exec] validate-xdocs:
     [exec] 7 file(s) have been successfully validated.
     [exec] ...validated xdocs
     [exec] 
     [exec] validate-skinconf:
     [exec] 1 file(s) have been successfully validated.
     [exec] ...validated skinconf
     [exec] 
     [exec] validate-sitemap:
     [exec] 
     [exec] validate-skins-stylesheets:
     [exec] 
     [exec] validate-skins:
     [exec] 
     [exec] validate-skinchoice:
     [exec] ...validated existence of skin 'pelt'
     [exec] 
     [exec] validate-stylesheets:
     [exec] 
     [exec] validate:
     [exec] 
     [exec] site:
     [exec] 
     [exec] Copying the various non-generated resources to site.
     [exec] Warnings will be issued if the optional project resources are not found.
     [exec] This is often the case, because they are optional and so may not be available.
     [exec] Copying project resources and images to site ...
     [exec] Copied 1 empty directory to 1 empty directory under <https://builds.apache.org/job/Hadoop-Common-trunk/ws/trunk/hadoop-common-project/hadoop-common/target/docs-src/build/site>
     [exec] Copying main skin images to site ...
     [exec] Created dir: <https://builds.apache.org/job/Hadoop-Common-trunk/ws/trunk/hadoop-common-project/hadoop-common/target/docs-src/build/site/skin/images>
     [exec] Copying 20 files to <https://builds.apache.org/job/Hadoop-Common-trunk/ws/trunk/hadoop-common-project/hadoop-common/target/docs-src/build/site/skin/images>
     [exec] Copying 14 files to <https://builds.apache.org/job/Hadoop-Common-trunk/ws/trunk/hadoop-common-project/hadoop-common/target/docs-src/build/site/skin/images>
     [exec] Copying project skin images to site ...
     [exec] Copying main skin css and js files to site ...
     [exec] Copying 11 files to <https://builds.apache.org/job/Hadoop-Common-trunk/ws/trunk/hadoop-common-project/hadoop-common/target/docs-src/build/site/skin>
     [exec] Copied 4 empty directories to 3 empty directories under <https://builds.apache.org/job/Hadoop-Common-trunk/ws/trunk/hadoop-common-project/hadoop-common/target/docs-src/build/site/skin>
     [exec] Copying 4 files to <https://builds.apache.org/job/Hadoop-Common-trunk/ws/trunk/hadoop-common-project/hadoop-common/target/docs-src/build/site/skin>
     [exec] Copying project skin css and js files to site ...
     [exec] 
     [exec] Finished copying the non-generated resources.
     [exec] Now Cocoon will generate the rest.
     [exec]           
     [exec] 
     [exec] Static site will be generated at:
     [exec] <https://builds.apache.org/job/Hadoop-Common-trunk/ws/trunk/hadoop-common-project/hadoop-common/target/docs-src/build/site>
     [exec] 
     [exec] Cocoon will report the status of each document:
     [exec]   - in column 1: *=okay X=brokenLink ^=pageSkipped (see FAQ).
     [exec]   
     [exec] Warning: <https://builds.apache.org/job/Hadoop-Common-trunk/ws/trunk/hadoop-common-project/hadoop-common/target/docs-src/build/webapp/resources>
not found.
     [exec] Warning: <https://builds.apache.org/job/Hadoop-Common-trunk/ws/trunk/hadoop-common-project/hadoop-common/target/docs-src/src/documentation/skins/common/images>
not found.
     [exec] Warning: <https://builds.apache.org/job/Hadoop-Common-trunk/ws/trunk/hadoop-common-project/hadoop-common/target/docs-src/src/documentation/skins/pelt/images>
not found.
     [exec] Warning: <https://builds.apache.org/job/Hadoop-Common-trunk/ws/trunk/hadoop-common-project/hadoop-common/target/docs-src/src/documentation/skins/common>
not found.
     [exec] Warning: <https://builds.apache.org/job/Hadoop-Common-trunk/ws/trunk/hadoop-common-project/hadoop-common/target/docs-src/src/documentation/skins/pelt>
not found.
     [exec] ------------------------------------------------------------------------ 
     [exec] cocoon 2.1.12-dev
     [exec] Copyright (c) 1999-2007 Apache Software Foundation. All rights reserved.
     [exec] ------------------------------------------------------------------------ 
     [exec] 
     [exec] 
     [exec] ^                                    api/index.html
     [exec] ^                                    jdiff/changes.html
     [exec] ^                                    releasenotes.html
     [exec] ^                                    changes.html
     [exec] * [1/24]    [24/28]   2.382s 8.5Kb   linkmap.html
     [exec] X [0]                                     HttpAuthentication.html	BROKEN: <https://builds.apache.org/job/Hadoop-Common-trunk/ws/trunk/hadoop-common-project/hadoop-common/target/docs-src/src/documentation/content/xdocs/HttpAuthentication.xml>
(No such file or directory)
     [exec] ^                                    api/index.html
     [exec] ^                                    jdiff/changes.html
     [exec] ^                                    releasenotes.html
     [exec] ^                                    changes.html
     [exec] * [4/22]    [1/27]    0.602s 15.0Kb  single_node_setup.html
     [exec] * [5/21]    [0/0]     0.687s 348b    skin/images/rc-b-l-15-1body-2menu-3menu.png
     [exec] X [0]                                     file_system_shell.html	BROKEN: <https://builds.apache.org/job/Hadoop-Common-trunk/ws/trunk/hadoop-common-project/hadoop-common/target/docs-src/src/documentation/content/xdocs/file_system_shell.xml>
(No such file or directory)
     [exec] * [8/18]    [0/0]     1.092s 10.4Kb  linkmap.pdf
     [exec] * [9/17]    [0/0]     0.13s  1.2Kb   skin/print.css
     [exec] ^                                    api/index.html
     [exec] ^                                    jdiff/changes.html
     [exec] ^                                    releasenotes.html
     [exec] ^                                    changes.html
     [exec] * [10/17]   [1/27]    0.212s 12.5Kb  deployment_layout.html
     [exec] * [11/16]   [0/0]     0.399s 14.5Kb  deployment_layout.pdf
     [exec] * [12/15]   [0/0]     0.018s 5.7Kb   images/common-logo.jpg
     [exec] * [13/14]   [0/0]     0.028s 4.4Kb   skin/profile.css
     [exec] X [0]                                     cluster_setup.html	BROKEN: <https://builds.apache.org/job/Hadoop-Common-trunk/ws/trunk/hadoop-common-project/hadoop-common/target/docs-src/src/documentation/content/xdocs/cluster_setup.xml>
(No such file or directory)
     [exec] ^                                    api/index.html
     [exec] ^                                    jdiff/changes.html
     [exec] ^                                    releasenotes.html
     [exec] ^                                    changes.html
     [exec] * [16/13]   [2/29]    0.167s 7.3Kb   index.html
     [exec] * [17/12]   [0/0]     0.083s 7.9Kb   index.pdf
     [exec] * [18/11]   [0/0]     0.0060s 1.8Kb   images/built-with-forrest-button.png
     [exec] * [19/23]   [13/13]   0.39s  12.3Kb  skin/screen.css
     [exec] * [21/21]   [0/0]     0.011s 209b    skin/images/rc-t-l-5-1header-2tab-selected-3tab-selected.png
     [exec] * [23/19]   [0/0]     0.01s  199b    skin/images/rc-t-l-5-1header-2tab-unselected-3tab-unselected.png
     [exec] * [24/18]   [0/0]     0.01s  214b    skin/images/rc-t-r-5-1header-2searchbox-3searchbox.png
     [exec] ^                                    api/index.html
     [exec] ^                                    jdiff/changes.html
     [exec] ^                                    releasenotes.html
     [exec] ^                                    changes.html
     [exec] * [25/18]   [1/27]    0.194s 15.3Kb  service_level_auth.html
     [exec] WARN - Line 1 of a paragraph overflows the available area by 6000mpt. (fo:block,
"security.client.datanode.protocol.acl")
     [exec] * [26/17]   [0/0]     0.242s 19.7Kb  service_level_auth.pdf
     [exec] * [27/16]   [0/0]     0.01s  199b    skin/images/rc-t-l-5-1header-2searchbox-3searchbox.png
     [exec] ^                                    api/index.html
     [exec] ^                                    jdiff/changes.html
     [exec] ^                                    releasenotes.html
     [exec] ^                                    changes.html
     [exec] * [28/16]   [1/27]    0.303s 15.2Kb  native_libraries.html
     [exec] * [29/15]   [0/0]     0.023s 2.9Kb   skin/basic.css
     [exec] X [0]                                     commands_manual.html	BROKEN: <https://builds.apache.org/job/Hadoop-Common-trunk/ws/trunk/hadoop-common-project/hadoop-common/target/docs-src/src/documentation/content/xdocs/commands_manual.xml>
(No such file or directory)
     [exec] * [31/13]   [0/0]     0.0050s 285b    images/instruction_arrow.png
     [exec] * [33/11]   [0/0]     0.0090s 200b    skin/images/rc-b-r-5-1header-2tab-selected-3tab-selected.png
     [exec] * [34/10]   [0/0]     0.02s  766b    images/favicon.ico
     [exec] ^                                    api/index.html
     [exec] ^                                    jdiff/changes.html
     [exec] ^                                    releasenotes.html
     [exec] ^                                    changes.html
     [exec] * [35/10]   [1/27]    0.144s 10.1Kb  Superusers.html
     [exec] WARN - Page 2: Unresolved id reference "Build" found.
     [exec] WARN - Page 2: Unresolved id reference "Runtime" found.
     [exec] WARN - Page 2: Unresolved id reference "Supported+Platforms" found.
     [exec] WARN - Page 2: Unresolved id reference "Components" found.
     [exec] WARN - Page 2: Unresolved id reference "Download" found.
     [exec] WARN - Page 3: Unresolved id reference "Supported+Platforms" found.
     [exec] * [36/9]    [0/0]     0.224s 23.4Kb  native_libraries.pdf
     [exec] * [37/8]    [0/0]     0.01s  390b    skin/images/rc-t-r-15-1body-2menu-3menu.png
     [exec] * [38/7]    [0/0]     0.094s 13.4Kb  Superusers.pdf
     [exec] * [40/5]    [0/0]     0.205s 23.8Kb  single_node_setup.pdf
     [exec] * [41/4]    [0/0]     0.01s  215b    skin/images/rc-t-r-5-1header-2tab-selected-3tab-selected.png
     [exec] * [42/3]    [0/0]     0.011s 214b    skin/images/rc-t-r-5-1header-2tab-unselected-3tab-unselected.png
     [exec] * [43/2]    [0/0]     0.01s  319b    skin/images/rc-b-r-15-1body-2menu-3menu.png
     [exec] * [45/0]    [0/0]     0.014s 9.2Kb   images/hadoop-logo.jpg
     [exec] Total time: 0 minutes 9 seconds,  Site size: 244,590 Site pages: 33
     [exec] 
     [exec]   Copying broken links file to site root.
     [exec]       
     [exec] Copying 1 file to <https://builds.apache.org/job/Hadoop-Common-trunk/ws/trunk/hadoop-common-project/hadoop-common/target/docs-src/build/site>
     [exec] Java Result: 1
     [exec] 
     [exec] BUILD FAILED
     [exec] /home/jenkins/tools/forrest/latest/main/targets/site.xml:224: Error building site.
     [exec]         
     [exec] There appears to be a problem with your site build.
     [exec] 
     [exec] Read the output above:
     [exec] * Cocoon will report the status of each document:
     [exec]     - in column 1: *=okay X=brokenLink ^=pageSkipped (see FAQ).
     [exec] * Even if only one link is broken, you will still get "failed".
     [exec] * Your site would still be generated, but some pages would be broken.
     [exec]   - See <https://builds.apache.org/job/Hadoop-Common-trunk/ws/trunk/hadoop-common-project/hadoop-common/target/docs-src/build/site/broken-links.xml>
     [exec] 
     [exec] Total time: 13 seconds
[INFO] ------------------------------------------------------------------------
[INFO] Reactor Summary:
[INFO] 
[INFO] Apache Hadoop Annotations ......................... SUCCESS [19.426s]
[INFO] Apache Hadoop Auth ................................ SUCCESS [20.844s]
[INFO] Apache Hadoop Auth Examples ....................... SUCCESS [2.376s]
[INFO] Apache Hadoop Common .............................. FAILURE [22:16.993s]
[INFO] Apache Hadoop Common Project ...................... SKIPPED
[INFO] ------------------------------------------------------------------------
[INFO] BUILD FAILURE
[INFO] ------------------------------------------------------------------------
[INFO] Total time: 23:02.982s
[INFO] Finished at: Sat Dec 29 09:28:29 UTC 2012
[INFO] Final Memory: 52M/582M
[INFO] ------------------------------------------------------------------------
[ERROR] Failed to execute goal org.apache.maven.plugins:maven-antrun-plugin:1.6:run (site)
on project hadoop-common: An Ant BuildException has occured: exec returned: 1 -> [Help
1]
org.apache.maven.lifecycle.LifecycleExecutionException: Failed to execute goal org.apache.maven.plugins:maven-antrun-plugin:1.6:run
(site) on project hadoop-common: An Ant BuildException has occured: exec returned: 1
	at org.apache.maven.lifecycle.internal.MojoExecutor.execute(MojoExecutor.java:217)
	at org.apache.maven.lifecycle.internal.MojoExecutor.execute(MojoExecutor.java:153)
	at org.apache.maven.lifecycle.internal.MojoExecutor.execute(MojoExecutor.java:145)
	at org.apache.maven.lifecycle.internal.LifecycleModuleBuilder.buildProject(LifecycleModuleBuilder.java:84)
	at org.apache.maven.lifecycle.internal.LifecycleModuleBuilder.buildProject(LifecycleModuleBuilder.java:59)
	at org.apache.maven.lifecycle.internal.LifecycleStarter.singleThreadedBuild(LifecycleStarter.java:183)
	at org.apache.maven.lifecycle.internal.LifecycleStarter.execute(LifecycleStarter.java:161)
	at org.apache.maven.DefaultMaven.doExecute(DefaultMaven.java:319)
	at org.apache.maven.DefaultMaven.execute(DefaultMaven.java:156)
	at org.apache.maven.cli.MavenCli.execute(MavenCli.java:537)
	at org.apache.maven.cli.MavenCli.doMain(MavenCli.java:196)
	at org.apache.maven.cli.MavenCli.main(MavenCli.java:141)
	at sun.reflect.NativeMethodAccessorImpl.invoke0(Native Method)
	at sun.reflect.NativeMethodAccessorImpl.invoke(NativeMethodAccessorImpl.java:39)
	at sun.reflect.DelegatingMethodAccessorImpl.invoke(DelegatingMethodAccessorImpl.java:25)
	at java.lang.reflect.Method.invoke(Method.java:597)
	at org.codehaus.plexus.classworlds.launcher.Launcher.launchEnhanced(Launcher.java:290)
	at org.codehaus.plexus.classworlds.launcher.Launcher.launch(Launcher.java:230)
	at org.codehaus.plexus.classworlds.launcher.Launcher.mainWithExitCode(Launcher.java:409)
	at org.codehaus.plexus.classworlds.launcher.Launcher.main(Launcher.java:352)
Caused by: org.apache.maven.plugin.MojoExecutionException: An Ant BuildException has occured:
exec returned: 1
	at org.apache.maven.plugin.antrun.AntRunMojo.execute(AntRunMojo.java:283)
	at org.apache.maven.plugin.DefaultBuildPluginManager.executeMojo(DefaultBuildPluginManager.java:101)
	at org.apache.maven.lifecycle.internal.MojoExecutor.execute(MojoExecutor.java:209)
	... 19 more
Caused by: <https://builds.apache.org/job/Hadoop-Common-trunk/ws/trunk/hadoop-common-project/hadoop-common/target/antrun/build-main.xml>:8:
exec returned: 1
	at org.apache.tools.ant.taskdefs.ExecTask.runExecute(ExecTask.java:650)
	at org.apache.tools.ant.taskdefs.ExecTask.runExec(ExecTask.java:676)
	at org.apache.tools.ant.taskdefs.ExecTask.execute(ExecTask.java:502)
	at org.apache.tools.ant.UnknownElement.execute(UnknownElement.java:291)
	at sun.reflect.GeneratedMethodAccessor76.invoke(Unknown Source)
	at sun.reflect.DelegatingMethodAccessorImpl.invoke(DelegatingMethodAccessorImpl.java:25)
	at java.lang.reflect.Method.invoke(Method.java:597)
	at org.apache.tools.ant.dispatch.DispatchUtils.execute(DispatchUtils.java:106)
	at org.apache.tools.ant.Task.perform(Task.java:348)
	at org.apache.tools.ant.Target.execute(Target.java:390)
	at org.apache.tools.ant.Target.performTasks(Target.java:411)
	at org.apache.tools.ant.Project.executeSortedTargets(Project.java:1397)
	at org.apache.tools.ant.Project.executeTarget(Project.java:1366)
	at org.apache.maven.plugin.antrun.AntRunMojo.execute(AntRunMojo.java:270)
	... 21 more
[ERROR] 
[ERROR] 
[ERROR] For more information about the errors and possible solutions, please read the following
articles:
[ERROR] [Help 1] http://cwiki.apache.org/confluence/display/MAVEN/MojoExecutionException
[ERROR] 
[ERROR] After correcting the problems, you can resume the build with the command
[ERROR]   mvn <goals> -rf :hadoop-common
Build step 'Execute shell' marked build as failure
Archiving artifacts

Mime
View raw message