hadoop-common-dev mailing list archives

Site index · List index
Message view « Date » · « Thread »
Top « Date » · « Thread »
From Apache Jenkins Server <jenk...@builds.apache.org>
Subject Build failed in Jenkins: Hadoop-Common-0.23-Build #412
Date Thu, 25 Oct 2012 09:10:39 GMT
See <https://builds.apache.org/job/Hadoop-Common-0.23-Build/412/changes>

Changes:

[vinodkv] MAPREDUCE-4730. Fix Reducer's EventFetcher to scale the map-completion requests
slowly to avoid HADOOP-8942. Contributed by Jason Lowe.
svn merge --ignore-ancestry -c 1401941 ../../trunk/

[bobby] svn merge -c 1399005 FIXES: HADOOP-8926. hadoop.util.PureJavaCrc32 cache hit-ratio
is low for static data (Gopal V via bobby)

[jlowe] svn merge -c 1401738 FIXES: MAPREDUCE-4741. WARN and ERROR messages logged during
normal AM shutdown. Contributed by Vinod Kumar Vavilapalli

[jlowe] svn merge -c 1401726 FIXES: YARN-139. Interrupted Exception within AsyncDispatcher
leads to user confusion. Contributed by Vinod Kumar Vavilapalli

[bobby] YARN-180. Capacity scheduler - containers that get reserved create container token
to early (acmurthy and bobby)

[bobby] YARN-178. Fix custom ProcessTree instance creation (Radim Kolar via bobby)

[tgraves] YARN-177. CapacityScheduler - adding a queue while the RM is running has wacky results
(acmurthy vai tgraves)

------------------------------------------
[...truncated 11013 lines...]

[INFO] 
[INFO] --- maven-clover2-plugin:3.0.5:clover (clover) @ hadoop-auth ---
[INFO] Using /default-clover-report descriptor.
[INFO] Using Clover report descriptor: /tmp/mvn5273754586635875140resource
[INFO] Clover Version 3.0.2, built on April 13 2010 (build-790)
[INFO] Loaded from: /home/jenkins/.m2/repository/com/cenqua/clover/clover/3.0.2/clover-3.0.2.jar
[INFO] Clover: Open Source License registered to Apache.
[INFO] Clover is enabled with initstring '<https://builds.apache.org/job/Hadoop-Common-0.23-Build/ws/trunk/hadoop-common-project/hadoop-auth/target/clover/hadoop-coverage.db'>
[WARNING] Clover historical directory [<https://builds.apache.org/job/Hadoop-Common-0.23-Build/ws/trunk/hadoop-common-project/hadoop-auth/target/clover/history]>
does not exist, skipping Clover historical report generation ([<https://builds.apache.org/job/Hadoop-Common-0.23-Build/ws/trunk/hadoop-common-project/hadoop-auth/target/clover])>
[INFO] Clover Version 3.0.2, built on April 13 2010 (build-790)
[INFO] Loaded from: /home/jenkins/.m2/repository/com/cenqua/clover/clover/3.0.2/clover-3.0.2.jar
[INFO] Clover: Open Source License registered to Apache.
[INFO] Loading coverage database from: '<https://builds.apache.org/job/Hadoop-Common-0.23-Build/ws/trunk/hadoop-common-project/hadoop-auth/target/clover/hadoop-coverage.db'>
[INFO] Writing HTML report to '<https://builds.apache.org/job/Hadoop-Common-0.23-Build/ws/trunk/hadoop-common-project/hadoop-auth/target/clover'>
[INFO] Done. Processed 4 packages in 1061ms (265ms per package).
[INFO] Clover Version 3.0.2, built on April 13 2010 (build-790)
[INFO] Loaded from: /home/jenkins/.m2/repository/com/cenqua/clover/clover/3.0.2/clover-3.0.2.jar
[INFO] Clover: Open Source License registered to Apache.
[INFO] Clover is enabled with initstring '<https://builds.apache.org/job/Hadoop-Common-0.23-Build/ws/trunk/hadoop-common-project/hadoop-auth/target/clover/hadoop-coverage.db'>
[WARNING] Clover historical directory [<https://builds.apache.org/job/Hadoop-Common-0.23-Build/ws/trunk/hadoop-common-project/hadoop-auth/target/clover/history]>
does not exist, skipping Clover historical report generation ([<https://builds.apache.org/job/Hadoop-Common-0.23-Build/ws/trunk/hadoop-common-project/hadoop-auth/target/clover/clover.xml])>
[INFO] Clover Version 3.0.2, built on April 13 2010 (build-790)
[INFO] Loaded from: /home/jenkins/.m2/repository/com/cenqua/clover/clover/3.0.2/clover-3.0.2.jar
[INFO] Clover: Open Source License registered to Apache.
[INFO] Loading coverage database from: '<https://builds.apache.org/job/Hadoop-Common-0.23-Build/ws/trunk/hadoop-common-project/hadoop-auth/target/clover/hadoop-coverage.db'>
[INFO] Writing report to '<https://builds.apache.org/job/Hadoop-Common-0.23-Build/ws/trunk/hadoop-common-project/hadoop-auth/target/clover/clover.xml'>
[INFO]                                                                         
[INFO] ------------------------------------------------------------------------
[INFO] Building Apache Hadoop Auth Examples 0.23.5-SNAPSHOT
[INFO] ------------------------------------------------------------------------
[INFO] 
[INFO] --- maven-antrun-plugin:1.6:run (create-testdirs) @ hadoop-auth-examples ---
[INFO] Executing tasks

main:
[INFO] Executed tasks
[INFO] 
[INFO] --- maven-dependency-plugin:2.1:build-classpath (build-classpath) @ hadoop-auth-examples
---
[INFO] Wrote classpath file '<https://builds.apache.org/job/Hadoop-Common-0.23-Build/ws/trunk/hadoop-common-project/hadoop-auth-examples/target/classes/mrapp-generated-classpath'.>
[INFO] 
[INFO] --- maven-clover2-plugin:3.0.5:setup (setup) @ hadoop-auth-examples ---
[INFO] Clover Version 3.0.2, built on April 13 2010 (build-790)
[INFO] Loaded from: /home/jenkins/.m2/repository/com/cenqua/clover/clover/3.0.2/clover-3.0.2.jar
[INFO] Clover: Open Source License registered to Apache.
[INFO] Creating new database at '<https://builds.apache.org/job/Hadoop-Common-0.23-Build/ws/trunk/hadoop-common-project/hadoop-auth-examples/target/clover/hadoop-coverage.db'.>
[INFO] Processing files at 1.6 source level.
[INFO] Clover all over. Instrumented 3 files (1 package).
[INFO] Elapsed time = 0.015 secs. (200 files/sec, 18,866.668 srclines/sec)
[INFO] No Clover instrumentation done on source files in: [<https://builds.apache.org/job/Hadoop-Common-0.23-Build/ws/trunk/hadoop-common-project/hadoop-auth-examples/src/test/java]>
as no matching sources files found
[INFO] 
[INFO] --- maven-resources-plugin:2.2:resources (default-resources) @ hadoop-auth-examples
---
[INFO] Using default encoding to copy filtered resources.
[INFO] 
[INFO] --- maven-compiler-plugin:2.5.1:compile (default-compile) @ hadoop-auth-examples ---
[INFO] Compiling 3 source files to <https://builds.apache.org/job/Hadoop-Common-0.23-Build/ws/trunk/hadoop-common-project/hadoop-auth-examples/target/classes>
[INFO] 
[INFO] --- maven-resources-plugin:2.2:testResources (default-testResources) @ hadoop-auth-examples
---
[INFO] Using default encoding to copy filtered resources.
[INFO] 
[INFO] --- maven-compiler-plugin:2.5.1:testCompile (default-testCompile) @ hadoop-auth-examples
---
[INFO] No sources to compile
[INFO] 
[INFO] --- maven-surefire-plugin:2.12.3:test (default-test) @ hadoop-auth-examples ---
[INFO] No tests to run.
[INFO] 
[INFO] --- maven-clover2-plugin:3.0.5:clover (clover) @ hadoop-auth-examples ---
[INFO] Using /default-clover-report descriptor.
[INFO] Using Clover report descriptor: /tmp/mvn5358258815826157773resource
[INFO] Clover Version 3.0.2, built on April 13 2010 (build-790)
[INFO] Loaded from: /home/jenkins/.m2/repository/com/cenqua/clover/clover/3.0.2/clover-3.0.2.jar
[INFO] Clover: Open Source License registered to Apache.
[INFO] Clover is enabled with initstring '<https://builds.apache.org/job/Hadoop-Common-0.23-Build/ws/trunk/hadoop-common-project/hadoop-auth-examples/target/clover/hadoop-coverage.db'>
[WARNING] Clover historical directory [<https://builds.apache.org/job/Hadoop-Common-0.23-Build/ws/trunk/hadoop-common-project/hadoop-auth-examples/target/clover/history]>
does not exist, skipping Clover historical report generation ([<https://builds.apache.org/job/Hadoop-Common-0.23-Build/ws/trunk/hadoop-common-project/hadoop-auth-examples/target/clover])>
[INFO] Clover Version 3.0.2, built on April 13 2010 (build-790)
[INFO] Loaded from: /home/jenkins/.m2/repository/com/cenqua/clover/clover/3.0.2/clover-3.0.2.jar
[INFO] Clover: Open Source License registered to Apache.
[INFO] Loading coverage database from: '<https://builds.apache.org/job/Hadoop-Common-0.23-Build/ws/trunk/hadoop-common-project/hadoop-auth-examples/target/clover/hadoop-coverage.db'>
[INFO] Writing HTML report to '<https://builds.apache.org/job/Hadoop-Common-0.23-Build/ws/trunk/hadoop-common-project/hadoop-auth-examples/target/clover'>
[INFO] Done. Processed 1 packages in 141ms (141ms per package).
[INFO] Clover Version 3.0.2, built on April 13 2010 (build-790)
[INFO] Loaded from: /home/jenkins/.m2/repository/com/cenqua/clover/clover/3.0.2/clover-3.0.2.jar
[INFO] Clover: Open Source License registered to Apache.
[INFO] Clover is enabled with initstring '<https://builds.apache.org/job/Hadoop-Common-0.23-Build/ws/trunk/hadoop-common-project/hadoop-auth-examples/target/clover/hadoop-coverage.db'>
[WARNING] Clover historical directory [<https://builds.apache.org/job/Hadoop-Common-0.23-Build/ws/trunk/hadoop-common-project/hadoop-auth-examples/target/clover/history]>
does not exist, skipping Clover historical report generation ([<https://builds.apache.org/job/Hadoop-Common-0.23-Build/ws/trunk/hadoop-common-project/hadoop-auth-examples/target/clover/clover.xml])>
[INFO] Clover Version 3.0.2, built on April 13 2010 (build-790)
[INFO] Loaded from: /home/jenkins/.m2/repository/com/cenqua/clover/clover/3.0.2/clover-3.0.2.jar
[INFO] Clover: Open Source License registered to Apache.
[INFO] Loading coverage database from: '<https://builds.apache.org/job/Hadoop-Common-0.23-Build/ws/trunk/hadoop-common-project/hadoop-auth-examples/target/clover/hadoop-coverage.db'>
[INFO] Writing report to '<https://builds.apache.org/job/Hadoop-Common-0.23-Build/ws/trunk/hadoop-common-project/hadoop-auth-examples/target/clover/clover.xml'>
[INFO]                                                                         
[INFO] ------------------------------------------------------------------------
[INFO] Building Apache Hadoop Common 0.23.5-SNAPSHOT
[INFO] ------------------------------------------------------------------------
[INFO] 
[INFO] --- maven-antrun-plugin:1.6:run (create-testdirs) @ hadoop-common ---
[INFO] Executing tasks

main:
[INFO] Executed tasks
[INFO] 
[INFO] --- maven-antrun-plugin:1.6:run (compile-proto) @ hadoop-common ---
[INFO] Executing tasks

main:
[INFO] Executed tasks
[INFO] 
[INFO] --- maven-antrun-plugin:1.6:run (save-version) @ hadoop-common ---
[INFO] Executing tasks

main:
[INFO] Executed tasks
[INFO] 
[INFO] --- maven-dependency-plugin:2.1:build-classpath (build-classpath) @ hadoop-common ---
[INFO] Wrote classpath file '<https://builds.apache.org/job/Hadoop-Common-0.23-Build/ws/trunk/hadoop-common-project/hadoop-common/target/classes/mrapp-generated-classpath'.>
[INFO] 
[INFO] --- build-helper-maven-plugin:1.5:add-source (add-source) @ hadoop-common ---
[INFO] Source directory: <https://builds.apache.org/job/Hadoop-Common-0.23-Build/ws/trunk/hadoop-common-project/hadoop-common/target/generated-sources/java>
added.
[INFO] 
[INFO] --- build-helper-maven-plugin:1.5:add-test-source (add-test-source) @ hadoop-common
---
[INFO] Test Source directory: <https://builds.apache.org/job/Hadoop-Common-0.23-Build/ws/trunk/hadoop-common-project/hadoop-common/target/generated-test-sources/java>
added.
[INFO] 
[INFO] --- maven-clover2-plugin:3.0.5:setup (setup) @ hadoop-common ---
[INFO] Clover Version 3.0.2, built on April 13 2010 (build-790)
[INFO] Loaded from: /home/jenkins/.m2/repository/com/cenqua/clover/clover/3.0.2/clover-3.0.2.jar
[INFO] Clover: Open Source License registered to Apache.
[INFO] Creating new database at '<https://builds.apache.org/job/Hadoop-Common-0.23-Build/ws/trunk/hadoop-common-project/hadoop-common/target/clover/hadoop-coverage.db'.>
[INFO] Processing files at 1.6 source level.
[INFO] Clover all over. Instrumented 593 files (58 packages).
[INFO] Elapsed time = 3.418 secs. (173.493 files/sec, 33,680.516 srclines/sec)
[INFO] Clover Version 3.0.2, built on April 13 2010 (build-790)
[INFO] Loaded from: /home/jenkins/.m2/repository/com/cenqua/clover/clover/3.0.2/clover-3.0.2.jar
[INFO] Clover: Open Source License registered to Apache.
[INFO] Updating existing database at '<https://builds.apache.org/job/Hadoop-Common-0.23-Build/ws/trunk/hadoop-common-project/hadoop-common/target/clover/hadoop-coverage.db'.>
[INFO] Processing files at 1.6 source level.
[INFO] Clover all over. Instrumented 290 files (42 packages).
[INFO] 1175 test methods detected.
[INFO] Elapsed time = 1.872 secs. (154.915 files/sec, 29,788.996 srclines/sec)
[INFO] 
[INFO] --- maven-resources-plugin:2.2:resources (default-resources) @ hadoop-common ---
[INFO] Using default encoding to copy filtered resources.
[INFO] 
[INFO] --- maven-compiler-plugin:2.5.1:compile (default-compile) @ hadoop-common ---
[INFO] Compiling 593 source files to <https://builds.apache.org/job/Hadoop-Common-0.23-Build/ws/trunk/hadoop-common-project/hadoop-common/target/classes>
[WARNING] <https://builds.apache.org/job/Hadoop-Common-0.23-Build/ws/trunk/hadoop-common-project/hadoop-common/target/clover/src-instrumented/org/apache/hadoop/security/HadoopKerberosName.java>:[28,24]
sun.security.krb5.Config is Sun proprietary API and may be removed in a future release
[WARNING] <https://builds.apache.org/job/Hadoop-Common-0.23-Build/ws/trunk/hadoop-common-project/hadoop-common/target/clover/src-instrumented/org/apache/hadoop/security/HadoopKerberosName.java>:[29,24]
sun.security.krb5.KrbException is Sun proprietary API and may be removed in a future release
[WARNING] <https://builds.apache.org/job/Hadoop-Common-0.23-Build/ws/trunk/hadoop-common-project/hadoop-common/target/clover/src-instrumented/org/apache/hadoop/security/SecurityUtil.java>:[49,18]
sun.net.dns.ResolverConfiguration is Sun proprietary API and may be removed in a future release
[WARNING] <https://builds.apache.org/job/Hadoop-Common-0.23-Build/ws/trunk/hadoop-common-project/hadoop-common/target/clover/src-instrumented/org/apache/hadoop/security/SecurityUtil.java>:[50,19]
sun.net.util.IPAddressUtil is Sun proprietary API and may be removed in a future release
[WARNING] <https://builds.apache.org/job/Hadoop-Common-0.23-Build/ws/trunk/hadoop-common-project/hadoop-common/target/clover/src-instrumented/org/apache/hadoop/security/SecurityUtil.java>:[51,29]
sun.security.jgss.krb5.Krb5Util is Sun proprietary API and may be removed in a future release
[WARNING] <https://builds.apache.org/job/Hadoop-Common-0.23-Build/ws/trunk/hadoop-common-project/hadoop-common/target/clover/src-instrumented/org/apache/hadoop/security/SecurityUtil.java>:[52,24]
sun.security.krb5.Credentials is Sun proprietary API and may be removed in a future release
[WARNING] <https://builds.apache.org/job/Hadoop-Common-0.23-Build/ws/trunk/hadoop-common-project/hadoop-common/target/clover/src-instrumented/org/apache/hadoop/security/SecurityUtil.java>:[53,24]
sun.security.krb5.PrincipalName is Sun proprietary API and may be removed in a future release
[WARNING] <https://builds.apache.org/job/Hadoop-Common-0.23-Build/ws/trunk/hadoop-common-project/hadoop-common/target/clover/src-instrumented/org/apache/hadoop/io/FastByteComparisons.java>:[25,15]
sun.misc.Unsafe is Sun proprietary API and may be removed in a future release
[WARNING] <https://builds.apache.org/job/Hadoop-Common-0.23-Build/ws/trunk/hadoop-common-project/hadoop-common/target/clover/src-instrumented/org/apache/hadoop/io/FastByteComparisons.java>:[117,19]
sun.misc.Unsafe is Sun proprietary API and may be removed in a future release
[WARNING] <https://builds.apache.org/job/Hadoop-Common-0.23-Build/ws/trunk/hadoop-common-project/hadoop-common/target/clover/src-instrumented/org/apache/hadoop/security/HadoopKerberosName.java>:[43,44]
sun.security.krb5.Config is Sun proprietary API and may be removed in a future release
[WARNING] <https://builds.apache.org/job/Hadoop-Common-0.23-Build/ws/trunk/hadoop-common-project/hadoop-common/target/clover/src-instrumented/org/apache/hadoop/security/HadoopKerberosName.java>:[44,13]
sun.security.krb5.KrbException is Sun proprietary API and may be removed in a future release
[WARNING] <https://builds.apache.org/job/Hadoop-Common-0.23-Build/ws/trunk/hadoop-common-project/hadoop-common/target/clover/src-instrumented/org/apache/hadoop/security/SecurityUtil.java>:[157,43]
sun.security.krb5.Credentials is Sun proprietary API and may be removed in a future release
[WARNING] <https://builds.apache.org/job/Hadoop-Common-0.23-Build/ws/trunk/hadoop-common-project/hadoop-common/target/clover/src-instrumented/org/apache/hadoop/security/SecurityUtil.java>:[159,44]
sun.security.krb5.PrincipalName is Sun proprietary API and may be removed in a future release
[WARNING] <https://builds.apache.org/job/Hadoop-Common-0.23-Build/ws/trunk/hadoop-common-project/hadoop-common/target/clover/src-instrumented/org/apache/hadoop/security/SecurityUtil.java>:[159,74]
sun.security.krb5.PrincipalName is Sun proprietary API and may be removed in a future release
[WARNING] <https://builds.apache.org/job/Hadoop-Common-0.23-Build/ws/trunk/hadoop-common-project/hadoop-common/target/clover/src-instrumented/org/apache/hadoop/security/SecurityUtil.java>:[160,10]
sun.security.krb5.PrincipalName is Sun proprietary API and may be removed in a future release
[WARNING] <https://builds.apache.org/job/Hadoop-Common-0.23-Build/ws/trunk/hadoop-common-project/hadoop-common/target/clover/src-instrumented/org/apache/hadoop/security/SecurityUtil.java>:[162,23]
sun.security.jgss.krb5.Krb5Util is Sun proprietary API and may be removed in a future release
[WARNING] <https://builds.apache.org/job/Hadoop-Common-0.23-Build/ws/trunk/hadoop-common-project/hadoop-common/target/clover/src-instrumented/org/apache/hadoop/security/SecurityUtil.java>:[161,58]
sun.security.krb5.Credentials is Sun proprietary API and may be removed in a future release
[WARNING] <https://builds.apache.org/job/Hadoop-Common-0.23-Build/ws/trunk/hadoop-common-project/hadoop-common/target/clover/src-instrumented/org/apache/hadoop/security/SecurityUtil.java>:[171,13]
sun.security.jgss.krb5.Krb5Util is Sun proprietary API and may be removed in a future release
[WARNING] <https://builds.apache.org/job/Hadoop-Common-0.23-Build/ws/trunk/hadoop-common-project/hadoop-common/target/clover/src-instrumented/org/apache/hadoop/security/SecurityUtil.java>:[503,8]
sun.net.dns.ResolverConfiguration is Sun proprietary API and may be removed in a future release
[WARNING] <https://builds.apache.org/job/Hadoop-Common-0.23-Build/ws/trunk/hadoop-common-project/hadoop-common/target/clover/src-instrumented/org/apache/hadoop/security/SecurityUtil.java>:[520,51]
sun.net.util.IPAddressUtil is Sun proprietary API and may be removed in a future release
[WARNING] <https://builds.apache.org/job/Hadoop-Common-0.23-Build/ws/trunk/hadoop-common-project/hadoop-common/target/clover/src-instrumented/org/apache/hadoop/security/SecurityUtil.java>:[522,58]
sun.net.util.IPAddressUtil is Sun proprietary API and may be removed in a future release
[WARNING] <https://builds.apache.org/job/Hadoop-Common-0.23-Build/ws/trunk/hadoop-common-project/hadoop-common/target/clover/src-instrumented/org/apache/hadoop/security/SecurityUtil.java>:[524,60]
sun.net.util.IPAddressUtil is Sun proprietary API and may be removed in a future release
[WARNING] <https://builds.apache.org/job/Hadoop-Common-0.23-Build/ws/trunk/hadoop-common-project/hadoop-common/target/clover/src-instrumented/org/apache/hadoop/security/SecurityUtil.java>:[526,58]
sun.net.util.IPAddressUtil is Sun proprietary API and may be removed in a future release
[WARNING] <https://builds.apache.org/job/Hadoop-Common-0.23-Build/ws/trunk/hadoop-common-project/hadoop-common/target/clover/src-instrumented/org/apache/hadoop/io/FastByteComparisons.java>:[123,59]
sun.misc.Unsafe is Sun proprietary API and may be removed in a future release
[WARNING] <https://builds.apache.org/job/Hadoop-Common-0.23-Build/ws/trunk/hadoop-common-project/hadoop-common/target/clover/src-instrumented/org/apache/hadoop/io/FastByteComparisons.java>:[128,66]
sun.misc.Unsafe is Sun proprietary API and may be removed in a future release
[INFO] 
[INFO] --- avro-maven-plugin:1.5.3:schema (generate-avro-test-sources) @ hadoop-common ---
[INFO] 
[INFO] --- avro-maven-plugin:1.5.3:protocol (generate-avro-test-sources) @ hadoop-common ---
[INFO] 
[INFO] --- maven-antrun-plugin:1.6:run (compile-test-proto) @ hadoop-common ---
[INFO] Executing tasks

main:
[INFO] Executed tasks
[INFO] 
[INFO] --- maven-antrun-plugin:1.6:run (generate-test-sources) @ hadoop-common ---
[INFO] Executing tasks

main:
[INFO] Executed tasks
[INFO] 
[INFO] --- maven-resources-plugin:2.2:testResources (default-testResources) @ hadoop-common
---
[INFO] Using default encoding to copy filtered resources.
[INFO] 
[INFO] --- maven-antrun-plugin:1.6:run (create-log-dir) @ hadoop-common ---
[INFO] Executing tasks

main:
   [delete] Deleting directory <https://builds.apache.org/job/Hadoop-Common-0.23-Build/ws/trunk/hadoop-common-project/hadoop-common/target/test/data>
    [mkdir] Created dir: <https://builds.apache.org/job/Hadoop-Common-0.23-Build/ws/trunk/hadoop-common-project/hadoop-common/target/test/data>
[INFO] Executed tasks
[INFO] 
[INFO] --- maven-compiler-plugin:2.5.1:testCompile (default-testCompile) @ hadoop-common ---
[INFO] Compiling 297 source files to <https://builds.apache.org/job/Hadoop-Common-0.23-Build/ws/trunk/hadoop-common-project/hadoop-common/target/test-classes>
[INFO] -------------------------------------------------------------
[ERROR] COMPILATION ERROR : 
[INFO] -------------------------------------------------------------
[ERROR] <https://builds.apache.org/job/Hadoop-Common-0.23-Build/ws/trunk/hadoop-common-project/hadoop-common/target/clover/src-test-instrumented/org/apache/hadoop/record/RecInt.java>:[4,7]
duplicate class: org.apache.hadoop.record.RecInt
[ERROR] <https://builds.apache.org/job/Hadoop-Common-0.23-Build/ws/trunk/hadoop-common-project/hadoop-common/target/generated-test-sources/java/org/apache/hadoop/record/RecRecordOld.java>:[4,7]
duplicate class: org.apache.hadoop.record.RecRecordOld
[ERROR] <https://builds.apache.org/job/Hadoop-Common-0.23-Build/ws/trunk/hadoop-common-project/hadoop-common/target/clover/src-test-instrumented/org/apache/hadoop/record/RecString.java>:[4,7]
duplicate class: org.apache.hadoop.record.RecString
[ERROR] <https://builds.apache.org/job/Hadoop-Common-0.23-Build/ws/trunk/hadoop-common-project/hadoop-common/target/generated-test-sources/java/org/apache/hadoop/record/RecBuffer.java>:[4,7]
duplicate class: org.apache.hadoop.record.RecBuffer
[ERROR] <https://builds.apache.org/job/Hadoop-Common-0.23-Build/ws/trunk/hadoop-common-project/hadoop-common/target/clover/src-test-instrumented/org/apache/hadoop/record/RecRecord1.java>:[4,7]
duplicate class: org.apache.hadoop.record.RecRecord1
[ERROR] <https://builds.apache.org/job/Hadoop-Common-0.23-Build/ws/trunk/hadoop-common-project/hadoop-common/target/clover/src-test-instrumented/org/apache/hadoop/record/RecRecordNew.java>:[4,7]
duplicate class: org.apache.hadoop.record.RecRecordNew
[ERROR] <https://builds.apache.org/job/Hadoop-Common-0.23-Build/ws/trunk/hadoop-common-project/hadoop-common/target/clover/src-test-instrumented/org/apache/hadoop/record/RecRecord0.java>:[4,7]
duplicate class: org.apache.hadoop.record.RecRecord0
[INFO] 7 errors 
[INFO] -------------------------------------------------------------
[INFO] ------------------------------------------------------------------------
[INFO] Reactor Summary:
[INFO] 
[INFO] Apache Hadoop Annotations ......................... SUCCESS [6.522s]
[INFO] Apache Hadoop Auth ................................ SUCCESS [8.856s]
[INFO] Apache Hadoop Auth Examples ....................... SUCCESS [1.505s]
[INFO] Apache Hadoop Common .............................. FAILURE [20.379s]
[INFO] Apache Hadoop Common Project ...................... SKIPPED
[INFO] ------------------------------------------------------------------------
[INFO] BUILD FAILURE
[INFO] ------------------------------------------------------------------------
[INFO] Total time: 37.618s
[INFO] Finished at: Thu Oct 25 09:09:44 UTC 2012
[INFO] Final Memory: 36M/622M
[INFO] ------------------------------------------------------------------------
[ERROR] Failed to execute goal org.apache.maven.plugins:maven-compiler-plugin:2.5.1:testCompile
(default-testCompile) on project hadoop-common: Compilation failure: Compilation failure:
[ERROR] <https://builds.apache.org/job/Hadoop-Common-0.23-Build/ws/trunk/hadoop-common-project/hadoop-common/target/clover/src-test-instrumented/org/apache/hadoop/record/RecInt.java>:[4,7]
duplicate class: org.apache.hadoop.record.RecInt
[ERROR] <https://builds.apache.org/job/Hadoop-Common-0.23-Build/ws/trunk/hadoop-common-project/hadoop-common/target/generated-test-sources/java/org/apache/hadoop/record/RecRecordOld.java>:[4,7]
duplicate class: org.apache.hadoop.record.RecRecordOld
[ERROR] <https://builds.apache.org/job/Hadoop-Common-0.23-Build/ws/trunk/hadoop-common-project/hadoop-common/target/clover/src-test-instrumented/org/apache/hadoop/record/RecString.java>:[4,7]
duplicate class: org.apache.hadoop.record.RecString
[ERROR] <https://builds.apache.org/job/Hadoop-Common-0.23-Build/ws/trunk/hadoop-common-project/hadoop-common/target/generated-test-sources/java/org/apache/hadoop/record/RecBuffer.java>:[4,7]
duplicate class: org.apache.hadoop.record.RecBuffer
[ERROR] <https://builds.apache.org/job/Hadoop-Common-0.23-Build/ws/trunk/hadoop-common-project/hadoop-common/target/clover/src-test-instrumented/org/apache/hadoop/record/RecRecord1.java>:[4,7]
duplicate class: org.apache.hadoop.record.RecRecord1
[ERROR] <https://builds.apache.org/job/Hadoop-Common-0.23-Build/ws/trunk/hadoop-common-project/hadoop-common/target/clover/src-test-instrumented/org/apache/hadoop/record/RecRecordNew.java>:[4,7]
duplicate class: org.apache.hadoop.record.RecRecordNew
[ERROR] <https://builds.apache.org/job/Hadoop-Common-0.23-Build/ws/trunk/hadoop-common-project/hadoop-common/target/clover/src-test-instrumented/org/apache/hadoop/record/RecRecord0.java>:[4,7]
duplicate class: org.apache.hadoop.record.RecRecord0
[ERROR] -> [Help 1]
[ERROR] 
[ERROR] To see the full stack trace of the errors, re-run Maven with the -e switch.
[ERROR] Re-run Maven using the -X switch to enable full debug logging.
[ERROR] 
[ERROR] For more information about the errors and possible solutions, please read the following
articles:
[ERROR] [Help 1] http://cwiki.apache.org/confluence/display/MAVEN/MojoFailureException
[ERROR] 
[ERROR] After correcting the problems, you can resume the build with the command
[ERROR]   mvn <goals> -rf :hadoop-common
Build step 'Execute shell' marked build as failure
[WARNINGS] Skipping publisher since build result is FAILURE
Archiving artifacts
Recording fingerprints
Publishing Javadoc
Recording test results

Mime
View raw message