hadoop-common-dev mailing list archives

Site index · List index
Message view « Date » · « Thread »
Top « Date » · « Thread »
From Apache Jenkins Server <jenk...@builds.apache.org>
Subject Build failed in Jenkins: Hadoop-Common-0.23-Build #363
Date Wed, 05 Sep 2012 09:17:31 GMT
See <https://builds.apache.org/job/Hadoop-Common-0.23-Build/363/changes>

Changes:

[bobby] Updated version numbers for 0.23.4

------------------------------------------
[...truncated 11626 lines...]
Running org.apache.hadoop.io.file.tfile.TestTFileNoneCodecsJClassComparatorByteArrays
Tests run: 25, Failures: 0, Errors: 0, Skipped: 0, Time elapsed: 1.412 sec
Running org.apache.hadoop.io.file.tfile.TestTFileComparator2
Tests run: 1, Failures: 0, Errors: 0, Skipped: 0, Time elapsed: 1.57 sec
Running org.apache.hadoop.io.file.tfile.TestTFile
Tests run: 3, Failures: 0, Errors: 0, Skipped: 0, Time elapsed: 1.433 sec
Running org.apache.hadoop.io.file.tfile.TestTFileSplit
Tests run: 1, Failures: 0, Errors: 0, Skipped: 0, Time elapsed: 10.701 sec
Running org.apache.hadoop.io.file.tfile.TestTFileSeqFileComparison
Tests run: 1, Failures: 0, Errors: 0, Skipped: 0, Time elapsed: 7.271 sec
Running org.apache.hadoop.io.file.tfile.TestTFileNoneCodecsStreams
Tests run: 19, Failures: 0, Errors: 0, Skipped: 0, Time elapsed: 2.226 sec
Running org.apache.hadoop.io.file.tfile.TestTFileComparators
Tests run: 3, Failures: 0, Errors: 0, Skipped: 0, Time elapsed: 0.588 sec
Running org.apache.hadoop.io.TestMapFile
Tests run: 3, Failures: 0, Errors: 0, Skipped: 0, Time elapsed: 0.712 sec
Running org.apache.hadoop.io.TestBytesWritable
Tests run: 5, Failures: 0, Errors: 0, Skipped: 0, Time elapsed: 0.156 sec
Running org.apache.hadoop.io.TestArrayFile
Tests run: 2, Failures: 0, Errors: 0, Skipped: 0, Time elapsed: 7.561 sec
Running org.apache.hadoop.io.TestVersionedWritable
Tests run: 3, Failures: 0, Errors: 0, Skipped: 0, Time elapsed: 0.133 sec
Running org.apache.hadoop.io.TestArrayWritable
Tests run: 1, Failures: 0, Errors: 0, Skipped: 0, Time elapsed: 0.138 sec
Running org.apache.hadoop.io.nativeio.TestNativeIO
Tests run: 9, Failures: 0, Errors: 0, Skipped: 0, Time elapsed: 6.006 sec
Running org.apache.hadoop.io.TestWritableUtils
Tests run: 1, Failures: 0, Errors: 0, Skipped: 0, Time elapsed: 0.192 sec
Running org.apache.hadoop.io.TestIOUtils
Tests run: 7, Failures: 0, Errors: 0, Skipped: 0, Time elapsed: 0.377 sec
Running org.apache.hadoop.io.serializer.avro.TestAvroSerialization
Tests run: 4, Failures: 0, Errors: 0, Skipped: 0, Time elapsed: 0.611 sec
Running org.apache.hadoop.io.serializer.TestWritableSerialization
Tests run: 3, Failures: 0, Errors: 0, Skipped: 0, Time elapsed: 0.356 sec
Running org.apache.hadoop.io.serializer.TestSerializationFactory
Tests run: 1, Failures: 0, Errors: 0, Skipped: 0, Time elapsed: 0.333 sec
Running org.apache.hadoop.test.TestMultithreadedTestUtil
Tests run: 4, Failures: 0, Errors: 0, Skipped: 0, Time elapsed: 3.239 sec
Running org.apache.hadoop.net.TestSocketIOWithTimeout
Tests run: 1, Failures: 0, Errors: 0, Skipped: 0, Time elapsed: 5.287 sec
Running org.apache.hadoop.net.TestSwitchMapping
Tests run: 5, Failures: 0, Errors: 0, Skipped: 0, Time elapsed: 0.342 sec
Running org.apache.hadoop.net.TestNetUtils
Tests run: 36, Failures: 0, Errors: 0, Skipped: 0, Time elapsed: 3.575 sec
Running org.apache.hadoop.net.TestStaticMapping
Tests run: 8, Failures: 0, Errors: 0, Skipped: 0, Time elapsed: 0.636 sec
Running org.apache.hadoop.net.TestScriptBasedMapping
Tests run: 4, Failures: 0, Errors: 0, Skipped: 0, Time elapsed: 0.891 sec
Running org.apache.hadoop.net.TestDNS
Tests run: 7, Failures: 0, Errors: 0, Skipped: 0, Time elapsed: 0.229 sec

Results :

Tests run: 1560, Failures: 0, Errors: 0, Skipped: 4

[INFO] 
[INFO] --- maven-clover2-plugin:3.0.5:clover (clover) @ hadoop-common ---
[INFO] Using /default-clover-report descriptor.
[INFO] Using Clover report descriptor: /tmp/mvn856092105075768478resource
[INFO] Clover Version 3.0.2, built on April 13 2010 (build-790)
[INFO] Loaded from: /home/jenkins/.m2/repository/com/cenqua/clover/clover/3.0.2/clover-3.0.2.jar
[INFO] Clover: Open Source License registered to Apache.
[INFO] Clover is enabled with initstring '<https://builds.apache.org/job/Hadoop-Common-0.23-Build/ws/trunk/hadoop-common-project/hadoop-common/target/clover/hadoop-coverage.db'>
[WARNING] Clover historical directory [<https://builds.apache.org/job/Hadoop-Common-0.23-Build/ws/trunk/hadoop-common-project/hadoop-common/target/clover/history]>
does not exist, skipping Clover historical report generation ([<https://builds.apache.org/job/Hadoop-Common-0.23-Build/ws/trunk/hadoop-common-project/hadoop-common/target/clover])>
[INFO] Clover Version 3.0.2, built on April 13 2010 (build-790)
[INFO] Loaded from: /home/jenkins/.m2/repository/com/cenqua/clover/clover/3.0.2/clover-3.0.2.jar
[INFO] Clover: Open Source License registered to Apache.
[INFO] Loading coverage database from: '<https://builds.apache.org/job/Hadoop-Common-0.23-Build/ws/trunk/hadoop-common-project/hadoop-common/target/clover/hadoop-coverage.db'>
[WARNING] Failed to load coverage recording RecordingTranscripts.FileRef[datafile=<https://builds.apache.org/job/Hadoop-Common-0.23-Build/ws/trunk/hadoop-common-project/hadoop-common/target/clover/hadoop-coverage.db8dh7i_h6q7k234,>
testRecording=false, typedTestId=-1, runId=0, hash=14065758, timestamp=1346836297360]
java.io.EOFException: Unexpected end of ZLIB input streamjava.io.EOFException: Unexpected
end of ZLIB input stream
	at java.util.zip.InflaterInputStream.fill(InflaterInputStream.java:223)
	at java.util.zip.InflaterInputStream.read(InflaterInputStream.java:141)
	at java.io.BufferedInputStream.fill(BufferedInputStream.java:218)
	at java.io.BufferedInputStream.read1(BufferedInputStream.java:258)
	at java.io.BufferedInputStream.read(BufferedInputStream.java:317)
	at java.io.DataInputStream.readFully(DataInputStream.java:178)
	at java.io.DataInputStream.readLong(DataInputStream.java:399)
	at com.cenqua.clover.BaseRecording$Header.read(BaseRecording.java:65)
	at com.cenqua.clover.BaseRecording$Header.<init>(BaseRecording.java:55)
	at com.cenqua.clover.RecordingTranscripts.readCoverageFromDisk(RecordingTranscripts.java:42)
	at com.cenqua.clover.RecordingTranscripts$FileRef.read(RecordingTranscripts.java:356)
	at com.cenqua.clover.CoverageDataCollator.collateRecordingFiles(CoverageDataCollator.java:116)
	at com.cenqua.clover.CoverageDataCollator.loadCoverageData(CoverageDataCollator.java:66)
	at com.cenqua.clover.CloverDatabase.loadCoverageData(CloverDatabase.java:164)
	at com.cenqua.clover.CloverDatabase.loadCoverageData(CloverDatabase.java:159)
	at com.cenqua.clover.reporters.CloverReportConfig.getCoverageDatabase(CloverReportConfig.java:342)
	at com.cenqua.clover.reporters.Current.getCoverageDatabase(Current.java:126)
	at com.cenqua.clover.reporters.CloverReporter.<init>(CloverReporter.java:33)
	at com.cenqua.clover.reporters.html.HtmlReporter.<init>(HtmlReporter.java:125)
	at com.cenqua.clover.reporters.CloverReporter.buildReporter(CloverReporter.java:72)
	at com.cenqua.clover.tasks.CloverReportTask.generateReports(CloverReportTask.java:428)
	at com.cenqua.clover.tasks.CloverReportTask.cloverExecute(CloverReportTask.java:385)
	at com.cenqua.clover.tasks.AbstractCloverTask.execute(AbstractCloverTask.java:55)
	at org.apache.tools.ant.UnknownElement.execute(UnknownElement.java:288)
	at sun.reflect.GeneratedMethodAccessor190.invoke(Unknown Source)
	at sun.reflect.DelegatingMethodAccessorImpl.invoke(DelegatingMethodAccessorImpl.java:25)
	at java.lang.reflect.Method.invoke(Method.java:597)
	at org.apache.tools.ant.dispatch.DispatchUtils.execute(DispatchUtils.java:106)
	at org.apache.tools.ant.Task.perform(Task.java:348)
	at org.apache.tools.ant.Target.execute(Target.java:357)
	at org.apache.tools.ant.Target.performTasks(Target.java:385)
	at org.apache.tools.ant.Project.executeSortedTargets(Project.java:1337)
	at org.apache.tools.ant.Project.executeTarget(Project.java:1306)
	at com.atlassian.maven.plugin.clover.CloverReportMojo.createReport(CloverReportMojo.java:424)
	at com.atlassian.maven.plugin.clover.CloverReportMojo.createAllReportTypes(CloverReportMojo.java:372)
	at com.atlassian.maven.plugin.clover.CloverReportMojo.executeReport(CloverReportMojo.java:356)
	at org.apache.maven.reporting.AbstractMavenReport.generate(AbstractMavenReport.java:101)
	at org.apache.maven.reporting.AbstractMavenReport.execute(AbstractMavenReport.java:66)
	at org.apache.maven.plugin.DefaultBuildPluginManager.executeMojo(DefaultBuildPluginManager.java:101)
	at org.apache.maven.lifecycle.internal.MojoExecutor.execute(MojoExecutor.java:209)
	at org.apache.maven.lifecycle.internal.MojoExecutor.execute(MojoExecutor.java:153)
	at org.apache.maven.lifecycle.internal.MojoExecutor.execute(MojoExecutor.java:145)
	at org.apache.maven.lifecycle.internal.LifecycleModuleBuilder.buildProject(LifecycleModuleBuilder.java:84)
	at org.apache.maven.lifecycle.internal.LifecycleModuleBuilder.buildProject(LifecycleModuleBuilder.java:59)
	at org.apache.maven.lifecycle.internal.LifecycleStarter.singleThreadedBuild(LifecycleStarter.java:183)
	at org.apache.maven.lifecycle.internal.LifecycleStarter.execute(LifecycleStarter.java:161)
	at org.apache.maven.DefaultMaven.doExecute(DefaultMaven.java:319)
	at org.apache.maven.DefaultMaven.execute(DefaultMaven.java:156)
	at org.apache.maven.cli.MavenCli.execute(MavenCli.java:537)
	at org.apache.maven.cli.MavenCli.doMain(MavenCli.java:196)
	at org.apache.maven.cli.MavenCli.main(MavenCli.java:141)
	at sun.reflect.NativeMethodAccessorImpl.invoke0(Native Method)
	at sun.reflect.NativeMethodAccessorImpl.invoke(NativeMethodAccessorImpl.java:39)
	at sun.reflect.DelegatingMethodAccessorImpl.invoke(DelegatingMethodAccessorImpl.java:25)
	at java.lang.reflect.Method.invoke(Method.java:597)
	at org.codehaus.plexus.classworlds.launcher.Launcher.launchEnhanced(Launcher.java:290)
	at org.codehaus.plexus.classworlds.launcher.Launcher.launch(Launcher.java:230)
	at org.codehaus.plexus.classworlds.launcher.Launcher.mainWithExitCode(Launcher.java:409)
	at org.codehaus.plexus.classworlds.launcher.Launcher.main(Launcher.java:352)
[INFO] Writing HTML report to '<https://builds.apache.org/job/Hadoop-Common-0.23-Build/ws/trunk/hadoop-common-project/hadoop-common/target/clover'>
[INFO] Done. Processed 63 packages in 33203ms (527ms per package).
[INFO] Clover Version 3.0.2, built on April 13 2010 (build-790)
[INFO] Loaded from: /home/jenkins/.m2/repository/com/cenqua/clover/clover/3.0.2/clover-3.0.2.jar
[INFO] Clover: Open Source License registered to Apache.
[INFO] Clover is enabled with initstring '<https://builds.apache.org/job/Hadoop-Common-0.23-Build/ws/trunk/hadoop-common-project/hadoop-common/target/clover/hadoop-coverage.db'>
[WARNING] Clover historical directory [<https://builds.apache.org/job/Hadoop-Common-0.23-Build/ws/trunk/hadoop-common-project/hadoop-common/target/clover/history]>
does not exist, skipping Clover historical report generation ([<https://builds.apache.org/job/Hadoop-Common-0.23-Build/ws/trunk/hadoop-common-project/hadoop-common/target/clover/clover.xml])>
[INFO] Clover Version 3.0.2, built on April 13 2010 (build-790)
[INFO] Loaded from: /home/jenkins/.m2/repository/com/cenqua/clover/clover/3.0.2/clover-3.0.2.jar
[INFO] Clover: Open Source License registered to Apache.
[INFO] Loading coverage database from: '<https://builds.apache.org/job/Hadoop-Common-0.23-Build/ws/trunk/hadoop-common-project/hadoop-common/target/clover/hadoop-coverage.db'>
[WARNING] Failed to load coverage recording RecordingTranscripts.FileRef[datafile=<https://builds.apache.org/job/Hadoop-Common-0.23-Build/ws/trunk/hadoop-common-project/hadoop-common/target/clover/hadoop-coverage.db8dh7i_h6q7k234,>
testRecording=false, typedTestId=-1, runId=0, hash=14065758, timestamp=1346836297360]
java.io.EOFException: Unexpected end of ZLIB input streamjava.io.EOFException: Unexpected
end of ZLIB input stream
	at java.util.zip.InflaterInputStream.fill(InflaterInputStream.java:223)
	at java.util.zip.InflaterInputStream.read(InflaterInputStream.java:141)
	at java.io.BufferedInputStream.fill(BufferedInputStream.java:218)
	at java.io.BufferedInputStream.read1(BufferedInputStream.java:258)
	at java.io.BufferedInputStream.read(BufferedInputStream.java:317)
	at java.io.DataInputStream.readFully(DataInputStream.java:178)
	at java.io.DataInputStream.readLong(DataInputStream.java:399)
	at com.cenqua.clover.BaseRecording$Header.read(BaseRecording.java:65)
	at com.cenqua.clover.BaseRecording$Header.<init>(BaseRecording.java:55)
	at com.cenqua.clover.RecordingTranscripts.readCoverageFromDisk(RecordingTranscripts.java:42)
	at com.cenqua.clover.RecordingTranscripts$FileRef.read(RecordingTranscripts.java:356)
	at com.cenqua.clover.CoverageDataCollator.collateRecordingFiles(CoverageDataCollator.java:116)
	at com.cenqua.clover.CoverageDataCollator.loadCoverageData(CoverageDataCollator.java:66)
	at com.cenqua.clover.CloverDatabase.loadCoverageData(CloverDatabase.java:164)
	at com.cenqua.clover.CloverDatabase.loadCoverageData(CloverDatabase.java:159)
	at com.cenqua.clover.reporters.CloverReportConfig.getCoverageDatabase(CloverReportConfig.java:342)
	at com.cenqua.clover.reporters.Current.getCoverageDatabase(Current.java:126)
	at com.cenqua.clover.reporters.xml.XMLReporter.<init>(XMLReporter.java:52)
	at com.cenqua.clover.reporters.CloverReporter.buildReporter(CloverReporter.java:70)
	at com.cenqua.clover.tasks.CloverReportTask.generateReports(CloverReportTask.java:428)
	at com.cenqua.clover.tasks.CloverReportTask.cloverExecute(CloverReportTask.java:385)
	at com.cenqua.clover.tasks.AbstractCloverTask.execute(AbstractCloverTask.java:55)
	at org.apache.tools.ant.UnknownElement.execute(UnknownElement.java:288)
	at sun.reflect.GeneratedMethodAccessor190.invoke(Unknown Source)
	at sun.reflect.DelegatingMethodAccessorImpl.invoke(DelegatingMethodAccessorImpl.java:25)
	at java.lang.reflect.Method.invoke(Method.java:597)
	at org.apache.tools.ant.dispatch.DispatchUtils.execute(DispatchUtils.java:106)
	at org.apache.tools.ant.Task.perform(Task.java:348)
	at org.apache.tools.ant.Target.execute(Target.java:357)
	at org.apache.tools.ant.Target.performTasks(Target.java:385)
	at org.apache.tools.ant.Project.executeSortedTargets(Project.java:1337)
	at org.apache.tools.ant.Project.executeTarget(Project.java:1306)
	at com.atlassian.maven.plugin.clover.CloverReportMojo.createReport(CloverReportMojo.java:424)
	at com.atlassian.maven.plugin.clover.CloverReportMojo.createAllReportTypes(CloverReportMojo.java:378)
	at com.atlassian.maven.plugin.clover.CloverReportMojo.executeReport(CloverReportMojo.java:356)
	at org.apache.maven.reporting.AbstractMavenReport.generate(AbstractMavenReport.java:101)
	at org.apache.maven.reporting.AbstractMavenReport.execute(AbstractMavenReport.java:66)
	at org.apache.maven.plugin.DefaultBuildPluginManager.executeMojo(DefaultBuildPluginManager.java:101)
	at org.apache.maven.lifecycle.internal.MojoExecutor.execute(MojoExecutor.java:209)
	at org.apache.maven.lifecycle.internal.MojoExecutor.execute(MojoExecutor.java:153)
	at org.apache.maven.lifecycle.internal.MojoExecutor.execute(MojoExecutor.java:145)
	at org.apache.maven.lifecycle.internal.LifecycleModuleBuilder.buildProject(LifecycleModuleBuilder.java:84)
	at org.apache.maven.lifecycle.internal.LifecycleModuleBuilder.buildProject(LifecycleModuleBuilder.java:59)
	at org.apache.maven.lifecycle.internal.LifecycleStarter.singleThreadedBuild(LifecycleStarter.java:183)
	at org.apache.maven.lifecycle.internal.LifecycleStarter.execute(LifecycleStarter.java:161)
	at org.apache.maven.DefaultMaven.doExecute(DefaultMaven.java:319)
	at org.apache.maven.DefaultMaven.execute(DefaultMaven.java:156)
	at org.apache.maven.cli.MavenCli.execute(MavenCli.java:537)
	at org.apache.maven.cli.MavenCli.doMain(MavenCli.java:196)
	at org.apache.maven.cli.MavenCli.main(MavenCli.java:141)
	at sun.reflect.NativeMethodAccessorImpl.invoke0(Native Method)
	at sun.reflect.NativeMethodAccessorImpl.invoke(NativeMethodAccessorImpl.java:39)
	at sun.reflect.DelegatingMethodAccessorImpl.invoke(DelegatingMethodAccessorImpl.java:25)
	at java.lang.reflect.Method.invoke(Method.java:597)
	at org.codehaus.plexus.classworlds.launcher.Launcher.launchEnhanced(Launcher.java:290)
	at org.codehaus.plexus.classworlds.launcher.Launcher.launch(Launcher.java:230)
	at org.codehaus.plexus.classworlds.launcher.Launcher.mainWithExitCode(Launcher.java:409)
	at org.codehaus.plexus.classworlds.launcher.Launcher.main(Launcher.java:352)
[INFO] Writing report to '<https://builds.apache.org/job/Hadoop-Common-0.23-Build/ws/trunk/hadoop-common-project/hadoop-common/target/clover/clover.xml'>
[INFO]                                                                         
[INFO] ------------------------------------------------------------------------
[INFO] Building Apache Hadoop Common Project 0.23.4-SNAPSHOT
[INFO] ------------------------------------------------------------------------
[INFO] 
[INFO] --- maven-antrun-plugin:1.6:run (create-testdirs) @ hadoop-common-project ---
[INFO] Executing tasks

main:
[INFO] Executed tasks
[INFO] 
[INFO] --- maven-dependency-plugin:2.1:build-classpath (build-classpath) @ hadoop-common-project
---
[INFO] Skipped writing classpath file '<https://builds.apache.org/job/Hadoop-Common-0.23-Build/ws/trunk/hadoop-common-project/target/classes/mrapp-generated-classpath'.>
 No changes found.
[INFO] 
[INFO] --- maven-clover2-plugin:3.0.5:setup (setup) @ hadoop-common-project ---
[WARNING] The reported language of this project is none, attempting to instrument sources
anyway.
[INFO] No Clover instrumentation done on source files in: [<https://builds.apache.org/job/Hadoop-Common-0.23-Build/ws/trunk/hadoop-common-project/src/main/java]>
as no matching sources files found
[INFO] No Clover instrumentation done on source files in: [<https://builds.apache.org/job/Hadoop-Common-0.23-Build/ws/trunk/hadoop-common-project/src/test/java]>
as no matching sources files found
[INFO] 
[INFO] --- maven-clover2-plugin:3.0.5:clover (clover) @ hadoop-common-project ---
[WARNING] No Clover database found, skipping report generation
[INFO] No report being generated for this module.
[INFO] Using /default-clover-report descriptor.
[INFO] Using Clover report descriptor: /tmp/mvn2449657731936486671resource
[INFO] ------------------------------------------------------------------------
[INFO] Reactor Summary:
[INFO] 
[INFO] Apache Hadoop Annotations ......................... SUCCESS [6.833s]
[INFO] Apache Hadoop Auth ................................ SUCCESS [8.738s]
[INFO] Apache Hadoop Auth Examples ....................... SUCCESS [1.679s]
[INFO] Apache Hadoop Common .............................. SUCCESS [8:39.679s]
[INFO] Apache Hadoop Common Project ...................... SUCCESS [1.185s]
[INFO] ------------------------------------------------------------------------
[INFO] BUILD SUCCESS
[INFO] ------------------------------------------------------------------------
[INFO] Total time: 8:58.474s
[INFO] Finished at: Wed Sep 05 09:17:13 UTC 2012
[INFO] Final Memory: 41M/834M
[INFO] ------------------------------------------------------------------------
[WARNINGS] Parsing warnings in console log with parser Java Compiler
[WARNINGS] Parsing warnings in console log with parser JavaDoc
Archiving artifacts
ERROR: No artifacts found that match the file pattern "trunk/hadoop-common-project/*/target/*.tar.gz".
Configuration error?
ERROR: 'trunk/hadoop-common-project/*/target/*.tar.gz' doesn't match anything: 'trunk' exists
but not 'trunk/hadoop-common-project/*/target/*.tar.gz'
Build step 'Archive the artifacts' changed build result to FAILURE
Recording fingerprints
Publishing Javadoc
Recording test results

Mime
View raw message