hadoop-common-dev mailing list archives

Site index · List index
Message view « Date » · « Thread »
Top « Date » · « Thread »
From Apache Jenkins Server <jenk...@builds.apache.org>
Subject Build failed in Jenkins: Hadoop-Common-trunk #535
Date Sun, 16 Sep 2012 09:13:51 GMT
See <https://builds.apache.org/job/Hadoop-Common-trunk/535/>

------------------------------------------
[...truncated 13300 lines...]
[DEBUG]   (f) outputDirectory = <https://builds.apache.org/job/Hadoop-Common-trunk/ws/trunk/hadoop-common-project/hadoop-auth/target/test-classes>
[DEBUG]   (f) project = MavenProject: org.apache.hadoop:hadoop-auth:3.0.0-SNAPSHOT @ <https://builds.apache.org/job/Hadoop-Common-trunk/ws/trunk/hadoop-common-project/hadoop-auth/pom.xml>
[DEBUG]   (f) resources = [Resource {targetPath: null, filtering: true, FileSet {directory:
<https://builds.apache.org/job/Hadoop-Common-trunk/ws/trunk/hadoop-common-project/hadoop-auth/src/test/resources,>
PatternSet [includes: {krb5.conf}, excludes: {}]}}]
[DEBUG] -- end configuration --
[INFO] Using default encoding to copy filtered resources.
[INFO] 
[INFO] --- maven-compiler-plugin:2.5.1:testCompile (default-testCompile) @ hadoop-auth ---
[DEBUG] Configuring mojo org.apache.maven.plugins:maven-compiler-plugin:2.5.1:testCompile
from plugin realm ClassRealm[plugin>org.apache.maven.plugins:maven-compiler-plugin:2.5.1,
parent: sun.misc.Launcher$AppClassLoader@126b249]
[DEBUG] Configuring mojo 'org.apache.maven.plugins:maven-compiler-plugin:2.5.1:testCompile'
with basic configurator -->
[DEBUG]   (f) basedir = <https://builds.apache.org/job/Hadoop-Common-trunk/ws/trunk/hadoop-common-project/hadoop-auth>
[DEBUG]   (f) buildDirectory = <https://builds.apache.org/job/Hadoop-Common-trunk/ws/trunk/hadoop-common-project/hadoop-auth/target>
[DEBUG]   (f) classpathElements = [<https://builds.apache.org/job/Hadoop-Common-trunk/ws/trunk/hadoop-common-project/hadoop-auth/target/test-classes,>
<https://builds.apache.org/job/Hadoop-Common-trunk/ws/trunk/hadoop-common-project/hadoop-auth/target/classes,>
<https://builds.apache.org/job/Hadoop-Common-trunk/ws/trunk/hadoop-common-project/hadoop-annotations/target/hadoop-annotations-3.0.0-SNAPSHOT.jar,>
/home/jenkins/.m2/repository/junit/junit/4.8.2/junit-4.8.2.jar, /home/jenkins/.m2/repository/org/mockito/mockito-all/1.8.5/mockito-all-1.8.5.jar,
/home/jenkins/.m2/repository/org/mortbay/jetty/jetty/6.1.26/jetty-6.1.26.jar, /home/jenkins/.m2/repository/org/mortbay/jetty/jetty-util/6.1.26/jetty-util-6.1.26.jar,
/home/jenkins/.m2/repository/javax/servlet/servlet-api/2.5/servlet-api-2.5.jar, /home/jenkins/.m2/repository/org/slf4j/slf4j-api/1.6.1/slf4j-api-1.6.1.jar,
/home/jenkins/.m2/repository/commons-codec/commons-codec/1.4/commons-codec-1.4.jar, /home/jenkins/.m2/repository/log4j/log4j/1.2.17/log4j-1.2.17.jar,
/home/jenkins/.m2/repository/org/slf4j/slf4j-log4j12/1.6.1/slf4j-log4j12-1.6.1.jar, /home/jenkins/tools/java/jdk1.6.0_26/jre/../lib/tools.jar]
[DEBUG]   (f) compileSourceRoots = [<https://builds.apache.org/job/Hadoop-Common-trunk/ws/trunk/hadoop-common-project/hadoop-auth/src/test/java]>
[DEBUG]   (f) compilerId = javac
[DEBUG]   (f) debug = true
[DEBUG]   (f) encoding = UTF-8
[DEBUG]   (f) failOnError = true
[DEBUG]   (f) fork = false
[DEBUG]   (f) generatedTestSourcesDirectory = <https://builds.apache.org/job/Hadoop-Common-trunk/ws/trunk/hadoop-common-project/hadoop-auth/target/generated-test-sources/test-annotations>
[DEBUG]   (f) optimize = false
[DEBUG]   (f) outputDirectory = <https://builds.apache.org/job/Hadoop-Common-trunk/ws/trunk/hadoop-common-project/hadoop-auth/target/test-classes>
[DEBUG]   (f) outputFileName = hadoop-auth-3.0.0-SNAPSHOT
[DEBUG]   (f) session = org.apache.maven.execution.MavenSession@727896
[DEBUG]   (f) showDeprecation = false
[DEBUG]   (f) showWarnings = false
[DEBUG]   (f) source = 1.6
[DEBUG]   (f) staleMillis = 0
[DEBUG]   (f) target = 1.6
[DEBUG]   (f) verbose = false
[DEBUG] -- end configuration --
[DEBUG] Using compiler 'javac'.
[DEBUG] Source directories: [<https://builds.apache.org/job/Hadoop-Common-trunk/ws/trunk/hadoop-common-project/hadoop-auth/src/test/java]>
[DEBUG] Classpath: [<https://builds.apache.org/job/Hadoop-Common-trunk/ws/trunk/hadoop-common-project/hadoop-auth/target/test-classes>
 <https://builds.apache.org/job/Hadoop-Common-trunk/ws/trunk/hadoop-common-project/hadoop-auth/target/classes>
 <https://builds.apache.org/job/Hadoop-Common-trunk/ws/trunk/hadoop-common-project/hadoop-annotations/target/hadoop-annotations-3.0.0-SNAPSHOT.jar>
 /home/jenkins/.m2/repository/junit/junit/4.8.2/junit-4.8.2.jar
 /home/jenkins/.m2/repository/org/mockito/mockito-all/1.8.5/mockito-all-1.8.5.jar
 /home/jenkins/.m2/repository/org/mortbay/jetty/jetty/6.1.26/jetty-6.1.26.jar
 /home/jenkins/.m2/repository/org/mortbay/jetty/jetty-util/6.1.26/jetty-util-6.1.26.jar
 /home/jenkins/.m2/repository/javax/servlet/servlet-api/2.5/servlet-api-2.5.jar
 /home/jenkins/.m2/repository/org/slf4j/slf4j-api/1.6.1/slf4j-api-1.6.1.jar
 /home/jenkins/.m2/repository/commons-codec/commons-codec/1.4/commons-codec-1.4.jar
 /home/jenkins/.m2/repository/log4j/log4j/1.2.17/log4j-1.2.17.jar
 /home/jenkins/.m2/repository/org/slf4j/slf4j-log4j12/1.6.1/slf4j-log4j12-1.6.1.jar
 /home/jenkins/tools/java/jdk1.6.0_26/jre/../lib/tools.jar]
[DEBUG] Output directory: <https://builds.apache.org/job/Hadoop-Common-trunk/ws/trunk/hadoop-common-project/hadoop-auth/target/test-classes>
[DEBUG] CompilerReuseStrategy: reuseCreated
[DEBUG] Classpath:
[DEBUG]  <https://builds.apache.org/job/Hadoop-Common-trunk/ws/trunk/hadoop-common-project/hadoop-auth/target/test-classes>
[DEBUG]  <https://builds.apache.org/job/Hadoop-Common-trunk/ws/trunk/hadoop-common-project/hadoop-auth/target/classes>
[DEBUG]  <https://builds.apache.org/job/Hadoop-Common-trunk/ws/trunk/hadoop-common-project/hadoop-annotations/target/hadoop-annotations-3.0.0-SNAPSHOT.jar>
[DEBUG]  /home/jenkins/.m2/repository/junit/junit/4.8.2/junit-4.8.2.jar
[DEBUG]  /home/jenkins/.m2/repository/org/mockito/mockito-all/1.8.5/mockito-all-1.8.5.jar
[DEBUG]  /home/jenkins/.m2/repository/org/mortbay/jetty/jetty/6.1.26/jetty-6.1.26.jar
[DEBUG]  /home/jenkins/.m2/repository/org/mortbay/jetty/jetty-util/6.1.26/jetty-util-6.1.26.jar
[DEBUG]  /home/jenkins/.m2/repository/javax/servlet/servlet-api/2.5/servlet-api-2.5.jar
[DEBUG]  /home/jenkins/.m2/repository/org/slf4j/slf4j-api/1.6.1/slf4j-api-1.6.1.jar
[DEBUG]  /home/jenkins/.m2/repository/commons-codec/commons-codec/1.4/commons-codec-1.4.jar
[DEBUG]  /home/jenkins/.m2/repository/log4j/log4j/1.2.17/log4j-1.2.17.jar
[DEBUG]  /home/jenkins/.m2/repository/org/slf4j/slf4j-log4j12/1.6.1/slf4j-log4j12-1.6.1.jar
[DEBUG]  /home/jenkins/tools/java/jdk1.6.0_26/jre/../lib/tools.jar
[DEBUG] Source roots:
[DEBUG]  <https://builds.apache.org/job/Hadoop-Common-trunk/ws/trunk/hadoop-common-project/hadoop-auth/src/test/java>
[DEBUG] Command line options:
[DEBUG] -d <https://builds.apache.org/job/Hadoop-Common-trunk/ws/trunk/hadoop-common-project/hadoop-auth/target/test-classes>
-classpath <https://builds.apache.org/job/Hadoop-Common-trunk/ws/trunk/hadoop-common-project/hadoop-auth/target/test-classes>:<https://builds.apache.org/job/Hadoop-Common-trunk/ws/trunk/hadoop-common-project/hadoop-auth/target/classes>:<https://builds.apache.org/job/Hadoop-Common-trunk/ws/trunk/hadoop-common-project/hadoop-annotations/target/hadoop-annotations-3.0.0-SNAPSHOT.jar>:/home/jenkins/.m2/repository/junit/junit/4.8.2/junit-4.8.2.jar:/home/jenkins/.m2/repository/org/mockito/mockito-all/1.8.5/mockito-all-1.8.5.jar:/home/jenkins/.m2/repository/org/mortbay/jetty/jetty/6.1.26/jetty-6.1.26.jar:/home/jenkins/.m2/repository/org/mortbay/jetty/jetty-util/6.1.26/jetty-util-6.1.26.jar:/home/jenkins/.m2/repository/javax/servlet/servlet-api/2.5/servlet-api-2.5.jar:/home/jenkins/.m2/repository/org/slf4j/slf4j-api/1.6.1/slf4j-api-1.6.1.jar:/home/jenkins/.m2/repository/commons-codec/commons-codec/1.4/commons-codec-1.4.jar:/home/jenkins/.m2/repository/log4j/log4j/1.2.17/log4j-1.2.17.jar:/home/jenkins/.m2/repository/org/slf4j/slf4j-log4j12/1.6.1/slf4j-log4j12-1.6.1.jar:/home/jenkins/tools/java/jdk1.6.0_26/jre/../lib/tools.jar:
-sourcepath <https://builds.apache.org/job/Hadoop-Common-trunk/ws/trunk/hadoop-common-project/hadoop-auth/src/test/java>:
<https://builds.apache.org/job/Hadoop-Common-trunk/ws/trunk/hadoop-common-project/hadoop-auth/src/test/java/org/apache/hadoop/security/authentication/client/TestKerberosAuthenticator.java>
<https://builds.apache.org/job/Hadoop-Common-trunk/ws/trunk/hadoop-common-project/hadoop-auth/src/test/java/org/apache/hadoop/security/authentication/server/TestAuthenticationFilter.java>
<https://builds.apache.org/job/Hadoop-Common-trunk/ws/trunk/hadoop-common-project/hadoop-auth/src/test/java/org/apache/hadoop/security/authentication/util/TestSigner.java>
<https://builds.apache.org/job/Hadoop-Common-trunk/ws/trunk/hadoop-common-project/hadoop-auth/src/test/java/org/apache/hadoop/security/authentication/util/TestKerberosName.java>
<https://builds.apache.org/job/Hadoop-Common-trunk/ws/trunk/hadoop-common-project/hadoop-auth/src/test/java/org/apache/hadoop/security/authentication/client/TestPseudoAuthenticator.java>
<https://builds.apache.org/job/Hadoop-Common-trunk/ws/trunk/hadoop-common-project/hadoop-auth/src/test/java/org/apache/hadoop/security/authentication/client/TestAuthenticatedURL.java>
<https://builds.apache.org/job/Hadoop-Common-trunk/ws/trunk/hadoop-common-project/hadoop-auth/src/test/java/org/apache/hadoop/security/authentication/server/TestAuthenticationToken.java>
<https://builds.apache.org/job/Hadoop-Common-trunk/ws/trunk/hadoop-common-project/hadoop-auth/src/test/java/org/apache/hadoop/security/authentication/server/TestKerberosAuthenticationHandler.java>
<https://builds.apache.org/job/Hadoop-Common-trunk/ws/trunk/hadoop-common-project/hadoop-auth/src/test/java/org/apache/hadoop/security/authentication/server/TestPseudoAuthenticationHandler.java>
<https://builds.apache.org/job/Hadoop-Common-trunk/ws/trunk/hadoop-common-project/hadoop-auth/src/test/java/org/apache/hadoop/security/authentication/KerberosTestUtils.java>
<https://builds.apache.org/job/Hadoop-Common-trunk/ws/trunk/hadoop-common-project/hadoop-auth/src/test/java/org/apache/hadoop/security/authentication/client/AuthenticatorTestCase.java>
-s <https://builds.apache.org/job/Hadoop-Common-trunk/ws/trunk/hadoop-common-project/hadoop-auth/target/generated-test-sources/test-annotations>
-g -nowarn -target 1.6 -source 1.6 -encoding UTF-8
[INFO] Compiling 11 source files to <https://builds.apache.org/job/Hadoop-Common-trunk/ws/trunk/hadoop-common-project/hadoop-auth/target/test-classes>
[INFO] 
[INFO] --- maven-surefire-plugin:2.12:test (default-test) @ hadoop-auth ---
[DEBUG] Configuring mojo org.apache.maven.plugins:maven-surefire-plugin:2.12:test from plugin
realm ClassRealm[plugin>org.apache.maven.plugins:maven-surefire-plugin:2.12, parent: sun.misc.Launcher$AppClassLoader@126b249]
[DEBUG] Configuring mojo 'org.apache.maven.plugins:maven-surefire-plugin:2.12:test' with basic
configurator -->
[DEBUG]   (s) argLine = -Xmx1024m
[DEBUG]   (s) basedir = <https://builds.apache.org/job/Hadoop-Common-trunk/ws/trunk/hadoop-common-project/hadoop-auth>
[DEBUG]   (s) childDelegation = false
[DEBUG]   (s) classesDirectory = <https://builds.apache.org/job/Hadoop-Common-trunk/ws/trunk/hadoop-common-project/hadoop-auth/target/classes>
[DEBUG]   (s) disableXmlReport = false
[DEBUG]   (s) enableAssertions = true
[DEBUG]   (s) environmentVariables = {LD_LIBRARY_PATH=/home/jenkins/tools/java/jdk1.6.0_26/jre/lib/i386/server:/home/jenkins/tools/java/jdk1.6.0_26/jre/lib/i386:/home/jenkins/tools/java/jdk1.6.0_26/jre/../lib/i386:<https://builds.apache.org/job/Hadoop-Common-trunk/ws/trunk/hadoop-common-project/hadoop-auth/target/native/target/usr/local/lib,>
MALLOC_ARENA_MAX=4}
[DEBUG]   (s) excludes = [**/_.java, _, **/TestKerberosAuth*.java, **/Test*$*.java]
[DEBUG]   (s) failIfNoTests = false
[DEBUG]   (s) forkMode = always
[DEBUG]   (s) forkedProcessTimeoutInSeconds = 600
[DEBUG]   (s) includes = [**/Test*.java]
[DEBUG]   (s) junitArtifactName = junit:junit
[DEBUG]   (s) localRepository =        id: local
      url: file:///home/jenkins/.m2/repository/
   layout: none

[DEBUG]   (f) parallelMavenExecution = false
[DEBUG]   (s) perCoreThreadCount = true
[DEBUG]   (s) pluginArtifactMap = {org.apache.maven.plugins:maven-surefire-plugin=org.apache.maven.plugins:maven-surefire-plugin:maven-plugin:2.12:,
org.apache.maven.surefire:surefire-booter=org.apache.maven.surefire:surefire-booter:jar:2.12:compile,
org.apache.maven.surefire:surefire-api=org.apache.maven.surefire:surefire-api:jar:2.12:compile,
org.apache.maven.surefire:maven-surefire-common=org.apache.maven.surefire:maven-surefire-common:jar:2.12:compile,
org.apache.maven.shared:maven-common-artifact-filters=org.apache.maven.shared:maven-common-artifact-filters:jar:1.3:compile,
org.codehaus.plexus:plexus-utils=org.codehaus.plexus:plexus-utils:jar:3.0:compile, org.apache.maven.reporting:maven-reporting-api=org.apache.maven.reporting:maven-reporting-api:jar:2.0.9:compile}
[DEBUG]   (f) pluginDescriptor = Component Descriptor: role: 'org.apache.maven.plugin.Mojo',
implementation: 'org.apache.maven.plugin.surefire.HelpMojo', role hint: 'org.apache.maven.plugins:maven-surefire-plugin:2.12:help'
role: 'org.apache.maven.plugin.Mojo', implementation: 'org.apache.maven.plugin.surefire.SurefirePlugin',
role hint: 'org.apache.maven.plugins:maven-surefire-plugin:2.12:test'
---
[DEBUG]   (s) printSummary = true
[DEBUG]   (s) project = MavenProject: org.apache.hadoop:hadoop-auth:3.0.0-SNAPSHOT @ <https://builds.apache.org/job/Hadoop-Common-trunk/ws/trunk/hadoop-common-project/hadoop-auth/pom.xml>
[DEBUG]   (s) projectArtifactMap = {org.apache.hadoop:hadoop-annotations=org.apache.hadoop:hadoop-annotations:jar:3.0.0-SNAPSHOT:provided,
junit:junit=junit:junit:jar:4.8.2:test, org.mockito:mockito-all=org.mockito:mockito-all:jar:1.8.5:test,
org.mortbay.jetty:jetty=org.mortbay.jetty:jetty:jar:6.1.26:test, org.mortbay.jetty:jetty-util=org.mortbay.jetty:jetty-util:jar:6.1.26:test,
javax.servlet:servlet-api=javax.servlet:servlet-api:jar:2.5:provided, org.slf4j:slf4j-api=org.slf4j:slf4j-api:jar:1.6.1:compile,
commons-codec:commons-codec=commons-codec:commons-codec:jar:1.4:compile, log4j:log4j=log4j:log4j:jar:1.2.17:runtime,
org.slf4j:slf4j-log4j12=org.slf4j:slf4j-log4j12:jar:1.6.1:runtime, jdk.tools:jdk.tools=jdk.tools:jdk.tools:jar:1.6:system}
[DEBUG]   (s) redirectTestOutputToFile = true
[DEBUG]   (s) remoteRepositories = [       id: central
      url: http://repo1.maven.org/maven2
   layout: default
snapshots: [enabled => false, update => daily]
 releases: [enabled => true, update => never]
]
[DEBUG]   (s) reportFormat = brief
[DEBUG]   (s) reportsDirectory = <https://builds.apache.org/job/Hadoop-Common-trunk/ws/trunk/hadoop-common-project/hadoop-auth/target/surefire-reports>
[DEBUG]   (s) runOrder = filesystem
[DEBUG]   (s) session = org.apache.maven.execution.MavenSession@727896
[DEBUG]   (s) skip = false
[DEBUG]   (s) skipTests = false
[DEBUG]   (s) systemPropertyVariables = {hadoop.log.dir=null, hadoop.tmp.dir=null, java.net.preferIPv4Stack=true,
java.security.egd=file:///dev/urandom, java.security.krb5.conf=<https://builds.apache.org/job/Hadoop-Common-trunk/ws/trunk/hadoop-common-project/hadoop-auth/target/test-classes/krb5.conf,>
kerberos.realm=LOCALHOST, test.build.classes=null, test.build.data=<https://builds.apache.org/job/Hadoop-Common-trunk/ws/trunk/hadoop-common-project/hadoop-auth/target/test-dir,>
test.build.dir=<https://builds.apache.org/job/Hadoop-Common-trunk/ws/trunk/hadoop-common-project/hadoop-auth/target/test-dir,>
test.build.webapps=null, test.cache.data=null}
[DEBUG]   (s) testClassesDirectory = <https://builds.apache.org/job/Hadoop-Common-trunk/ws/trunk/hadoop-common-project/hadoop-auth/target/test-classes>
[DEBUG]   (s) testFailureIgnore = true
[DEBUG]   (s) testNGArtifactName = org.testng:testng
[DEBUG]   (s) testSourceDirectory = <https://builds.apache.org/job/Hadoop-Common-trunk/ws/trunk/hadoop-common-project/hadoop-auth/src/test/java>
[DEBUG]   (s) trimStackTrace = true
[DEBUG]   (s) useFile = true
[DEBUG]   (s) useManifestOnlyJar = true
[DEBUG]   (s) useSystemClassLoader = true
[DEBUG]   (s) useUnlimitedThreads = false
[DEBUG]   (s) workingDirectory = <https://builds.apache.org/job/Hadoop-Common-trunk/ws/trunk/hadoop-common-project/hadoop-auth>
[DEBUG] -- end configuration --
[INFO] Surefire report directory: <https://builds.apache.org/job/Hadoop-Common-trunk/ws/trunk/hadoop-common-project/hadoop-auth/target/surefire-reports>
[DEBUG] dummy:dummy:jar:1.0 (selected for null)
[DEBUG]   org.apache.maven.surefire:surefire-booter:jar:2.12:compile (selected for compile)
[DEBUG]     org.apache.maven.surefire:surefire-api:jar:2.12:compile (selected for compile)
[DEBUG] Adding to surefire booter test classpath: /home/jenkins/.m2/repository/org/apache/maven/surefire/surefire-booter/2.12/surefire-booter-2.12.jar
Scope: compile
[DEBUG] Adding to surefire booter test classpath: /home/jenkins/.m2/repository/org/apache/maven/surefire/surefire-api/2.12/surefire-api-2.12.jar
Scope: compile
[DEBUG] Setting system property [java.net.preferIPv4Stack]=[true]
[DEBUG] Setting system property [java.security.krb5.conf]=[<https://builds.apache.org/job/Hadoop-Common-trunk/ws/trunk/hadoop-common-project/hadoop-auth/target/test-classes/krb5.conf]>
[DEBUG] Setting system property [user.dir]=[<https://builds.apache.org/job/Hadoop-Common-trunk/ws/trunk/hadoop-common-project/hadoop-auth]>
[DEBUG] Setting system property [test.build.data]=[<https://builds.apache.org/job/Hadoop-Common-trunk/ws/trunk/hadoop-common-project/hadoop-auth/target/test-dir]>
[DEBUG] Setting system property [localRepository]=[/home/jenkins/.m2/repository]
[DEBUG] Setting system property [test.build.dir]=[<https://builds.apache.org/job/Hadoop-Common-trunk/ws/trunk/hadoop-common-project/hadoop-auth/target/test-dir]>
[DEBUG] Setting system property [basedir]=[<https://builds.apache.org/job/Hadoop-Common-trunk/ws/trunk/hadoop-common-project/hadoop-auth]>
[DEBUG] Setting system property [java.security.egd]=[file:///dev/urandom]
[DEBUG] Setting system property [kerberos.realm]=[LOCALHOST]
[DEBUG] Setting system property [maven.test.failure.ignore]=[true]
[DEBUG] Using JVM: /home/jenkins/tools/java/jdk1.6.0_26/jre/bin/java
[DEBUG] Setting environment variable [LD_LIBRARY_PATH]=[/home/jenkins/tools/java/jdk1.6.0_26/jre/lib/i386/server:/home/jenkins/tools/java/jdk1.6.0_26/jre/lib/i386:/home/jenkins/tools/java/jdk1.6.0_26/jre/../lib/i386:<https://builds.apache.org/job/Hadoop-Common-trunk/ws/trunk/hadoop-common-project/hadoop-auth/target/native/target/usr/local/lib]>
[DEBUG] Setting environment variable [MALLOC_ARENA_MAX]=[4]
[DEBUG] dummy:dummy:jar:1.0 (selected for null)
[DEBUG]   org.apache.maven.surefire:surefire-junit4:jar:2.12:test (selected for test)
[DEBUG]     org.apache.maven.surefire:surefire-api:jar:2.12:test (selected for test)
[DEBUG] Adding to surefire test classpath: /home/jenkins/.m2/repository/org/apache/maven/surefire/surefire-junit4/2.12/surefire-junit4-2.12.jar
Scope: test
[DEBUG] Adding to surefire test classpath: /home/jenkins/.m2/repository/org/apache/maven/surefire/surefire-api/2.12/surefire-api-2.12.jar
Scope: test
[DEBUG] test classpath classpath:
[DEBUG]   <https://builds.apache.org/job/Hadoop-Common-trunk/ws/trunk/hadoop-common-project/hadoop-auth/target/test-classes>
[DEBUG]   <https://builds.apache.org/job/Hadoop-Common-trunk/ws/trunk/hadoop-common-project/hadoop-auth/target/classes>
[DEBUG]   <https://builds.apache.org/job/Hadoop-Common-trunk/ws/trunk/hadoop-common-project/hadoop-annotations/target/hadoop-annotations-3.0.0-SNAPSHOT.jar>
[DEBUG]   /home/jenkins/.m2/repository/junit/junit/4.8.2/junit-4.8.2.jar
[DEBUG]   /home/jenkins/.m2/repository/org/mockito/mockito-all/1.8.5/mockito-all-1.8.5.jar
[DEBUG]   /home/jenkins/.m2/repository/org/mortbay/jetty/jetty/6.1.26/jetty-6.1.26.jar
[DEBUG]   /home/jenkins/.m2/repository/org/mortbay/jetty/jetty-util/6.1.26/jetty-util-6.1.26.jar
[DEBUG]   /home/jenkins/.m2/repository/javax/servlet/servlet-api/2.5/servlet-api-2.5.jar
[DEBUG]   /home/jenkins/.m2/repository/org/slf4j/slf4j-api/1.6.1/slf4j-api-1.6.1.jar
[DEBUG]   /home/jenkins/.m2/repository/commons-codec/commons-codec/1.4/commons-codec-1.4.jar
[DEBUG]   /home/jenkins/.m2/repository/log4j/log4j/1.2.17/log4j-1.2.17.jar
[DEBUG]   /home/jenkins/.m2/repository/org/slf4j/slf4j-log4j12/1.6.1/slf4j-log4j12-1.6.1.jar
[DEBUG]   /home/jenkins/tools/java/jdk1.6.0_26/jre/../lib/tools.jar
[DEBUG] provider classpath classpath:
[DEBUG]   /home/jenkins/.m2/repository/org/apache/maven/surefire/surefire-junit4/2.12/surefire-junit4-2.12.jar
[DEBUG]   /home/jenkins/.m2/repository/org/apache/maven/surefire/surefire-api/2.12/surefire-api-2.12.jar

-------------------------------------------------------
 T E S T S
-------------------------------------------------------

-------------------------------------------------------
 T E S T S
-------------------------------------------------------
Forking command line: /bin/sh -c cd <https://builds.apache.org/job/Hadoop-Common-trunk/ws/trunk/hadoop-common-project/hadoop-auth>
&& /home/jenkins/tools/java/jdk1.6.0_26/jre/bin/java -Xmx1024m -jar <https://builds.apache.org/job/Hadoop-Common-trunk/ws/trunk/hadoop-common-project/hadoop-auth/target/surefire/surefirebooter4761566217741471879.jar>
<https://builds.apache.org/job/Hadoop-Common-trunk/ws/trunk/hadoop-common-project/hadoop-auth/target/surefire/surefire8256085798614672009tmp>
<https://builds.apache.org/job/Hadoop-Common-trunk/ws/trunk/hadoop-common-project/hadoop-auth/target/surefire/surefire_0898713587956372602tmp>
Running org.apache.hadoop.security.authentication.server.TestAuthenticationFilter
Tests run: 16, Failures: 0, Errors: 0, Skipped: 0, Time elapsed: 0.374 sec
Forking command line: /bin/sh -c cd <https://builds.apache.org/job/Hadoop-Common-trunk/ws/trunk/hadoop-common-project/hadoop-auth>
&& /home/jenkins/tools/java/jdk1.6.0_26/jre/bin/java -Xmx1024m -jar <https://builds.apache.org/job/Hadoop-Common-trunk/ws/trunk/hadoop-common-project/hadoop-auth/target/surefire/surefirebooter5194596170150104043.jar>
<https://builds.apache.org/job/Hadoop-Common-trunk/ws/trunk/hadoop-common-project/hadoop-auth/target/surefire/surefire4546868956511486222tmp>
<https://builds.apache.org/job/Hadoop-Common-trunk/ws/trunk/hadoop-common-project/hadoop-auth/target/surefire/surefire_14538412143683407593tmp>
Running org.apache.hadoop.security.authentication.server.TestAuthenticationToken
Tests run: 5, Failures: 0, Errors: 0, Skipped: 0, Time elapsed: 0.13 sec
Forking command line: /bin/sh -c cd <https://builds.apache.org/job/Hadoop-Common-trunk/ws/trunk/hadoop-common-project/hadoop-auth>
&& /home/jenkins/tools/java/jdk1.6.0_26/jre/bin/java -Xmx1024m -jar <https://builds.apache.org/job/Hadoop-Common-trunk/ws/trunk/hadoop-common-project/hadoop-auth/target/surefire/surefirebooter6265127270619005787.jar>
<https://builds.apache.org/job/Hadoop-Common-trunk/ws/trunk/hadoop-common-project/hadoop-auth/target/surefire/surefire7188860316489317048tmp>
<https://builds.apache.org/job/Hadoop-Common-trunk/ws/trunk/hadoop-common-project/hadoop-auth/target/surefire/surefire_23064867005117255112tmp>
Running org.apache.hadoop.security.authentication.server.TestPseudoAuthenticationHandler
Tests run: 6, Failures: 0, Errors: 0, Skipped: 0, Time elapsed: 0.216 sec
Forking command line: /bin/sh -c cd <https://builds.apache.org/job/Hadoop-Common-trunk/ws/trunk/hadoop-common-project/hadoop-auth>
&& /home/jenkins/tools/java/jdk1.6.0_26/jre/bin/java -Xmx1024m -jar <https://builds.apache.org/job/Hadoop-Common-trunk/ws/trunk/hadoop-common-project/hadoop-auth/target/surefire/surefirebooter3806762044609681451.jar>
<https://builds.apache.org/job/Hadoop-Common-trunk/ws/trunk/hadoop-common-project/hadoop-auth/target/surefire/surefire4535050068993056276tmp>
<https://builds.apache.org/job/Hadoop-Common-trunk/ws/trunk/hadoop-common-project/hadoop-auth/target/surefire/surefire_35891172951567834354tmp>
Running org.apache.hadoop.security.authentication.client.TestPseudoAuthenticator
Forking command line: /bin/sh -c cd <https://builds.apache.org/job/Hadoop-Common-trunk/ws/trunk/hadoop-common-project/hadoop-auth>
&& /home/jenkins/tools/java/jdk1.6.0_26/jre/bin/java -Xmx1024m -jar <https://builds.apache.org/job/Hadoop-Common-trunk/ws/trunk/hadoop-common-project/hadoop-auth/target/surefire/surefirebooter7764607928286652556.jar>
<https://builds.apache.org/job/Hadoop-Common-trunk/ws/trunk/hadoop-common-project/hadoop-auth/target/surefire/surefire6751005669570020252tmp>
<https://builds.apache.org/job/Hadoop-Common-trunk/ws/trunk/hadoop-common-project/hadoop-auth/target/surefire/surefire_45171529505278284251tmp>
Running org.apache.hadoop.security.authentication.client.TestAuthenticatedURL
Tests run: 5, Failures: 0, Errors: 0, Skipped: 0, Time elapsed: 0.226 sec
Forking command line: /bin/sh -c cd <https://builds.apache.org/job/Hadoop-Common-trunk/ws/trunk/hadoop-common-project/hadoop-auth>
&& /home/jenkins/tools/java/jdk1.6.0_26/jre/bin/java -Xmx1024m -jar <https://builds.apache.org/job/Hadoop-Common-trunk/ws/trunk/hadoop-common-project/hadoop-auth/target/surefire/surefirebooter3307918016250191441.jar>
<https://builds.apache.org/job/Hadoop-Common-trunk/ws/trunk/hadoop-common-project/hadoop-auth/target/surefire/surefire3680613306905953567tmp>
<https://builds.apache.org/job/Hadoop-Common-trunk/ws/trunk/hadoop-common-project/hadoop-auth/target/surefire/surefire_56418466275037370429tmp>
Running org.apache.hadoop.security.authentication.util.TestKerberosName
Tests run: 2, Failures: 0, Errors: 0, Skipped: 0, Time elapsed: 0.087 sec
Forking command line: /bin/sh -c cd <https://builds.apache.org/job/Hadoop-Common-trunk/ws/trunk/hadoop-common-project/hadoop-auth>
&& /home/jenkins/tools/java/jdk1.6.0_26/jre/bin/java -Xmx1024m -jar <https://builds.apache.org/job/Hadoop-Common-trunk/ws/trunk/hadoop-common-project/hadoop-auth/target/surefire/surefirebooter4984807312909355361.jar>
<https://builds.apache.org/job/Hadoop-Common-trunk/ws/trunk/hadoop-common-project/hadoop-auth/target/surefire/surefire3330789104216137772tmp>
<https://builds.apache.org/job/Hadoop-Common-trunk/ws/trunk/hadoop-common-project/hadoop-auth/target/surefire/surefire_65107878587966741179tmp>
Running org.apache.hadoop.security.authentication.util.TestSigner
Tests run: 6, Failures: 0, Errors: 0, Skipped: 0, Time elapsed: 0.041 sec

Results :

Tests run: 40, Failures: 0, Errors: 0, Skipped: 0

[INFO] ------------------------------------------------------------------------
[INFO] Reactor Summary:
[INFO] 
[INFO] Apache Hadoop Annotations ......................... SUCCESS [6.085s]
[INFO] Apache Hadoop Auth ................................ FAILURE [10:04.033s]
[INFO] Apache Hadoop Auth Examples ....................... SKIPPED
[INFO] Apache Hadoop Common .............................. SKIPPED
[INFO] Apache Hadoop Common Project ...................... SKIPPED
[INFO] ------------------------------------------------------------------------
[INFO] BUILD FAILURE
[INFO] ------------------------------------------------------------------------
[INFO] Total time: 10:11.212s
[INFO] Finished at: Sun Sep 16 09:13:49 UTC 2012
[INFO] Final Memory: 31M/244M
[INFO] ------------------------------------------------------------------------
[ERROR] Failed to execute goal org.apache.maven.plugins:maven-surefire-plugin:2.12:test (default-test)
on project hadoop-auth: Failure or timeout -> [Help 1]
org.apache.maven.lifecycle.LifecycleExecutionException: Failed to execute goal org.apache.maven.plugins:maven-surefire-plugin:2.12:test
(default-test) on project hadoop-auth: Failure or timeout
	at org.apache.maven.lifecycle.internal.MojoExecutor.execute(MojoExecutor.java:217)
	at org.apache.maven.lifecycle.internal.MojoExecutor.execute(MojoExecutor.java:153)
	at org.apache.maven.lifecycle.internal.MojoExecutor.execute(MojoExecutor.java:145)
	at org.apache.maven.lifecycle.internal.LifecycleModuleBuilder.buildProject(LifecycleModuleBuilder.java:84)
	at org.apache.maven.lifecycle.internal.LifecycleModuleBuilder.buildProject(LifecycleModuleBuilder.java:59)
	at org.apache.maven.lifecycle.internal.LifecycleStarter.singleThreadedBuild(LifecycleStarter.java:183)
	at org.apache.maven.lifecycle.internal.LifecycleStarter.execute(LifecycleStarter.java:161)
	at org.apache.maven.DefaultMaven.doExecute(DefaultMaven.java:319)
	at org.apache.maven.DefaultMaven.execute(DefaultMaven.java:156)
	at org.apache.maven.cli.MavenCli.execute(MavenCli.java:537)
	at org.apache.maven.cli.MavenCli.doMain(MavenCli.java:196)
	at org.apache.maven.cli.MavenCli.main(MavenCli.java:141)
	at sun.reflect.NativeMethodAccessorImpl.invoke0(Native Method)
	at sun.reflect.NativeMethodAccessorImpl.invoke(NativeMethodAccessorImpl.java:39)
	at sun.reflect.DelegatingMethodAccessorImpl.invoke(DelegatingMethodAccessorImpl.java:25)
	at java.lang.reflect.Method.invoke(Method.java:597)
	at org.codehaus.plexus.classworlds.launcher.Launcher.launchEnhanced(Launcher.java:290)
	at org.codehaus.plexus.classworlds.launcher.Launcher.launch(Launcher.java:230)
	at org.codehaus.plexus.classworlds.launcher.Launcher.mainWithExitCode(Launcher.java:409)
	at org.codehaus.plexus.classworlds.launcher.Launcher.main(Launcher.java:352)
Caused by: org.apache.maven.plugin.MojoExecutionException: Failure or timeout
	at org.apache.maven.plugin.surefire.SurefirePlugin.assertNoFailureOrTimeout(SurefirePlugin.java:665)
	at org.apache.maven.plugin.surefire.SurefirePlugin.handleSummary(SurefirePlugin.java:646)
	at org.apache.maven.plugin.surefire.AbstractSurefireMojo.executeAfterPreconditionsChecked(AbstractSurefireMojo.java:137)
	at org.apache.maven.plugin.surefire.AbstractSurefireMojo.execute(AbstractSurefireMojo.java:98)
	at org.apache.maven.plugin.DefaultBuildPluginManager.executeMojo(DefaultBuildPluginManager.java:101)
	at org.apache.maven.lifecycle.internal.MojoExecutor.execute(MojoExecutor.java:209)
	... 19 more
[ERROR] 
[ERROR] 
[ERROR] For more information about the errors and possible solutions, please read the following
articles:
[ERROR] [Help 1] http://cwiki.apache.org/confluence/display/MAVEN/MojoExecutionException
[ERROR] 
[ERROR] After correcting the problems, you can resume the build with the command
[ERROR]   mvn <goals> -rf :hadoop-auth
Build step 'Execute shell' marked build as failure
Archiving artifacts

Mime
View raw message