hadoop-common-dev mailing list archives

Site index · List index
Message view « Date » · « Thread »
Top « Date » · « Thread »
From Apache Jenkins Server <jenk...@builds.apache.org>
Subject Build failed in Jenkins: Hadoop-Common-trunk #481
Date Tue, 24 Jul 2012 09:27:53 GMT
See <https://builds.apache.org/job/Hadoop-Common-trunk/481/changes>

Changes:

[eli] HDFS-3709. TestStartup tests still binding to the ephemeral port. Contributed by Eli
Collins

[bobby] MAPREDUCE-3893. allow capacity scheduler configs max-apps and max-am-pct per queue
(tgraves via bobby)

[todd] HDFS-3697. Enable fadvise readahead by default. Contributed by Todd Lipcon.

------------------------------------------
[...truncated 18195 lines...]
[DEBUG]   (s) reportsDirectory = <https://builds.apache.org/job/Hadoop-Common-trunk/ws/trunk/hadoop-common-project/hadoop-auth-examples/target/surefire-reports>
[DEBUG]   (s) runOrder = filesystem
[DEBUG]   (s) session = org.apache.maven.execution.MavenSession@98f352
[DEBUG]   (s) skip = false
[DEBUG]   (s) skipTests = false
[DEBUG]   (s) systemPropertyVariables = {hadoop.log.dir=null, hadoop.tmp.dir=null, java.net.preferIPv4Stack=true,
java.security.egd=file:///dev/urandom, java.security.krb5.conf=<https://builds.apache.org/job/Hadoop-Common-trunk/ws/trunk/hadoop-common-project/hadoop-auth-examples/src/test/resources/krb5.conf,>
test.build.classes=null, test.build.data=<https://builds.apache.org/job/Hadoop-Common-trunk/ws/trunk/hadoop-common-project/hadoop-auth-examples/target/test-dir,>
test.build.dir=<https://builds.apache.org/job/Hadoop-Common-trunk/ws/trunk/hadoop-common-project/hadoop-auth-examples/target/test-dir,>
test.build.webapps=null, test.cache.data=null}
[DEBUG]   (s) testClassesDirectory = <https://builds.apache.org/job/Hadoop-Common-trunk/ws/trunk/hadoop-common-project/hadoop-auth-examples/target/test-classes>
[DEBUG]   (s) testFailureIgnore = false
[DEBUG]   (s) testNGArtifactName = org.testng:testng
[DEBUG]   (s) testSourceDirectory = <https://builds.apache.org/job/Hadoop-Common-trunk/ws/trunk/hadoop-common-project/hadoop-auth-examples/src/test/java>
[DEBUG]   (s) trimStackTrace = true
[DEBUG]   (s) useFile = true
[DEBUG]   (s) useManifestOnlyJar = true
[DEBUG]   (s) useSystemClassLoader = true
[DEBUG]   (s) useUnlimitedThreads = false
[DEBUG]   (s) workingDirectory = <https://builds.apache.org/job/Hadoop-Common-trunk/ws/trunk/hadoop-common-project/hadoop-auth-examples>
[DEBUG] -- end configuration --
[INFO] No tests to run.
[INFO] Surefire report directory: <https://builds.apache.org/job/Hadoop-Common-trunk/ws/trunk/hadoop-common-project/hadoop-auth-examples/target/surefire-reports>
[DEBUG] dummy:dummy:jar:1.0 (selected for null)
[DEBUG]   org.apache.maven.surefire:surefire-booter:jar:2.12:compile (selected for compile)
[DEBUG]     org.apache.maven.surefire:surefire-api:jar:2.12:compile (selected for compile)
[DEBUG] Adding to surefire booter test classpath: /home/jenkins/.m2/repository/org/apache/maven/surefire/surefire-booter/2.12/surefire-booter-2.12.jar
Scope: compile
[DEBUG] Adding to surefire booter test classpath: /home/jenkins/.m2/repository/org/apache/maven/surefire/surefire-api/2.12/surefire-api-2.12.jar
Scope: compile
[DEBUG] Setting system property [java.net.preferIPv4Stack]=[true]
[DEBUG] Setting system property [java.security.krb5.conf]=[<https://builds.apache.org/job/Hadoop-Common-trunk/ws/trunk/hadoop-common-project/hadoop-auth-examples/src/test/resources/krb5.conf]>
[DEBUG] Setting system property [tar]=[true]
[DEBUG] Setting system property [test.build.data]=[<https://builds.apache.org/job/Hadoop-Common-trunk/ws/trunk/hadoop-common-project/hadoop-auth-examples/target/test-dir]>
[DEBUG] Setting system property [user.dir]=[<https://builds.apache.org/job/Hadoop-Common-trunk/ws/trunk/hadoop-common-project/hadoop-auth-examples]>
[DEBUG] Setting system property [localRepository]=[/home/jenkins/.m2/repository]
[DEBUG] Setting system property [test.build.dir]=[<https://builds.apache.org/job/Hadoop-Common-trunk/ws/trunk/hadoop-common-project/hadoop-auth-examples/target/test-dir]>
[DEBUG] Setting system property [basedir]=[<https://builds.apache.org/job/Hadoop-Common-trunk/ws/trunk/hadoop-common-project/hadoop-auth-examples]>
[DEBUG] Setting system property [java.security.egd]=[file:///dev/urandom]
[DEBUG] Using JVM: /home/jenkins/tools/java/jdk1.6.0_27/jre/bin/java
[DEBUG] Setting environment variable [LD_LIBRARY_PATH]=[/home/jenkins/tools/java/jdk1.6.0_27/jre/lib/i386/server:/home/jenkins/tools/java/jdk1.6.0_27/jre/lib/i386:/home/jenkins/tools/java/jdk1.6.0_27/jre/../lib/i386:<https://builds.apache.org/job/Hadoop-Common-trunk/ws/trunk/hadoop-common-project/hadoop-auth-examples/target/native/target/usr/local/lib]>
[DEBUG] Setting environment variable [MALLOC_ARENA_MAX]=[4]
[DEBUG] dummy:dummy:jar:1.0 (selected for null)
[DEBUG]   org.apache.maven.surefire:surefire-junit3:jar:2.12:test (selected for test)
[DEBUG]     org.apache.maven.surefire:surefire-api:jar:2.12:test (selected for test)
[DEBUG] Adding to surefire test classpath: /home/jenkins/.m2/repository/org/apache/maven/surefire/surefire-junit3/2.12/surefire-junit3-2.12.jar
Scope: test
[DEBUG] Adding to surefire test classpath: /home/jenkins/.m2/repository/org/apache/maven/surefire/surefire-api/2.12/surefire-api-2.12.jar
Scope: test
[DEBUG] test classpath classpath:
[DEBUG]   <https://builds.apache.org/job/Hadoop-Common-trunk/ws/trunk/hadoop-common-project/hadoop-auth-examples/target/test-classes>
[DEBUG]   <https://builds.apache.org/job/Hadoop-Common-trunk/ws/trunk/hadoop-common-project/hadoop-auth-examples/target/classes>
[DEBUG]   /home/jenkins/.m2/repository/javax/servlet/servlet-api/2.5/servlet-api-2.5.jar
[DEBUG]   <https://builds.apache.org/job/Hadoop-Common-trunk/ws/trunk/hadoop-common-project/hadoop-auth/target/classes>
[DEBUG]   /home/jenkins/.m2/repository/org/slf4j/slf4j-api/1.6.1/slf4j-api-1.6.1.jar
[DEBUG]   /home/jenkins/.m2/repository/commons-codec/commons-codec/1.4/commons-codec-1.4.jar
[DEBUG]   /home/jenkins/.m2/repository/log4j/log4j/1.2.15/log4j-1.2.15.jar
[DEBUG]   /home/jenkins/.m2/repository/org/slf4j/slf4j-log4j12/1.6.1/slf4j-log4j12-1.6.1.jar
[DEBUG]   /home/jenkins/tools/java/jdk1.6.0_27/jre/../lib/tools.jar
[DEBUG] provider classpath classpath:
[DEBUG]   /home/jenkins/.m2/repository/org/apache/maven/surefire/surefire-junit3/2.12/surefire-junit3-2.12.jar
[DEBUG]   /home/jenkins/.m2/repository/org/apache/maven/surefire/surefire-api/2.12/surefire-api-2.12.jar

-------------------------------------------------------
 T E S T S
-------------------------------------------------------

-------------------------------------------------------
 T E S T S
-------------------------------------------------------

Results :

Tests run: 0, Failures: 0, Errors: 0, Skipped: 0

[INFO] 
[INFO] --- maven-war-plugin:2.1:war (default-war) @ hadoop-auth-examples ---
[DEBUG] org.apache.maven.plugins:maven-war-plugin:jar:2.1:
[DEBUG]    org.apache.maven:maven-plugin-api:jar:2.0.6:compile
[DEBUG]    org.apache.maven:maven-artifact:jar:2.0.6:compile
[DEBUG]    org.apache.maven:maven-model:jar:2.0.6:compile
[DEBUG]    org.apache.maven:maven-project:jar:2.0.6:compile
[DEBUG]       org.apache.maven:maven-profile:jar:2.0.6:compile
[DEBUG]       org.apache.maven:maven-artifact-manager:jar:2.0.6:compile
[DEBUG]       org.apache.maven:maven-plugin-registry:jar:2.0.6:compile
[DEBUG]    org.apache.maven:maven-core:jar:2.0.6:compile
[DEBUG]       org.apache.maven:maven-plugin-parameter-documenter:jar:2.0.6:compile
[DEBUG]       org.apache.maven.reporting:maven-reporting-api:jar:2.0.6:compile
[DEBUG]          org.apache.maven.doxia:doxia-sink-api:jar:1.0-alpha-7:compile
[DEBUG]       org.apache.maven:maven-repository-metadata:jar:2.0.6:compile
[DEBUG]       org.apache.maven:maven-error-diagnostics:jar:2.0.6:compile
[DEBUG]       commons-cli:commons-cli:jar:1.0:compile
[DEBUG]       org.apache.maven:maven-plugin-descriptor:jar:2.0.6:compile
[DEBUG]       org.codehaus.plexus:plexus-interactivity-api:jar:1.0-alpha-4:compile
[DEBUG]       classworlds:classworlds:jar:1.1:compile
[DEBUG]    org.apache.maven:maven-settings:jar:2.0.6:compile
[DEBUG]    org.apache.maven:maven-monitor:jar:2.0.6:compile
[DEBUG]    org.apache.maven:maven-archiver:jar:2.4.1:compile
[DEBUG]    org.codehaus.plexus:plexus-archiver:jar:1.0:compile
[DEBUG]       org.codehaus.plexus:plexus-io:jar:1.0:compile
[DEBUG]    org.codehaus.plexus:plexus-interpolation:jar:1.13:compile
[DEBUG]    org.codehaus.plexus:plexus-container-default:jar:1.0-alpha-9-stable-1:compile
[DEBUG]       junit:junit:jar:3.8.1:compile
[DEBUG]    com.thoughtworks.xstream:xstream:jar:1.3.1:compile
[DEBUG]       xpp3:xpp3_min:jar:1.1.4c:compile
[DEBUG]    org.codehaus.plexus:plexus-utils:jar:2.0.5:compile
[DEBUG]    org.apache.maven.shared:maven-filtering:jar:1.0-beta-2:compile
[DEBUG] Created new class realm plugin>org.apache.maven.plugins:maven-war-plugin:2.1
[DEBUG] Importing foreign packages into class realm plugin>org.apache.maven.plugins:maven-war-plugin:2.1
[DEBUG]   Imported:  < maven.api
[DEBUG] Populating class realm plugin>org.apache.maven.plugins:maven-war-plugin:2.1
[DEBUG]   Included: org.apache.maven.plugins:maven-war-plugin:jar:2.1
[DEBUG]   Included: org.apache.maven.reporting:maven-reporting-api:jar:2.0.6
[DEBUG]   Included: org.apache.maven.doxia:doxia-sink-api:jar:1.0-alpha-7
[DEBUG]   Included: commons-cli:commons-cli:jar:1.0
[DEBUG]   Included: org.codehaus.plexus:plexus-interactivity-api:jar:1.0-alpha-4
[DEBUG]   Included: org.apache.maven:maven-archiver:jar:2.4.1
[DEBUG]   Included: org.codehaus.plexus:plexus-archiver:jar:1.0
[DEBUG]   Included: org.codehaus.plexus:plexus-io:jar:1.0
[DEBUG]   Included: org.codehaus.plexus:plexus-interpolation:jar:1.13
[DEBUG]   Included: junit:junit:jar:3.8.1
[DEBUG]   Included: com.thoughtworks.xstream:xstream:jar:1.3.1
[DEBUG]   Included: xpp3:xpp3_min:jar:1.1.4c
[DEBUG]   Included: org.codehaus.plexus:plexus-utils:jar:2.0.5
[DEBUG]   Included: org.apache.maven.shared:maven-filtering:jar:1.0-beta-2
[DEBUG]   Excluded: org.apache.maven:maven-plugin-api:jar:2.0.6
[DEBUG]   Excluded: org.apache.maven:maven-artifact:jar:2.0.6
[DEBUG]   Excluded: org.apache.maven:maven-model:jar:2.0.6
[DEBUG]   Excluded: org.apache.maven:maven-project:jar:2.0.6
[DEBUG]   Excluded: org.apache.maven:maven-profile:jar:2.0.6
[DEBUG]   Excluded: org.apache.maven:maven-artifact-manager:jar:2.0.6
[DEBUG]   Excluded: org.apache.maven:maven-plugin-registry:jar:2.0.6
[DEBUG]   Excluded: org.apache.maven:maven-core:jar:2.0.6
[DEBUG]   Excluded: org.apache.maven:maven-plugin-parameter-documenter:jar:2.0.6
[DEBUG]   Excluded: org.apache.maven:maven-repository-metadata:jar:2.0.6
[DEBUG]   Excluded: org.apache.maven:maven-error-diagnostics:jar:2.0.6
[DEBUG]   Excluded: org.apache.maven:maven-plugin-descriptor:jar:2.0.6
[DEBUG]   Excluded: classworlds:classworlds:jar:1.1
[DEBUG]   Excluded: org.apache.maven:maven-settings:jar:2.0.6
[DEBUG]   Excluded: org.apache.maven:maven-monitor:jar:2.0.6
[DEBUG]   Excluded: org.codehaus.plexus:plexus-container-default:jar:1.0-alpha-9-stable-1
[DEBUG] Configuring mojo org.apache.maven.plugins:maven-war-plugin:2.1:war from plugin realm
ClassRealm[plugin>org.apache.maven.plugins:maven-war-plugin:2.1, parent: sun.misc.Launcher$AppClassLoader@192d342]
[DEBUG] Configuring mojo 'org.apache.maven.plugins:maven-war-plugin:2.1:war' with basic configurator
-->
[DEBUG]   (s) archiveClasses = false
[DEBUG]   (s) attachClasses = false
[DEBUG]   (s) cacheFile = <https://builds.apache.org/job/Hadoop-Common-trunk/ws/trunk/hadoop-common-project/hadoop-auth-examples/target/war/work/webapp-cache.xml>
[DEBUG]   (s) classesClassifier = classes
[DEBUG]   (s) classesDirectory = <https://builds.apache.org/job/Hadoop-Common-trunk/ws/trunk/hadoop-common-project/hadoop-auth-examples/target/classes>
[DEBUG]   (f) escapedBackslashesInFilePath = false
[DEBUG]   (s) failOnMissingWebXml = true
[DEBUG]   (f) filteringDeploymentDescriptors = false
[DEBUG]   (s) outputDirectory = <https://builds.apache.org/job/Hadoop-Common-trunk/ws/trunk/hadoop-common-project/hadoop-auth-examples/target>
[DEBUG]   (s) primaryArtifact = true
[DEBUG]   (s) project = MavenProject: org.apache.hadoop:hadoop-auth-examples:3.0.0-SNAPSHOT
@ <https://builds.apache.org/job/Hadoop-Common-trunk/ws/trunk/hadoop-common-project/hadoop-auth-examples/pom.xml>
[DEBUG]   (f) session = org.apache.maven.execution.MavenSession@98f352
[DEBUG]   (s) useCache = false
[DEBUG]   (s) warName = hadoop-auth-examples
[DEBUG]   (s) warSourceDirectory = <https://builds.apache.org/job/Hadoop-Common-trunk/ws/trunk/hadoop-common-project/hadoop-auth-examples/src/main/webapp>
[DEBUG]   (s) warSourceIncludes = **
[DEBUG]   (s) webappDirectory = <https://builds.apache.org/job/Hadoop-Common-trunk/ws/trunk/hadoop-common-project/hadoop-auth-examples/target/hadoop-auth-examples-3.0.0-SNAPSHOT>
[DEBUG]   (s) workDirectory = <https://builds.apache.org/job/Hadoop-Common-trunk/ws/trunk/hadoop-common-project/hadoop-auth-examples/target/war/work>
[DEBUG] -- end configuration --
[INFO] Packaging webapp
[INFO] Assembling webapp [hadoop-auth-examples] in [<https://builds.apache.org/job/Hadoop-Common-trunk/ws/trunk/hadoop-common-project/hadoop-auth-examples/target/hadoop-auth-examples-3.0.0-SNAPSHOT]>
[DEBUG] properties used {java.vendor=Sun Microsystems Inc., tar=true, env.JENKINS_SERVER_COOKIE=7c50f1f72c06532d13df55278c5aeb60,
sun.java.launcher=SUN_STANDARD, sun.management.compiler=HotSpot Tiered Compilers, env.SVN_REVISION_2=1203063,
os.name=Linux, env.SVN_REVISION_1=1364865, sun.boot.class.path=/home/jenkins/tools/java/jdk1.6.0_27/jre/lib/resources.jar:/home/jenkins/tools/java/jdk1.6.0_27/jre/lib/rt.jar:/home/jenkins/tools/java/jdk1.6.0_27/jre/lib/sunrsasign.jar:/home/jenkins/tools/java/jdk1.6.0_27/jre/lib/jsse.jar:/home/jenkins/tools/java/jdk1.6.0_27/jre/lib/jce.jar:/home/jenkins/tools/java/jdk1.6.0_27/jre/lib/charsets.jar:/home/jenkins/tools/java/jdk1.6.0_27/jre/lib/modules/jdk.boot.jar:/home/jenkins/tools/java/jdk1.6.0_27/jre/classes,
env.PWD=<https://builds.apache.org/job/Hadoop-Common-trunk/ws/trunk/hadoop-common-project,>
env.JAVA5_HOME=/home/jenkins/tools/java5/latest, env.LANG=en_US, java.vm.specification.vendor=Sun
Microsystems Inc., java.runtime.version=1.6.0_27-b07, test.build.dir=<https://builds.apache.org/job/Hadoop-Common-trunk/ws/trunk/hadoop-common-project/hadoop-auth-examples/target/test-dir,>
project.build.sourceEncoding=UTF-8, env.XERCES_HOME=/home/jenkins/tools/xerces/latest, user.name=jenkins,
env._=/home/jenkins/tools/maven/latest/bin/mvn, env.USER=jenkins, env.SHELL=/bin/sh, env.NLSPATH=/usr/dt/lib/nls/msg/%L/%N.cat,
env.PATH=/home/hudson/tools/java/latest1.6/bin:/usr/local/sbin:/usr/local/bin:/usr/sbin:/usr/bin:/sbin:/bin:/usr/games:/home/jenkins/tools/java/latest/bin:/home/jenkins/tools/ant/latest/bin:,
user.language=en, sun.boot.library.path=/home/jenkins/tools/java/jdk1.6.0_27/jre/lib/i386,
classworlds.conf=/home/jenkins/tools/maven/latest/bin/m2.conf, env.SSH_CONNECTION=140.211.11.8
47525 67.195.138.24 22, java.version=1.6.0_27, env.SSH_CLIENT=140.211.11.8 47525 22, user.timezone=Etc/UTC,
env.NODE_NAME=hadoop1, sun.arch.data.model=32, java.endorsed.dirs=/home/jenkins/tools/java/jdk1.6.0_27/jre/lib/endorsed,
sun.cpu.isalist=, sun.jnu.encoding=ISO-8859-1, file.encoding.pkg=sun.io, env.SHLVL=1, file.separator=/,
java.specification.name=Java Platform API Specification, env.FORREST_HOME=/home/jenkins/tools/forrest/latest,
java.class.version=50.0, test.build.data=<https://builds.apache.org/job/Hadoop-Common-trunk/ws/trunk/hadoop-common-project/hadoop-auth-examples/target/test-dir,>
user.country=US, env.BUILD_NUMBER=481, java.home=/home/jenkins/tools/java/jdk1.6.0_27/jre,
java.vm.info=mixed mode, env.LOGNAME=jenkins, os.version=2.6.32-33-server, maven.test.redirectTestOutputToFile=true,
env.HUDSON_COOKIE=531af2a7-49ae-47ee-a4dc-ed33bd202a32, project.reporting.outputEncoding=UTF-8,
path.separator=:, java.vm.version=20.2-b06, env.JOB_NAME=Hadoop-Common-trunk, env.JAVA_HOME=/home/jenkins/tools/java/latest,
java.awt.printerjob=sun.print.PSPrinterJob, sun.io.unicode.encoding=UnicodeLittle, env.HUDSON_URL=https://builds.apache.org/,
env.BUILD_TAG=jenkins-Hadoop-Common-trunk-481, user.home=/home/jenkins, env.JENKINS_HOME=/home/hudson/hudson,
env.JOB_URL=https://builds.apache.org/job/Hadoop-Common-trunk/, env.OLDPWD=<https://builds.apache.org/job/Hadoop-Common-trunk/ws/trunk/hadoop-common-project,>
java.specification.vendor=Sun Microsystems Inc., java.vendor.url=http://java.sun.com/, java.library.path=/home/jenkins/tools/java/jdk1.6.0_27/jre/lib/i386/server:/home/jenkins/tools/java/jdk1.6.0_27/jre/lib/i386:/home/jenkins/tools/java/jdk1.6.0_27/jre/../lib/i386:/usr/java/packages/lib/i386:/lib:/usr/lib,
env.HUDSON_HOME=/home/hudson/hudson, distMgmtSnapshotsName=Apache Development Snapshot Repository,
java.vm.vendor=Sun Microsystems Inc., env.HUDSON_SERVER_COOKIE=7c50f1f72c06532d13df55278c5aeb60,
test.exclude=_, java.runtime.name=Java(TM) SE Runtime Environment, maven.home=/home/jenkins/tools/maven/latest,
java.class.path=/home/jenkins/tools/maven/latest/boot/plexus-classworlds-2.4.jar, sun.java.command=org.codehaus.plexus.classworlds.launcher.Launcher
clean verify checkstyle:checkstyle findbugs:findbugs test -Pdist -Pnative -Dtar -Pdocs -X,
env.EXECUTOR_NUMBER=0, build.platform=Linux-i386-32, test.exclude.pattern=_, env.ANT_OPTS=-Xmx2048m,
env.XFILESEARCHPATH=/usr/dt/app-defaults/%L/Dt, java.vm.specification.name=Java Virtual Machine
Specification, java.vm.specification.version=1.0, sun.os.patch.level=unknown, sun.cpu.endian=little,
env.HOME=/home/jenkins, env.ANT_HOME=/home/jenkins/tools/ant/latest, env.LD_LIBRARY_PATH=/home/jenkins/tools/java/jdk1.6.0_27/jre/lib/i386/server:/home/jenkins/tools/java/jdk1.6.0_27/jre/lib/i386:/home/jenkins/tools/java/jdk1.6.0_27/jre/../lib/i386,
java.io.tmpdir=/tmp, env.BUILD_URL=https://builds.apache.org/job/Hadoop-Common-trunk/481/,
java.vendor.url.bug=http://java.sun.com/cgi-bin/bugreport.cgi, env.MAVEN_OPTS=-Xmx2048m, distMgmtSnapshotsUrl=https://repository.apache.org/content/repositories/snapshots,
env.ECLIPSE_HOME=/home/jenkins/tools/eclipse/latest, env.FINDBUGS_HOME=/home/jenkins/tools/findbugs/latest,
java.awt.graphicsenv=sun.awt.X11GraphicsEnvironment, os.arch=i386, java.ext.dirs=/home/jenkins/tools/java/jdk1.6.0_27/jre/lib/ext:/usr/java/packages/lib/ext,
env.BUILD_ID=2012-07-24_09-21-35, user.dir=<https://builds.apache.org/job/Hadoop-Common-trunk/ws/trunk/hadoop-common-project,>
env.MAVEN_HOME=/home/jenkins/tools/maven/latest, jdiff.version=1.0.9, line.separator=
, java.vm.name=Java HotSpot(TM) Server VM, env.JENKINS_URL=https://builds.apache.org/, env.CLOVER_HOME=/home/jenkins/tools/clover/latest,
env.MAIL=/var/mail/jenkins, file.encoding=ISO-8859-1, failIfNoTests=false, env.WORKSPACE=<https://builds.apache.org/job/Hadoop-Common-trunk/ws/,>
hadoop.assemblies.version=3.0.0-SNAPSHOT, commons-daemon.version=1.0.3, java.specification.version=1.6,
env.SVN_URL_2=http://svn.apache.org/repos/asf/hadoop/nightly, env.SVN_URL_1=http://svn.apache.org/repos/asf/hadoop/common/trunk,
env.NODE_LABELS=Hadoop Hcat Hdfs Pig hadoop1}
[INFO] Processing war project
[INFO] Copying webapp resources [<https://builds.apache.org/job/Hadoop-Common-trunk/ws/trunk/hadoop-common-project/hadoop-auth-examples/src/main/webapp]>
[DEBUG]  + WEB-INF/web.xml has been copied.
[DEBUG]  + index.html has been copied.
[DEBUG]  + annonymous/index.html has been copied.
[DEBUG]  + simple/index.html has been copied.
[DEBUG]  + kerberos/index.html has been copied.
[DEBUG] Dump of the current build pathSet content -->
[DEBUG] WEB-INF/web.xml
[DEBUG] index.html
[DEBUG] annonymous/index.html
[DEBUG] simple/index.html
[DEBUG] kerberos/index.html
[DEBUG] -- end of dump --
[DEBUG]  + WEB-INF/classes/log4j.properties has been copied.
[DEBUG]  + WEB-INF/classes/mrapp-generated-classpath has been copied.
[DEBUG]  + WEB-INF/classes/org/apache/hadoop/security/authentication/examples/RequestLoggerFilter.class
has been copied.
[DEBUG]  + WEB-INF/classes/org/apache/hadoop/security/authentication/examples/WhoServlet.class
has been copied.
[DEBUG]  + WEB-INF/classes/org/apache/hadoop/security/authentication/examples/WhoClient.class
has been copied.
[DEBUG]  + WEB-INF/classes/org/apache/hadoop/security/authentication/examples/RequestLoggerFilter$XHttpServletResponse.class
has been copied.
[DEBUG]  + WEB-INF/classes/org/apache/hadoop/security/authentication/examples/RequestLoggerFilter$XHttpServletRequest.class
has been copied.
[DEBUG] Processing: hadoop-auth-3.0.0-SNAPSHOT.jar
[INFO] ------------------------------------------------------------------------
[INFO] Reactor Summary:
[INFO] 
[INFO] Apache Hadoop Annotations ......................... SUCCESS [28.659s]
[INFO] Apache Hadoop Auth ................................ SUCCESS [47.447s]
[INFO] Apache Hadoop Auth Examples ....................... FAILURE [0.961s]
[INFO] Apache Hadoop Common .............................. SKIPPED
[INFO] Apache Hadoop Common Project ...................... SKIPPED
[INFO] ------------------------------------------------------------------------
[INFO] BUILD FAILURE
[INFO] ------------------------------------------------------------------------
[INFO] Total time: 1:19.282s
[INFO] Finished at: Tue Jul 24 09:27:53 UTC 2012
[INFO] Final Memory: 45M/521M
[INFO] ------------------------------------------------------------------------
[ERROR] Failed to execute goal org.apache.maven.plugins:maven-war-plugin:2.1:war (default-war)
on project hadoop-auth-examples: Failed to copy file for artifact [org.apache.hadoop:hadoop-auth:jar:3.0.0-SNAPSHOT:compile]:
<https://builds.apache.org/job/Hadoop-Common-trunk/ws/trunk/hadoop-common-project/hadoop-auth/target/classes>
(Is a directory) -> [Help 1]
org.apache.maven.lifecycle.LifecycleExecutionException: Failed to execute goal org.apache.maven.plugins:maven-war-plugin:2.1:war
(default-war) on project hadoop-auth-examples: Failed to copy file for artifact [org.apache.hadoop:hadoop-auth:jar:3.0.0-SNAPSHOT:compile]
	at org.apache.maven.lifecycle.internal.MojoExecutor.execute(MojoExecutor.java:217)
	at org.apache.maven.lifecycle.internal.MojoExecutor.execute(MojoExecutor.java:153)
	at org.apache.maven.lifecycle.internal.MojoExecutor.execute(MojoExecutor.java:145)
	at org.apache.maven.lifecycle.internal.LifecycleModuleBuilder.buildProject(LifecycleModuleBuilder.java:84)
	at org.apache.maven.lifecycle.internal.LifecycleModuleBuilder.buildProject(LifecycleModuleBuilder.java:59)
	at org.apache.maven.lifecycle.internal.LifecycleStarter.singleThreadedBuild(LifecycleStarter.java:183)
	at org.apache.maven.lifecycle.internal.LifecycleStarter.execute(LifecycleStarter.java:161)
	at org.apache.maven.DefaultMaven.doExecute(DefaultMaven.java:319)
	at org.apache.maven.DefaultMaven.execute(DefaultMaven.java:156)
	at org.apache.maven.cli.MavenCli.execute(MavenCli.java:537)
	at org.apache.maven.cli.MavenCli.doMain(MavenCli.java:196)
	at org.apache.maven.cli.MavenCli.main(MavenCli.java:141)
	at sun.reflect.NativeMethodAccessorImpl.invoke0(Native Method)
	at sun.reflect.NativeMethodAccessorImpl.invoke(NativeMethodAccessorImpl.java:39)
	at sun.reflect.DelegatingMethodAccessorImpl.invoke(DelegatingMethodAccessorImpl.java:25)
	at java.lang.reflect.Method.invoke(Method.java:597)
	at org.codehaus.plexus.classworlds.launcher.Launcher.launchEnhanced(Launcher.java:290)
	at org.codehaus.plexus.classworlds.launcher.Launcher.launch(Launcher.java:230)
	at org.codehaus.plexus.classworlds.launcher.Launcher.mainWithExitCode(Launcher.java:409)
	at org.codehaus.plexus.classworlds.launcher.Launcher.main(Launcher.java:352)
Caused by: org.apache.maven.plugin.MojoExecutionException: Failed to copy file for artifact
[org.apache.hadoop:hadoop-auth:jar:3.0.0-SNAPSHOT:compile]
	at org.apache.maven.plugin.war.packaging.ArtifactsPackagingTask.performPackaging(ArtifactsPackagingTask.java:125)
	at org.apache.maven.plugin.war.packaging.WarProjectPackagingTask.handleArtifacts(WarProjectPackagingTask.java:189)
	at org.apache.maven.plugin.war.packaging.WarProjectPackagingTask.performPackaging(WarProjectPackagingTask.java:108)
	at org.apache.maven.plugin.war.AbstractWarMojo.buildWebapp(AbstractWarMojo.java:472)
	at org.apache.maven.plugin.war.AbstractWarMojo.buildExplodedWebapp(AbstractWarMojo.java:404)
	at org.apache.maven.plugin.war.WarMojo.performPackaging(WarMojo.java:196)
	at org.apache.maven.plugin.war.WarMojo.execute(WarMojo.java:158)
	at org.apache.maven.plugin.DefaultBuildPluginManager.executeMojo(DefaultBuildPluginManager.java:101)
	at org.apache.maven.lifecycle.internal.MojoExecutor.execute(MojoExecutor.java:209)
	... 19 more
Caused by: java.io.FileNotFoundException: <https://builds.apache.org/job/Hadoop-Common-trunk/ws/trunk/hadoop-common-project/hadoop-auth/target/classes>
(Is a directory)
	at java.io.FileInputStream.open(Native Method)
	at java.io.FileInputStream.<init>(FileInputStream.java:120)
	at org.codehaus.plexus.util.io.FileInputStreamFacade.getInputStream(FileInputStreamFacade.java:39)
	at org.codehaus.plexus.util.FileUtils.copyStreamToFile(FileUtils.java:1106)
	at org.codehaus.plexus.util.FileUtils.copyFile(FileUtils.java:1013)
	at org.apache.maven.plugin.war.packaging.AbstractWarPackagingTask.copyFile(AbstractWarPackagingTask.java:293)
	at org.apache.maven.plugin.war.packaging.AbstractWarPackagingTask$1.registered(AbstractWarPackagingTask.java:150)
	at org.apache.maven.plugin.war.util.WebappStructure.registerFile(WebappStructure.java:211)
	at org.apache.maven.plugin.war.packaging.AbstractWarPackagingTask.copyFile(AbstractWarPackagingTask.java:145)
	at org.apache.maven.plugin.war.packaging.ArtifactsPackagingTask.performPackaging(ArtifactsPackagingTask.java:100)
	... 27 more
[ERROR] 
[ERROR] 
[ERROR] For more information about the errors and possible solutions, please read the following
articles:
[ERROR] [Help 1] http://cwiki.apache.org/confluence/display/MAVEN/MojoExecutionException
[ERROR] 
[ERROR] After correcting the problems, you can resume the build with the command
[ERROR]   mvn <goals> -rf :hadoop-auth-examples
Build step 'Execute shell' marked build as failure
Archiving artifacts

Mime
View raw message