hadoop-common-dev mailing list archives

Site index · List index
Message view « Date » · « Thread »
Top « Date » · « Thread »
From Apache Jenkins Server <jenk...@builds.apache.org>
Subject Build failed in Jenkins: Hadoop-Common-0.23-Build #284
Date Fri, 15 Jun 2012 09:28:01 GMT
See <https://builds.apache.org/job/Hadoop-Common-0.23-Build/284/>

------------------------------------------
[...truncated 13277 lines...]
Running org.apache.hadoop.fs.viewfs.TestViewFsWithAuthorityLocalFs
Tests run: 42, Failures: 0, Errors: 0, Skipped: 0, Time elapsed: 2.002 sec
Running org.apache.hadoop.fs.viewfs.TestViewFsLocalFs
Tests run: 42, Failures: 0, Errors: 0, Skipped: 0, Time elapsed: 1.889 sec
Running org.apache.hadoop.fs.TestGlobPattern
Tests run: 2, Failures: 0, Errors: 0, Skipped: 0, Time elapsed: 0.148 sec
Running org.apache.hadoop.fs.TestS3_LocalFileContextURI
Tests run: 17, Failures: 0, Errors: 0, Skipped: 0, Time elapsed: 1.11 sec
Running org.apache.hadoop.fs.TestLocalFSFileContextCreateMkdir
Tests run: 8, Failures: 0, Errors: 0, Skipped: 0, Time elapsed: 0.747 sec
Running org.apache.hadoop.fs.TestHarFileSystem
Tests run: 3, Failures: 0, Errors: 0, Skipped: 0, Time elapsed: 0.34 sec
Running org.apache.hadoop.fs.TestFileSystemCaching
Tests run: 7, Failures: 0, Errors: 0, Skipped: 0, Time elapsed: 0.739 sec
Running org.apache.hadoop.fs.TestLocalFsFCStatistics
Tests run: 1, Failures: 0, Errors: 0, Skipped: 0, Time elapsed: 0.539 sec
Running org.apache.hadoop.fs.TestHardLink
Tests run: 6, Failures: 0, Errors: 0, Skipped: 0, Time elapsed: 0.297 sec
Running org.apache.hadoop.fs.TestCommandFormat
Tests run: 10, Failures: 0, Errors: 0, Skipped: 0, Time elapsed: 0.173 sec
Running org.apache.hadoop.fs.TestLocal_S3FileContextURI
Tests run: 17, Failures: 0, Errors: 0, Skipped: 0, Time elapsed: 1.147 sec
Running org.apache.hadoop.fs.TestLocalFileSystem
Tests run: 8, Failures: 0, Errors: 0, Skipped: 0, Time elapsed: 0.845 sec
Running org.apache.hadoop.fs.TestFcLocalFsPermission
Tests run: 4, Failures: 0, Errors: 0, Skipped: 0, Time elapsed: 0.688 sec
Running org.apache.hadoop.fs.TestListFiles
Tests run: 2, Failures: 0, Errors: 0, Skipped: 0, Time elapsed: 0.586 sec
Running org.apache.hadoop.fs.TestPath
Tests run: 16, Failures: 0, Errors: 0, Skipped: 0, Time elapsed: 0.867 sec
Running org.apache.hadoop.fs.kfs.TestKosmosFileSystem
Tests run: 3, Failures: 0, Errors: 0, Skipped: 0, Time elapsed: 0.619 sec
Running org.apache.hadoop.fs.TestGlobExpander
Tests run: 2, Failures: 0, Errors: 0, Skipped: 0, Time elapsed: 0.118 sec
Running org.apache.hadoop.fs.TestFilterFileSystem
Tests run: 10, Failures: 0, Errors: 0, Skipped: 0, Time elapsed: 0.624 sec
Running org.apache.hadoop.fs.TestFcLocalFsUtil
Tests run: 2, Failures: 0, Errors: 0, Skipped: 0, Time elapsed: 0.608 sec
Running org.apache.hadoop.fs.TestGetFileBlockLocations
Tests run: 3, Failures: 0, Errors: 0, Skipped: 0, Time elapsed: 0.792 sec
Running org.apache.hadoop.fs.s3.TestInMemoryS3FileSystemContract
Tests run: 29, Failures: 0, Errors: 0, Skipped: 0, Time elapsed: 0.879 sec
Running org.apache.hadoop.fs.s3.TestINode
Tests run: 3, Failures: 0, Errors: 0, Skipped: 0, Time elapsed: 0.117 sec
Running org.apache.hadoop.fs.s3.TestS3Credentials
Tests run: 1, Failures: 0, Errors: 0, Skipped: 0, Time elapsed: 0.205 sec
Running org.apache.hadoop.fs.s3.TestS3FileSystem
Tests run: 1, Failures: 0, Errors: 0, Skipped: 0, Time elapsed: 0.239 sec
Running org.apache.hadoop.fs.TestDU
Tests run: 1, Failures: 0, Errors: 0, Skipped: 0, Time elapsed: 5.272 sec
Running org.apache.hadoop.record.TestBuffer
Tests run: 6, Failures: 0, Errors: 0, Skipped: 0, Time elapsed: 0.119 sec
Running org.apache.hadoop.record.TestRecordVersioning
Tests run: 2, Failures: 0, Errors: 0, Skipped: 0, Time elapsed: 0.198 sec
Running org.apache.hadoop.record.TestRecordIO
Tests run: 5, Failures: 0, Errors: 0, Skipped: 0, Time elapsed: 0.256 sec
Running org.apache.hadoop.metrics2.source.TestJvmMetrics
Tests run: 1, Failures: 0, Errors: 0, Skipped: 0, Time elapsed: 0.457 sec
Running org.apache.hadoop.metrics2.util.TestSampleStat
Tests run: 1, Failures: 0, Errors: 0, Skipped: 0, Time elapsed: 0.14 sec
Running org.apache.hadoop.metrics2.util.TestMetricsCache
Tests run: 4, Failures: 0, Errors: 0, Skipped: 0, Time elapsed: 2.197 sec
Running org.apache.hadoop.metrics2.lib.TestInterns
Tests run: 4, Failures: 0, Errors: 0, Skipped: 0, Time elapsed: 0.3 sec
Running org.apache.hadoop.metrics2.lib.TestMetricsAnnotations
Tests run: 9, Failures: 0, Errors: 0, Skipped: 0, Time elapsed: 0.52 sec
Running org.apache.hadoop.metrics2.lib.TestMutableMetrics
Tests run: 2, Failures: 0, Errors: 0, Skipped: 0, Time elapsed: 0.483 sec
Running org.apache.hadoop.metrics2.lib.TestUniqNames
Tests run: 2, Failures: 0, Errors: 0, Skipped: 0, Time elapsed: 0.154 sec
Running org.apache.hadoop.metrics2.lib.TestMetricsRegistry
Tests run: 2, Failures: 0, Errors: 0, Skipped: 0, Time elapsed: 0.447 sec
Running org.apache.hadoop.metrics2.impl.TestMetricsCollectorImpl
Tests run: 2, Failures: 0, Errors: 0, Skipped: 0, Time elapsed: 0.306 sec
Running org.apache.hadoop.metrics2.impl.TestGangliaMetrics
Tests run: 2, Failures: 0, Errors: 0, Skipped: 0, Time elapsed: 0.471 sec
Running org.apache.hadoop.metrics2.impl.TestSinkQueue
Tests run: 8, Failures: 0, Errors: 0, Skipped: 0, Time elapsed: 0.548 sec
Running org.apache.hadoop.metrics2.impl.TestMetricsVisitor
Tests run: 1, Failures: 0, Errors: 0, Skipped: 0, Time elapsed: 0.423 sec
Running org.apache.hadoop.metrics2.impl.TestMetricsSystemImpl
Tests run: 3, Failures: 0, Errors: 0, Skipped: 0, Time elapsed: 0.655 sec
Running org.apache.hadoop.metrics2.impl.TestMetricsConfig
Tests run: 3, Failures: 0, Errors: 0, Skipped: 0, Time elapsed: 0.36 sec
Running org.apache.hadoop.metrics2.filter.TestPatternFilter
Tests run: 5, Failures: 0, Errors: 0, Skipped: 0, Time elapsed: 0.31 sec
Running org.apache.hadoop.io.TestWritableName
Tests run: 4, Failures: 0, Errors: 0, Skipped: 0, Time elapsed: 0.215 sec
Running org.apache.hadoop.io.TestBloomMapFile
Tests run: 3, Failures: 0, Errors: 0, Skipped: 0, Time elapsed: 0.897 sec
Running org.apache.hadoop.io.TestEnumSetWritable
Tests run: 4, Failures: 0, Errors: 0, Skipped: 0, Time elapsed: 0.542 sec
Running org.apache.hadoop.io.TestSequenceFileSerialization
Tests run: 1, Failures: 0, Errors: 0, Skipped: 0, Time elapsed: 0.646 sec
Running org.apache.hadoop.io.TestSequenceFileSync
Tests run: 1, Failures: 0, Errors: 0, Skipped: 0, Time elapsed: 0.826 sec
Running org.apache.hadoop.io.TestBooleanWritable
Tests run: 1, Failures: 0, Errors: 0, Skipped: 0, Time elapsed: 0.15 sec
Running org.apache.hadoop.io.TestText
Tests run: 10, Failures: 0, Errors: 0, Skipped: 0, Time elapsed: 0.914 sec
Running org.apache.hadoop.io.TestMapWritable
Tests run: 4, Failures: 0, Errors: 0, Skipped: 0, Time elapsed: 0.241 sec
Running org.apache.hadoop.io.compress.TestCodecFactory
Tests run: 1, Failures: 0, Errors: 0, Skipped: 0, Time elapsed: 0.343 sec
Running org.apache.hadoop.io.compress.TestBlockDecompressorStream
Tests run: 1, Failures: 0, Errors: 0, Skipped: 0, Time elapsed: 0.143 sec
Running org.apache.hadoop.io.compress.TestCodec
Tests run: 20, Failures: 0, Errors: 0, Skipped: 0, Time elapsed: 59.928 sec
Running org.apache.hadoop.io.TestObjectWritableProtos
Tests run: 3, Failures: 0, Errors: 0, Skipped: 0, Time elapsed: 0.4 sec
Running org.apache.hadoop.io.TestDataByteBuffers
Tests run: 5, Failures: 0, Errors: 0, Skipped: 0, Time elapsed: 0.592 sec
Running org.apache.hadoop.io.TestWritable
Tests run: 6, Failures: 0, Errors: 0, Skipped: 0, Time elapsed: 0.132 sec
Running org.apache.hadoop.io.TestSecureIOUtils
Tests run: 4, Failures: 0, Errors: 0, Skipped: 0, Time elapsed: 0.524 sec
Running org.apache.hadoop.io.retry.TestFailoverProxy
Tests run: 5, Failures: 0, Errors: 0, Skipped: 0, Time elapsed: 0.276 sec
Running org.apache.hadoop.io.retry.TestRetryProxy
Tests run: 9, Failures: 0, Errors: 0, Skipped: 0, Time elapsed: 0.263 sec
Running org.apache.hadoop.io.TestGenericWritable
Tests run: 5, Failures: 0, Errors: 0, Skipped: 0, Time elapsed: 0.406 sec
Running org.apache.hadoop.io.TestArrayPrimitiveWritable
Tests run: 3, Failures: 0, Errors: 0, Skipped: 0, Time elapsed: 0.218 sec
Running org.apache.hadoop.io.TestSetFile
Tests run: 1, Failures: 0, Errors: 0, Skipped: 0, Time elapsed: 4.256 sec
Running org.apache.hadoop.io.TestSortedMapWritable
Tests run: 2, Failures: 0, Errors: 0, Skipped: 0, Time elapsed: 0.231 sec
Running org.apache.hadoop.io.TestSequenceFile
Tests run: 7, Failures: 0, Errors: 0, Skipped: 0, Time elapsed: 20.277 sec
Running org.apache.hadoop.io.TestDefaultStringifier
Tests run: 4, Failures: 0, Errors: 0, Skipped: 0, Time elapsed: 0.361 sec
Running org.apache.hadoop.io.TestTextNonUTF8
Tests run: 1, Failures: 0, Errors: 0, Skipped: 0, Time elapsed: 0.114 sec
Running org.apache.hadoop.io.TestUTF8
Tests run: 4, Failures: 0, Errors: 0, Skipped: 0, Time elapsed: 1.653 sec
Running org.apache.hadoop.io.TestMD5Hash
Tests run: 2, Failures: 0, Errors: 0, Skipped: 0, Time elapsed: 0.225 sec
Running org.apache.hadoop.io.TestBoundedByteArrayOutputStream
Tests run: 1, Failures: 0, Errors: 0, Skipped: 0, Time elapsed: 0.112 sec
Running org.apache.hadoop.io.file.tfile.TestTFileLzoCodecsByteArrays
Tests run: 25, Failures: 0, Errors: 0, Skipped: 0, Time elapsed: 0.386 sec
Running org.apache.hadoop.io.file.tfile.TestVLong
Tests run: 9, Failures: 0, Errors: 0, Skipped: 0, Time elapsed: 3.209 sec
Running org.apache.hadoop.io.file.tfile.TestTFileByteArrays
Tests run: 25, Failures: 0, Errors: 0, Skipped: 0, Time elapsed: 3.953 sec
Running org.apache.hadoop.io.file.tfile.TestTFileNoneCodecsByteArrays
Tests run: 25, Failures: 0, Errors: 0, Skipped: 0, Time elapsed: 1.47 sec
Running org.apache.hadoop.io.file.tfile.TestTFileUnsortedByteArrays
Tests run: 4, Failures: 0, Errors: 0, Skipped: 0, Time elapsed: 0.707 sec
Running org.apache.hadoop.io.file.tfile.TestTFileSeek
Tests run: 1, Failures: 0, Errors: 0, Skipped: 0, Time elapsed: 5.436 sec
Running org.apache.hadoop.io.file.tfile.TestTFileJClassComparatorByteArrays
Tests run: 25, Failures: 0, Errors: 0, Skipped: 0, Time elapsed: 3.766 sec
Running org.apache.hadoop.io.file.tfile.TestTFileLzoCodecsStreams
Tests run: 19, Failures: 0, Errors: 0, Skipped: 0, Time elapsed: 0.327 sec
Running org.apache.hadoop.io.file.tfile.TestTFileStreams
Tests run: 19, Failures: 0, Errors: 0, Skipped: 0, Time elapsed: 2.124 sec
Running org.apache.hadoop.io.file.tfile.TestTFileNoneCodecsJClassComparatorByteArrays
Tests run: 25, Failures: 0, Errors: 0, Skipped: 0, Time elapsed: 1.465 sec
Running org.apache.hadoop.io.file.tfile.TestTFileComparator2
Tests run: 1, Failures: 0, Errors: 0, Skipped: 0, Time elapsed: 1.616 sec
Running org.apache.hadoop.io.file.tfile.TestTFile
Tests run: 3, Failures: 0, Errors: 0, Skipped: 0, Time elapsed: 1.401 sec
Running org.apache.hadoop.io.file.tfile.TestTFileSplit
Tests run: 1, Failures: 0, Errors: 0, Skipped: 0, Time elapsed: 11.24 sec
Running org.apache.hadoop.io.file.tfile.TestTFileSeqFileComparison
Tests run: 1, Failures: 0, Errors: 0, Skipped: 0, Time elapsed: 7.494 sec
Running org.apache.hadoop.io.file.tfile.TestTFileNoneCodecsStreams
Tests run: 19, Failures: 0, Errors: 0, Skipped: 0, Time elapsed: 2.134 sec
Running org.apache.hadoop.io.file.tfile.TestTFileComparators
Tests run: 3, Failures: 0, Errors: 0, Skipped: 0, Time elapsed: 0.548 sec
Running org.apache.hadoop.io.TestMapFile
Tests run: 3, Failures: 0, Errors: 0, Skipped: 0, Time elapsed: 0.671 sec
Running org.apache.hadoop.io.TestBytesWritable
Tests run: 5, Failures: 0, Errors: 0, Skipped: 0, Time elapsed: 0.166 sec
Running org.apache.hadoop.io.TestArrayFile
Tests run: 2, Failures: 0, Errors: 0, Skipped: 0, Time elapsed: 7.749 sec
Running org.apache.hadoop.io.TestVersionedWritable
Tests run: 3, Failures: 0, Errors: 0, Skipped: 0, Time elapsed: 0.135 sec
Running org.apache.hadoop.io.TestArrayWritable
Tests run: 1, Failures: 0, Errors: 0, Skipped: 0, Time elapsed: 0.142 sec
Running org.apache.hadoop.io.nativeio.TestNativeIO
Tests run: 9, Failures: 0, Errors: 0, Skipped: 0, Time elapsed: 5.96 sec
Running org.apache.hadoop.io.TestWritableUtils
Tests run: 1, Failures: 0, Errors: 0, Skipped: 0, Time elapsed: 0.184 sec
Running org.apache.hadoop.io.TestIOUtils
Tests run: 6, Failures: 0, Errors: 0, Skipped: 0, Time elapsed: 0.346 sec
Running org.apache.hadoop.io.serializer.avro.TestAvroSerialization
Tests run: 4, Failures: 0, Errors: 0, Skipped: 0, Time elapsed: 0.575 sec
Running org.apache.hadoop.io.serializer.TestWritableSerialization
Tests run: 2, Failures: 0, Errors: 0, Skipped: 0, Time elapsed: 0.303 sec
Running org.apache.hadoop.io.serializer.TestSerializationFactory
Tests run: 1, Failures: 0, Errors: 0, Skipped: 0, Time elapsed: 0.318 sec
Running org.apache.hadoop.test.TestMultithreadedTestUtil
Tests run: 4, Failures: 0, Errors: 0, Skipped: 0, Time elapsed: 3.223 sec
Running org.apache.hadoop.net.TestSocketIOWithTimeout
Tests run: 1, Failures: 0, Errors: 0, Skipped: 0, Time elapsed: 3.211 sec
Running org.apache.hadoop.net.TestSwitchMapping
Tests run: 5, Failures: 0, Errors: 0, Skipped: 0, Time elapsed: 0.325 sec
Running org.apache.hadoop.net.TestNetUtils
Tests run: 34, Failures: 0, Errors: 0, Skipped: 0, Time elapsed: 0.44 sec
Running org.apache.hadoop.net.TestStaticMapping
Tests run: 8, Failures: 0, Errors: 0, Skipped: 0, Time elapsed: 0.491 sec
Running org.apache.hadoop.net.TestScriptBasedMapping
Tests run: 4, Failures: 0, Errors: 0, Skipped: 0, Time elapsed: 1.056 sec
Running org.apache.hadoop.net.TestDNS
Tests run: 7, Failures: 0, Errors: 0, Skipped: 0, Time elapsed: 0.22 sec

Results :

Failed tests:   testTrash(org.apache.hadoop.fs.viewfs.TestViewFsTrash): -expunge failed expected:<0>
but was:<1>

Tests run: 1504, Failures: 1, Errors: 0, Skipped: 3

[INFO] ------------------------------------------------------------------------
[INFO] Reactor Summary:
[INFO] 
[INFO] Apache Hadoop Annotations ......................... SUCCESS [6.159s]
[INFO] Apache Hadoop Auth ................................ SUCCESS [9.654s]
[INFO] Apache Hadoop Auth Examples ....................... SUCCESS [2.096s]
[INFO] Apache Hadoop Common .............................. FAILURE [16:10.612s]
[INFO] Apache Hadoop Common Project ...................... SKIPPED
[INFO] ------------------------------------------------------------------------
[INFO] BUILD FAILURE
[INFO] ------------------------------------------------------------------------
[INFO] Total time: 16:28.847s
[INFO] Finished at: Fri Jun 15 09:26:32 UTC 2012
[INFO] Final Memory: 58M/696M
[INFO] ------------------------------------------------------------------------
[ERROR] Failed to execute goal org.apache.maven.plugins:maven-surefire-plugin:2.10:test (default-test)
on project hadoop-common: There are test failures.
[ERROR] 
[ERROR] Please refer to <https://builds.apache.org/job/Hadoop-Common-0.23-Build/ws/trunk/hadoop-common-project/hadoop-common/target/surefire-reports>
for the individual test results.
[ERROR] -> [Help 1]
[ERROR] 
[ERROR] To see the full stack trace of the errors, re-run Maven with the -e switch.
[ERROR] Re-run Maven using the -X switch to enable full debug logging.
[ERROR] 
[ERROR] For more information about the errors and possible solutions, please read the following
articles:
[ERROR] [Help 1] http://cwiki.apache.org/confluence/display/MAVEN/MojoFailureException
[ERROR] 
[ERROR] After correcting the problems, you can resume the build with the command
[ERROR]   mvn <goals> -rf :hadoop-common
Build step 'Execute shell' marked build as failure
[WARNINGS] Skipping publisher since build result is FAILURE
Archiving artifacts
Recording fingerprints
Publishing Javadoc
Recording test results

Mime
View raw message