hadoop-common-dev mailing list archives

Site index · List index
Message view « Date » · « Thread »
Top « Date » · « Thread »
From Apache Jenkins Server <jenk...@builds.apache.org>
Subject Build failed in Jenkins: Hadoop-Common-trunk #426
Date Sat, 02 Jun 2012 09:05:16 GMT
See <https://builds.apache.org/job/Hadoop-Common-trunk/426/changes>

Changes:

[tucu] HADOOP-8368. Use CMake rather than autotools to build native code (ccccabe via tucu)

[atm] HDFS-3442. Incorrect count for Missing Replicas in FSCK report. Contributed by Andrew
Wang.

[bobby] MAPREDUCE-4302. NM goes down if error encountered during log aggregation (Daryn Sharp
via bobby)

[tucu] HADOOP-8466. hadoop-client POM incorrectly excludes avro. (bmahe via tucu)

[todd] Merge back changelog entries for HDFS-3042 into main CHANGES.txt files

[bobby] HADOOP-8460. Document proper setting of HADOOP_PID_DIR and HADOOP_SECURE_DN_PID_DIR
(bobby)

------------------------------------------
[...truncated 22724 lines...]
Setting project property: project.packaging -> jar
Setting project property: project.build.directory -> <https://builds.apache.org/job/Hadoop-Common-trunk/ws/trunk/hadoop-common-project/hadoop-common/target>
Setting project property: project.build.outputDirectory -> <https://builds.apache.org/job/Hadoop-Common-trunk/ws/trunk/hadoop-common-project/hadoop-common/target/classes>
Setting project property: project.build.testOutputDirectory -> <https://builds.apache.org/job/Hadoop-Common-trunk/ws/trunk/hadoop-common-project/hadoop-common/target/test-classes>
Setting project property: project.build.sourceDirectory -> <https://builds.apache.org/job/Hadoop-Common-trunk/ws/trunk/hadoop-common-project/hadoop-common/src/main/java>
Setting project property: project.build.testSourceDirectory -> <https://builds.apache.org/job/Hadoop-Common-trunk/ws/trunk/hadoop-common-project/hadoop-common/src/test/java>
Setting project property: localRepository ->        id: local
      url: file:///home/jenkins/.m2/repository/
   layout: none
Setting project property: settings.localRepository -> /home/jenkins/.m2/repository
Setting project property: org.apache.hadoop:hadoop-annotations:jar -> <https://builds.apache.org/job/Hadoop-Common-trunk/ws/trunk/hadoop-common-project/hadoop-annotations/target/hadoop-annotations-3.0.0-SNAPSHOT.jar>
Setting project property: jdiff:jdiff:jar -> /home/jenkins/.m2/repository/jdiff/jdiff/1.0.9/jdiff-1.0.9.jar
Setting project property: com.google.guava:guava:jar -> /home/jenkins/.m2/repository/com/google/guava/guava/11.0.2/guava-11.0.2.jar
Setting project property: com.google.code.findbugs:jsr305:jar -> /home/jenkins/.m2/repository/com/google/code/findbugs/jsr305/1.3.9/jsr305-1.3.9.jar
Setting project property: commons-cli:commons-cli:jar -> /home/jenkins/.m2/repository/commons-cli/commons-cli/1.2/commons-cli-1.2.jar
Setting project property: org.apache.commons:commons-math:jar -> /home/jenkins/.m2/repository/org/apache/commons/commons-math/2.1/commons-math-2.1.jar
Setting project property: xmlenc:xmlenc:jar -> /home/jenkins/.m2/repository/xmlenc/xmlenc/0.52/xmlenc-0.52.jar
Setting project property: commons-httpclient:commons-httpclient:jar -> /home/jenkins/.m2/repository/commons-httpclient/commons-httpclient/3.1/commons-httpclient-3.1.jar
Setting project property: commons-codec:commons-codec:jar -> /home/jenkins/.m2/repository/commons-codec/commons-codec/1.4/commons-codec-1.4.jar
Setting project property: commons-net:commons-net:jar -> /home/jenkins/.m2/repository/commons-net/commons-net/3.1/commons-net-3.1.jar
Setting project property: commons-io:commons-io:jar -> /home/jenkins/.m2/repository/commons-io/commons-io/2.1/commons-io-2.1.jar
Setting project property: javax.servlet:servlet-api:jar -> /home/jenkins/.m2/repository/javax/servlet/servlet-api/2.5/servlet-api-2.5.jar
Setting project property: org.mortbay.jetty:jetty:jar -> /home/jenkins/.m2/repository/org/mortbay/jetty/jetty/6.1.26/jetty-6.1.26.jar
Setting project property: org.mortbay.jetty:jetty-util:jar -> /home/jenkins/.m2/repository/org/mortbay/jetty/jetty-util/6.1.26/jetty-util-6.1.26.jar
Setting project property: asm:asm:jar -> /home/jenkins/.m2/repository/asm/asm/3.2/asm-3.2.jar
Setting project property: com.sun.jersey:jersey-core:jar -> /home/jenkins/.m2/repository/com/sun/jersey/jersey-core/1.8/jersey-core-1.8.jar
Setting project property: com.sun.jersey:jersey-json:jar -> /home/jenkins/.m2/repository/com/sun/jersey/jersey-json/1.8/jersey-json-1.8.jar
Setting project property: org.codehaus.jettison:jettison:jar -> /home/jenkins/.m2/repository/org/codehaus/jettison/jettison/1.1/jettison-1.1.jar
Setting project property: stax:stax-api:jar -> /home/jenkins/.m2/repository/stax/stax-api/1.0.1/stax-api-1.0.1.jar
Setting project property: com.sun.xml.bind:jaxb-impl:jar -> /home/jenkins/.m2/repository/com/sun/xml/bind/jaxb-impl/2.2.3-1/jaxb-impl-2.2.3-1.jar
Setting project property: javax.xml.bind:jaxb-api:jar -> /home/jenkins/.m2/repository/javax/xml/bind/jaxb-api/2.2.2/jaxb-api-2.2.2.jar
Setting project property: javax.activation:activation:jar -> /home/jenkins/.m2/repository/javax/activation/activation/1.1/activation-1.1.jar
Setting project property: org.codehaus.jackson:jackson-core-asl:jar -> /home/jenkins/.m2/repository/org/codehaus/jackson/jackson-core-asl/1.8.8/jackson-core-asl-1.8.8.jar
Setting project property: org.codehaus.jackson:jackson-jaxrs:jar -> /home/jenkins/.m2/repository/org/codehaus/jackson/jackson-jaxrs/1.8.8/jackson-jaxrs-1.8.8.jar
Setting project property: org.codehaus.jackson:jackson-xc:jar -> /home/jenkins/.m2/repository/org/codehaus/jackson/jackson-xc/1.8.8/jackson-xc-1.8.8.jar
Setting project property: com.sun.jersey:jersey-server:jar -> /home/jenkins/.m2/repository/com/sun/jersey/jersey-server/1.8/jersey-server-1.8.jar
Setting project property: tomcat:jasper-compiler:jar -> /home/jenkins/.m2/repository/tomcat/jasper-compiler/5.5.23/jasper-compiler-5.5.23.jar
Setting project property: tomcat:jasper-runtime:jar -> /home/jenkins/.m2/repository/tomcat/jasper-runtime/5.5.23/jasper-runtime-5.5.23.jar
Setting project property: javax.servlet.jsp:jsp-api:jar -> /home/jenkins/.m2/repository/javax/servlet/jsp/jsp-api/2.1/jsp-api-2.1.jar
Setting project property: commons-el:commons-el:jar -> /home/jenkins/.m2/repository/commons-el/commons-el/1.0/commons-el-1.0.jar
Setting project property: commons-logging:commons-logging:jar -> /home/jenkins/.m2/repository/commons-logging/commons-logging/1.1.1/commons-logging-1.1.1.jar
Setting project property: commons-logging:commons-logging-api:jar -> /home/jenkins/.m2/repository/commons-logging/commons-logging-api/1.1/commons-logging-api-1.1.jar
Setting project property: log4j:log4j:jar -> /home/jenkins/.m2/repository/log4j/log4j/1.2.15/log4j-1.2.15.jar
Setting project property: net.java.dev.jets3t:jets3t:jar -> /home/jenkins/.m2/repository/net/java/dev/jets3t/jets3t/0.6.1/jets3t-0.6.1.jar
Setting project property: org.apache.mina:mina-core:jar -> /home/jenkins/.m2/repository/org/apache/mina/mina-core/2.0.0-M5/mina-core-2.0.0-M5.jar
Setting project property: org.apache.ftpserver:ftplet-api:jar -> /home/jenkins/.m2/repository/org/apache/ftpserver/ftplet-api/1.0.0/ftplet-api-1.0.0.jar
Setting project property: org.apache.ftpserver:ftpserver-core:jar -> /home/jenkins/.m2/repository/org/apache/ftpserver/ftpserver-core/1.0.0/ftpserver-core-1.0.0.jar
Setting project property: org.apache.ftpserver:ftpserver-deprecated:jar -> /home/jenkins/.m2/repository/org/apache/ftpserver/ftpserver-deprecated/1.0.0-M2/ftpserver-deprecated-1.0.0-M2.jar
Setting project property: junit:junit:jar -> /home/jenkins/.m2/repository/junit/junit/4.8.2/junit-4.8.2.jar
Setting project property: commons-lang:commons-lang:jar -> /home/jenkins/.m2/repository/commons-lang/commons-lang/2.5/commons-lang-2.5.jar
Setting project property: commons-collections:commons-collections:jar -> /home/jenkins/.m2/repository/commons-collections/commons-collections/3.2.1/commons-collections-3.2.1.jar
Setting project property: commons-configuration:commons-configuration:jar -> /home/jenkins/.m2/repository/commons-configuration/commons-configuration/1.6/commons-configuration-1.6.jar
Setting project property: commons-digester:commons-digester:jar -> /home/jenkins/.m2/repository/commons-digester/commons-digester/1.8/commons-digester-1.8.jar
Setting project property: commons-beanutils:commons-beanutils:jar -> /home/jenkins/.m2/repository/commons-beanutils/commons-beanutils/1.7.0/commons-beanutils-1.7.0.jar
Setting project property: commons-beanutils:commons-beanutils-core:jar -> /home/jenkins/.m2/repository/commons-beanutils/commons-beanutils-core/1.8.0/commons-beanutils-core-1.8.0.jar
Setting project property: org.slf4j:slf4j-api:jar -> /home/jenkins/.m2/repository/org/slf4j/slf4j-api/1.6.1/slf4j-api-1.6.1.jar
Setting project property: org.slf4j:slf4j-log4j12:jar -> /home/jenkins/.m2/repository/org/slf4j/slf4j-log4j12/1.6.1/slf4j-log4j12-1.6.1.jar
Setting project property: org.eclipse.jdt:core:jar -> /home/jenkins/.m2/repository/org/eclipse/jdt/core/3.1.1/core-3.1.1.jar
Setting project property: oro:oro:jar -> /home/jenkins/.m2/repository/oro/oro/2.0.8/oro-2.0.8.jar
Setting project property: org.codehaus.jackson:jackson-mapper-asl:jar -> /home/jenkins/.m2/repository/org/codehaus/jackson/jackson-mapper-asl/1.8.8/jackson-mapper-asl-1.8.8.jar
Setting project property: org.aspectj:aspectjrt:jar -> /home/jenkins/.m2/repository/org/aspectj/aspectjrt/1.6.5/aspectjrt-1.6.5.jar
Setting project property: org.mockito:mockito-all:jar -> /home/jenkins/.m2/repository/org/mockito/mockito-all/1.8.5/mockito-all-1.8.5.jar
Setting project property: org.apache.avro:avro:jar -> /home/jenkins/.m2/repository/org/apache/avro/avro/1.5.3/avro-1.5.3.jar
Setting project property: com.thoughtworks.paranamer:paranamer:jar -> /home/jenkins/.m2/repository/com/thoughtworks/paranamer/paranamer/2.3/paranamer-2.3.jar
Setting project property: org.xerial.snappy:snappy-java:jar -> /home/jenkins/.m2/repository/org/xerial/snappy/snappy-java/1.0.3.2/snappy-java-1.0.3.2.jar
Setting project property: net.sf.kosmosfs:kfs:jar -> /home/jenkins/.m2/repository/net/sf/kosmosfs/kfs/0.3/kfs-0.3.jar
Setting project property: org.apache.ant:ant:jar -> /home/jenkins/.m2/repository/org/apache/ant/ant/1.8.1/ant-1.8.1.jar
Setting project property: org.apache.ant:ant-launcher:jar -> /home/jenkins/.m2/repository/org/apache/ant/ant-launcher/1.8.1/ant-launcher-1.8.1.jar
Setting project property: com.google.protobuf:protobuf-java:jar -> /home/jenkins/.m2/repository/com/google/protobuf/protobuf-java/2.4.0a/protobuf-java-2.4.0a.jar
Setting project property: org.apache.hadoop:hadoop-auth:jar -> <https://builds.apache.org/job/Hadoop-Common-trunk/ws/trunk/hadoop-common-project/hadoop-auth/target/hadoop-auth-3.0.0-SNAPSHOT.jar>
Setting project property: com.googlecode.json-simple:json-simple:jar -> /home/jenkins/.m2/repository/com/googlecode/json-simple/json-simple/1.1/json-simple-1.1.jar
Setting project property: com.jcraft:jsch:jar -> /home/jenkins/.m2/repository/com/jcraft/jsch/0.1.42/jsch-0.1.42.jar
Setting project property: org.apache.zookeeper:zookeeper:jar -> /home/jenkins/.m2/repository/org/apache/zookeeper/zookeeper/3.4.2/zookeeper-3.4.2.jar
Setting project property: jline:jline:jar -> /home/jenkins/.m2/repository/jline/jline/0.9.94/jline-0.9.94.jar
Setting project property: org.jboss.netty:netty:jar -> /home/jenkins/.m2/repository/org/jboss/netty/netty/3.2.3.Final/netty-3.2.3.Final.jar
Setting project property: org.apache.zookeeper:zookeeper:test-jar:tests -> /home/jenkins/.m2/repository/org/apache/zookeeper/zookeeper/3.4.2/zookeeper-3.4.2-tests.jar
Setting project property: jdk.tools:jdk.tools:jar -> /home/jenkins/tools/java/jdk1.6.0_26/jre/../lib/tools.jar
Setting project property: maven.project.dependencies.versions -> 3.0.0-SNAPSHOT:1.0.9:11.0.2:1.3.9:1.2:2.1:0.52:3.1:1.4:3.1:2.1:2.5:6.1.26:6.1.26:3.2:1.8:1.8:1.1:1.0.1:2.2.3-1:2.2.2:1.1:1.8.8:1.8.8:1.8.8:1.8:5.5.23:5.5.23:2.1:1.0:1.1.1:1.1:1.2.15:0.6.1:2.0.0-M5:1.0.0:1.0.0:1.0.0-M2:4.8.2:2.5:3.2.1:1.6:1.8:1.7.0:1.8.0:1.6.1:1.6.1:3.1.1:2.0.8:1.8.8:1.6.5:1.8.5:1.5.3:2.3:1.0.3.2:0.3:1.8.1:1.8.1:2.4.0a:3.0.0-SNAPSHOT:1.1:0.1.42:3.4.2:0.9.94:3.2.3.Final:3.4.2:1.6:
Setting project property: maven.dependency.org.apache.hadoop.hadoop-annotations.jar.path ->
<https://builds.apache.org/job/Hadoop-Common-trunk/ws/trunk/hadoop-common-project/hadoop-annotations/target/hadoop-annotations-3.0.0-SNAPSHOT.jar>
Setting project property: maven.dependency.jdiff.jdiff.jar.path -> /home/jenkins/.m2/repository/jdiff/jdiff/1.0.9/jdiff-1.0.9.jar
Setting project property: maven.dependency.com.google.guava.guava.jar.path -> /home/jenkins/.m2/repository/com/google/guava/guava/11.0.2/guava-11.0.2.jar
Setting project property: maven.dependency.com.google.code.findbugs.jsr305.jar.path ->
/home/jenkins/.m2/repository/com/google/code/findbugs/jsr305/1.3.9/jsr305-1.3.9.jar
Setting project property: maven.dependency.commons-cli.commons-cli.jar.path -> /home/jenkins/.m2/repository/commons-cli/commons-cli/1.2/commons-cli-1.2.jar
Setting project property: maven.dependency.org.apache.commons.commons-math.jar.path ->
/home/jenkins/.m2/repository/org/apache/commons/commons-math/2.1/commons-math-2.1.jar
Setting project property: maven.dependency.xmlenc.xmlenc.jar.path -> /home/jenkins/.m2/repository/xmlenc/xmlenc/0.52/xmlenc-0.52.jar
Setting project property: maven.dependency.commons-httpclient.commons-httpclient.jar.path
-> /home/jenkins/.m2/repository/commons-httpclient/commons-httpclient/3.1/commons-httpclient-3.1.jar
Setting project property: maven.dependency.commons-codec.commons-codec.jar.path -> /home/jenkins/.m2/repository/commons-codec/commons-codec/1.4/commons-codec-1.4.jar
Setting project property: maven.dependency.commons-net.commons-net.jar.path -> /home/jenkins/.m2/repository/commons-net/commons-net/3.1/commons-net-3.1.jar
Setting project property: maven.dependency.commons-io.commons-io.jar.path -> /home/jenkins/.m2/repository/commons-io/commons-io/2.1/commons-io-2.1.jar
Setting project property: maven.dependency.javax.servlet.servlet-api.jar.path -> /home/jenkins/.m2/repository/javax/servlet/servlet-api/2.5/servlet-api-2.5.jar
Setting project property: maven.dependency.org.mortbay.jetty.jetty.jar.path -> /home/jenkins/.m2/repository/org/mortbay/jetty/jetty/6.1.26/jetty-6.1.26.jar
Setting project property: maven.dependency.org.mortbay.jetty.jetty-util.jar.path -> /home/jenkins/.m2/repository/org/mortbay/jetty/jetty-util/6.1.26/jetty-util-6.1.26.jar
Setting project property: maven.dependency.asm.asm.jar.path -> /home/jenkins/.m2/repository/asm/asm/3.2/asm-3.2.jar
Setting project property: maven.dependency.com.sun.jersey.jersey-core.jar.path -> /home/jenkins/.m2/repository/com/sun/jersey/jersey-core/1.8/jersey-core-1.8.jar
Setting project property: maven.dependency.com.sun.jersey.jersey-json.jar.path -> /home/jenkins/.m2/repository/com/sun/jersey/jersey-json/1.8/jersey-json-1.8.jar
Setting project property: maven.dependency.org.codehaus.jettison.jettison.jar.path -> /home/jenkins/.m2/repository/org/codehaus/jettison/jettison/1.1/jettison-1.1.jar
Setting project property: maven.dependency.stax.stax-api.jar.path -> /home/jenkins/.m2/repository/stax/stax-api/1.0.1/stax-api-1.0.1.jar
Setting project property: maven.dependency.com.sun.xml.bind.jaxb-impl.jar.path -> /home/jenkins/.m2/repository/com/sun/xml/bind/jaxb-impl/2.2.3-1/jaxb-impl-2.2.3-1.jar
Setting project property: maven.dependency.javax.xml.bind.jaxb-api.jar.path -> /home/jenkins/.m2/repository/javax/xml/bind/jaxb-api/2.2.2/jaxb-api-2.2.2.jar
Setting project property: maven.dependency.javax.activation.activation.jar.path -> /home/jenkins/.m2/repository/javax/activation/activation/1.1/activation-1.1.jar
Setting project property: maven.dependency.org.codehaus.jackson.jackson-core-asl.jar.path
-> /home/jenkins/.m2/repository/org/codehaus/jackson/jackson-core-asl/1.8.8/jackson-core-asl-1.8.8.jar
Setting project property: maven.dependency.org.codehaus.jackson.jackson-jaxrs.jar.path ->
/home/jenkins/.m2/repository/org/codehaus/jackson/jackson-jaxrs/1.8.8/jackson-jaxrs-1.8.8.jar
Setting project property: maven.dependency.org.codehaus.jackson.jackson-xc.jar.path ->
/home/jenkins/.m2/repository/org/codehaus/jackson/jackson-xc/1.8.8/jackson-xc-1.8.8.jar
Setting project property: maven.dependency.com.sun.jersey.jersey-server.jar.path -> /home/jenkins/.m2/repository/com/sun/jersey/jersey-server/1.8/jersey-server-1.8.jar
Setting project property: maven.dependency.tomcat.jasper-compiler.jar.path -> /home/jenkins/.m2/repository/tomcat/jasper-compiler/5.5.23/jasper-compiler-5.5.23.jar
Setting project property: maven.dependency.tomcat.jasper-runtime.jar.path -> /home/jenkins/.m2/repository/tomcat/jasper-runtime/5.5.23/jasper-runtime-5.5.23.jar
Setting project property: maven.dependency.javax.servlet.jsp.jsp-api.jar.path -> /home/jenkins/.m2/repository/javax/servlet/jsp/jsp-api/2.1/jsp-api-2.1.jar
Setting project property: maven.dependency.commons-el.commons-el.jar.path -> /home/jenkins/.m2/repository/commons-el/commons-el/1.0/commons-el-1.0.jar
Setting project property: maven.dependency.commons-logging.commons-logging.jar.path ->
/home/jenkins/.m2/repository/commons-logging/commons-logging/1.1.1/commons-logging-1.1.1.jar
Setting project property: maven.dependency.commons-logging.commons-logging-api.jar.path ->
/home/jenkins/.m2/repository/commons-logging/commons-logging-api/1.1/commons-logging-api-1.1.jar
Setting project property: maven.dependency.log4j.log4j.jar.path -> /home/jenkins/.m2/repository/log4j/log4j/1.2.15/log4j-1.2.15.jar
Setting project property: maven.dependency.net.java.dev.jets3t.jets3t.jar.path -> /home/jenkins/.m2/repository/net/java/dev/jets3t/jets3t/0.6.1/jets3t-0.6.1.jar
Setting project property: maven.dependency.org.apache.mina.mina-core.jar.path -> /home/jenkins/.m2/repository/org/apache/mina/mina-core/2.0.0-M5/mina-core-2.0.0-M5.jar
Setting project property: maven.dependency.org.apache.ftpserver.ftplet-api.jar.path ->
/home/jenkins/.m2/repository/org/apache/ftpserver/ftplet-api/1.0.0/ftplet-api-1.0.0.jar
Setting project property: maven.dependency.org.apache.ftpserver.ftpserver-core.jar.path ->
/home/jenkins/.m2/repository/org/apache/ftpserver/ftpserver-core/1.0.0/ftpserver-core-1.0.0.jar
Setting project property: maven.dependency.org.apache.ftpserver.ftpserver-deprecated.jar.path
-> /home/jenkins/.m2/repository/org/apache/ftpserver/ftpserver-deprecated/1.0.0-M2/ftpserver-deprecated-1.0.0-M2.jar
Setting project property: maven.dependency.junit.junit.jar.path -> /home/jenkins/.m2/repository/junit/junit/4.8.2/junit-4.8.2.jar
Setting project property: maven.dependency.commons-lang.commons-lang.jar.path -> /home/jenkins/.m2/repository/commons-lang/commons-lang/2.5/commons-lang-2.5.jar
Setting project property: maven.dependency.commons-collections.commons-collections.jar.path
-> /home/jenkins/.m2/repository/commons-collections/commons-collections/3.2.1/commons-collections-3.2.1.jar
Setting project property: maven.dependency.commons-configuration.commons-configuration.jar.path
-> /home/jenkins/.m2/repository/commons-configuration/commons-configuration/1.6/commons-configuration-1.6.jar
Setting project property: maven.dependency.commons-digester.commons-digester.jar.path ->
/home/jenkins/.m2/repository/commons-digester/commons-digester/1.8/commons-digester-1.8.jar
Setting project property: maven.dependency.commons-beanutils.commons-beanutils.jar.path ->
/home/jenkins/.m2/repository/commons-beanutils/commons-beanutils/1.7.0/commons-beanutils-1.7.0.jar
Setting project property: maven.dependency.commons-beanutils.commons-beanutils-core.jar.path
-> /home/jenkins/.m2/repository/commons-beanutils/commons-beanutils-core/1.8.0/commons-beanutils-core-1.8.0.jar
Setting project property: maven.dependency.org.slf4j.slf4j-api.jar.path -> /home/jenkins/.m2/repository/org/slf4j/slf4j-api/1.6.1/slf4j-api-1.6.1.jar
Setting project property: maven.dependency.org.slf4j.slf4j-log4j12.jar.path -> /home/jenkins/.m2/repository/org/slf4j/slf4j-log4j12/1.6.1/slf4j-log4j12-1.6.1.jar
Setting project property: maven.dependency.org.eclipse.jdt.core.jar.path -> /home/jenkins/.m2/repository/org/eclipse/jdt/core/3.1.1/core-3.1.1.jar
Setting project property: maven.dependency.oro.oro.jar.path -> /home/jenkins/.m2/repository/oro/oro/2.0.8/oro-2.0.8.jar
Setting project property: maven.dependency.org.codehaus.jackson.jackson-mapper-asl.jar.path
-> /home/jenkins/.m2/repository/org/codehaus/jackson/jackson-mapper-asl/1.8.8/jackson-mapper-asl-1.8.8.jar
Setting project property: maven.dependency.org.aspectj.aspectjrt.jar.path -> /home/jenkins/.m2/repository/org/aspectj/aspectjrt/1.6.5/aspectjrt-1.6.5.jar
Setting project property: maven.dependency.org.mockito.mockito-all.jar.path -> /home/jenkins/.m2/repository/org/mockito/mockito-all/1.8.5/mockito-all-1.8.5.jar
Setting project property: maven.dependency.org.apache.avro.avro.jar.path -> /home/jenkins/.m2/repository/org/apache/avro/avro/1.5.3/avro-1.5.3.jar
Setting project property: maven.dependency.com.thoughtworks.paranamer.paranamer.jar.path ->
/home/jenkins/.m2/repository/com/thoughtworks/paranamer/paranamer/2.3/paranamer-2.3.jar
Setting project property: maven.dependency.org.xerial.snappy.snappy-java.jar.path -> /home/jenkins/.m2/repository/org/xerial/snappy/snappy-java/1.0.3.2/snappy-java-1.0.3.2.jar
Setting project property: maven.dependency.net.sf.kosmosfs.kfs.jar.path -> /home/jenkins/.m2/repository/net/sf/kosmosfs/kfs/0.3/kfs-0.3.jar
Setting project property: maven.dependency.org.apache.ant.ant.jar.path -> /home/jenkins/.m2/repository/org/apache/ant/ant/1.8.1/ant-1.8.1.jar
Setting project property: maven.dependency.org.apache.ant.ant-launcher.jar.path -> /home/jenkins/.m2/repository/org/apache/ant/ant-launcher/1.8.1/ant-launcher-1.8.1.jar
Setting project property: maven.dependency.com.google.protobuf.protobuf-java.jar.path ->
/home/jenkins/.m2/repository/com/google/protobuf/protobuf-java/2.4.0a/protobuf-java-2.4.0a.jar
Setting project property: maven.dependency.org.apache.hadoop.hadoop-auth.jar.path -> <https://builds.apache.org/job/Hadoop-Common-trunk/ws/trunk/hadoop-common-project/hadoop-auth/target/hadoop-auth-3.0.0-SNAPSHOT.jar>
Setting project property: maven.dependency.com.googlecode.json-simple.json-simple.jar.path
-> /home/jenkins/.m2/repository/com/googlecode/json-simple/json-simple/1.1/json-simple-1.1.jar
Setting project property: maven.dependency.com.jcraft.jsch.jar.path -> /home/jenkins/.m2/repository/com/jcraft/jsch/0.1.42/jsch-0.1.42.jar
Setting project property: maven.dependency.org.apache.zookeeper.zookeeper.jar.path -> /home/jenkins/.m2/repository/org/apache/zookeeper/zookeeper/3.4.2/zookeeper-3.4.2.jar
Setting project property: maven.dependency.jline.jline.jar.path -> /home/jenkins/.m2/repository/jline/jline/0.9.94/jline-0.9.94.jar
Setting project property: maven.dependency.org.jboss.netty.netty.jar.path -> /home/jenkins/.m2/repository/org/jboss/netty/netty/3.2.3.Final/netty-3.2.3.Final.jar
Setting project property: maven.dependency.org.apache.zookeeper.zookeeper.tests.test-jar.path
-> /home/jenkins/.m2/repository/org/apache/zookeeper/zookeeper/3.4.2/zookeeper-3.4.2-tests.jar
Setting project property: maven.dependency.jdk.tools.jdk.tools.jar.path -> /home/jenkins/tools/java/jdk1.6.0_26/jre/../lib/tools.jar
[INFO] Executing tasks
Build sequence for target(s) `main' is [main]
Complete build sequence is [main, ]

main:
     [exec] Current OS is Linux
     [exec] Setting environment variable: CFLAGS=-I/usr/local/include
     [exec] Setting environment variable: LDFLAGS=-L/usr/local/lib
     [exec] Executing 'cmake' with arguments:
     [exec] '<https://builds.apache.org/job/Hadoop-Common-trunk/ws/trunk/hadoop-common-project/hadoop-common/src/'>
     [exec] '-DGENERATED_JAVAH=<https://builds.apache.org/job/Hadoop-Common-trunk/ws/trunk/hadoop-common-project/hadoop-common/target/native/javah'>
     [exec] '-DHADOOP_RUNAS_HOME='
     [exec] '-DJVM_ARCH_DATA_MODEL=32'
     [exec] 
     [exec] The ' characters around the executable and arguments are
     [exec] not part of the command.
Execute:Java13CommandLauncher: Executing 'cmake' with arguments:
'<https://builds.apache.org/job/Hadoop-Common-trunk/ws/trunk/hadoop-common-project/hadoop-common/src/'>
'-DGENERATED_JAVAH=<https://builds.apache.org/job/Hadoop-Common-trunk/ws/trunk/hadoop-common-project/hadoop-common/target/native/javah'>
'-DHADOOP_RUNAS_HOME='
'-DJVM_ARCH_DATA_MODEL=32'

The ' characters around the executable and arguments are
not part of the command.
[INFO] ------------------------------------------------------------------------
[INFO] Reactor Summary:
[INFO] 
[INFO] Apache Hadoop Annotations ......................... SUCCESS [12.097s]
[INFO] Apache Hadoop Auth ................................ SUCCESS [18.846s]
[INFO] Apache Hadoop Auth Examples ....................... SUCCESS [7.448s]
[INFO] Apache Hadoop Common .............................. FAILURE [11.143s]
[INFO] Apache Hadoop Common Project ...................... SKIPPED
[INFO] ------------------------------------------------------------------------
[INFO] BUILD FAILURE
[INFO] ------------------------------------------------------------------------
[INFO] Total time: 50.624s
[INFO] Finished at: Sat Jun 02 09:05:15 UTC 2012
[INFO] Final Memory: 66M/538M
[INFO] ------------------------------------------------------------------------
[ERROR] Failed to execute goal org.apache.maven.plugins:maven-antrun-plugin:1.6:run (make)
on project hadoop-common: An Ant BuildException has occured: Execute failed: java.io.IOException:
Cannot run program "cmake" (in directory "<https://builds.apache.org/job/Hadoop-Common-trunk/ws/trunk/hadoop-common-project/hadoop-common/target/native")>:
java.io.IOException: error=2, No such file or directory -> [Help 1]
org.apache.maven.lifecycle.LifecycleExecutionException: Failed to execute goal org.apache.maven.plugins:maven-antrun-plugin:1.6:run
(make) on project hadoop-common: An Ant BuildException has occured: Execute failed: java.io.IOException:
Cannot run program "cmake" (in directory "<https://builds.apache.org/job/Hadoop-Common-trunk/ws/trunk/hadoop-common-project/hadoop-common/target/native")>:
java.io.IOException: error=2, No such file or directory
	at org.apache.maven.lifecycle.internal.MojoExecutor.execute(MojoExecutor.java:217)
	at org.apache.maven.lifecycle.internal.MojoExecutor.execute(MojoExecutor.java:153)
	at org.apache.maven.lifecycle.internal.MojoExecutor.execute(MojoExecutor.java:145)
	at org.apache.maven.lifecycle.internal.LifecycleModuleBuilder.buildProject(LifecycleModuleBuilder.java:84)
	at org.apache.maven.lifecycle.internal.LifecycleModuleBuilder.buildProject(LifecycleModuleBuilder.java:59)
	at org.apache.maven.lifecycle.internal.LifecycleStarter.singleThreadedBuild(LifecycleStarter.java:183)
	at org.apache.maven.lifecycle.internal.LifecycleStarter.execute(LifecycleStarter.java:161)
	at org.apache.maven.DefaultMaven.doExecute(DefaultMaven.java:319)
	at org.apache.maven.DefaultMaven.execute(DefaultMaven.java:156)
	at org.apache.maven.cli.MavenCli.execute(MavenCli.java:537)
	at org.apache.maven.cli.MavenCli.doMain(MavenCli.java:196)
	at org.apache.maven.cli.MavenCli.main(MavenCli.java:141)
	at sun.reflect.NativeMethodAccessorImpl.invoke0(Native Method)
	at sun.reflect.NativeMethodAccessorImpl.invoke(NativeMethodAccessorImpl.java:39)
	at sun.reflect.DelegatingMethodAccessorImpl.invoke(DelegatingMethodAccessorImpl.java:25)
	at java.lang.reflect.Method.invoke(Method.java:597)
	at org.codehaus.plexus.classworlds.launcher.Launcher.launchEnhanced(Launcher.java:290)
	at org.codehaus.plexus.classworlds.launcher.Launcher.launch(Launcher.java:230)
	at org.codehaus.plexus.classworlds.launcher.Launcher.mainWithExitCode(Launcher.java:409)
	at org.codehaus.plexus.classworlds.launcher.Launcher.main(Launcher.java:352)
Caused by: org.apache.maven.plugin.MojoExecutionException: An Ant BuildException has occured:
Execute failed: java.io.IOException: Cannot run program "cmake" (in directory "<https://builds.apache.org/job/Hadoop-Common-trunk/ws/trunk/hadoop-common-project/hadoop-common/target/native")>:
java.io.IOException: error=2, No such file or directory
	at org.apache.maven.plugin.antrun.AntRunMojo.execute(AntRunMojo.java:283)
	at org.apache.maven.plugin.DefaultBuildPluginManager.executeMojo(DefaultBuildPluginManager.java:101)
	at org.apache.maven.lifecycle.internal.MojoExecutor.execute(MojoExecutor.java:209)
	... 19 more
Caused by: <https://builds.apache.org/job/Hadoop-Common-trunk/ws/trunk/hadoop-common-project/hadoop-common/target/antrun/build-main.xml>:4:
Execute failed: java.io.IOException: Cannot run program "cmake" (in directory "<https://builds.apache.org/job/Hadoop-Common-trunk/ws/trunk/hadoop-common-project/hadoop-common/target/native")>:
java.io.IOException: error=2, No such file or directory
	at org.apache.tools.ant.taskdefs.ExecTask.runExec(ExecTask.java:679)
	at org.apache.tools.ant.taskdefs.ExecTask.execute(ExecTask.java:502)
	at org.apache.tools.ant.UnknownElement.execute(UnknownElement.java:291)
	at sun.reflect.GeneratedMethodAccessor123.invoke(Unknown Source)
	at sun.reflect.DelegatingMethodAccessorImpl.invoke(DelegatingMethodAccessorImpl.java:25)
	at java.lang.reflect.Method.invoke(Method.java:597)
	at org.apache.tools.ant.dispatch.DispatchUtils.execute(DispatchUtils.java:106)
	at org.apache.tools.ant.Task.perform(Task.java:348)
	at org.apache.tools.ant.Target.execute(Target.java:390)
	at org.apache.tools.ant.Target.performTasks(Target.java:411)
	at org.apache.tools.ant.Project.executeSortedTargets(Project.java:1397)
	at org.apache.tools.ant.Project.executeTarget(Project.java:1366)
	at org.apache.maven.plugin.antrun.AntRunMojo.execute(AntRunMojo.java:270)
	... 21 more
Caused by: java.io.IOException: Cannot run program "cmake" (in directory "<https://builds.apache.org/job/Hadoop-Common-trunk/ws/trunk/hadoop-common-project/hadoop-common/target/native")>:
java.io.IOException: error=2, No such file or directory
	at java.lang.ProcessBuilder.start(ProcessBuilder.java:460)
	at java.lang.Runtime.exec(Runtime.java:593)
	at org.apache.tools.ant.taskdefs.Execute$Java13CommandLauncher.exec(Execute.java:827)
	at org.apache.tools.ant.taskdefs.Execute.launch(Execute.java:445)
	at org.apache.tools.ant.taskdefs.Execute.execute(Execute.java:459)
	at org.apache.tools.ant.taskdefs.ExecTask.runExecute(ExecTask.java:635)
	at org.apache.tools.ant.taskdefs.ExecTask.runExec(ExecTask.java:676)
	... 33 more
Caused by: java.io.IOException: java.io.IOException: error=2, No such file or directory
	at java.lang.UNIXProcess.<init>(UNIXProcess.java:148)
	at java.lang.ProcessImpl.start(ProcessImpl.java:65)
	at java.lang.ProcessBuilder.start(ProcessBuilder.java:453)
	... 39 more
[ERROR] 
[ERROR] 
[ERROR] For more information about the errors and possible solutions, please read the following
articles:
[ERROR] [Help 1] http://cwiki.apache.org/confluence/display/MAVEN/MojoExecutionException
[ERROR] 
[ERROR] After correcting the problems, you can resume the build with the command
[ERROR]   mvn <goals> -rf :hadoop-common
Build step 'Execute shell' marked build as failure
Archiving artifacts

Mime
View raw message