hadoop-common-dev mailing list archives

Site index · List index
Message view « Date » · « Thread »
Top « Date » · « Thread »
From Apache Jenkins Server <jenk...@builds.apache.org>
Subject Build failed in Jenkins: Hadoop-Common-trunk #433
Date Thu, 07 Jun 2012 09:05:32 GMT
See <https://builds.apache.org/job/Hadoop-Common-trunk/433/changes>

Changes:

[todd] HDFS-3492. Fix some misuses of InputStream#skip. Contributed by Colin Patrick McCabe.

[vinodkv] Fixing CHANGES.txt to refer to branch-2 instead of (an unreleased, not-yet-decided)
release.

[eli] HADOOP-8485. Don't hardcode "Apache Hadoop 0.23" in the docs. Contributed by Eli Collins

[eli] HDFS-3505. DirectoryScanner does not join all threads in shutdown. Contributed by Colin
Patrick McCabe

[tucu] svn merge -c -1346491 for re-committing HADOOP-8368. (tucu)

------------------------------------------
[...truncated 23044 lines...]
Setting project property: maven.dependency.org.codehaus.jettison.jettison.jar.path -> /home/jenkins/.m2/repository/org/codehaus/jettison/jettison/1.1/jettison-1.1.jar
Setting project property: maven.dependency.stax.stax-api.jar.path -> /home/jenkins/.m2/repository/stax/stax-api/1.0.1/stax-api-1.0.1.jar
Setting project property: maven.dependency.com.sun.xml.bind.jaxb-impl.jar.path -> /home/jenkins/.m2/repository/com/sun/xml/bind/jaxb-impl/2.2.3-1/jaxb-impl-2.2.3-1.jar
Setting project property: maven.dependency.javax.xml.bind.jaxb-api.jar.path -> /home/jenkins/.m2/repository/javax/xml/bind/jaxb-api/2.2.2/jaxb-api-2.2.2.jar
Setting project property: maven.dependency.javax.activation.activation.jar.path -> /home/jenkins/.m2/repository/javax/activation/activation/1.1/activation-1.1.jar
Setting project property: maven.dependency.org.codehaus.jackson.jackson-core-asl.jar.path
-> /home/jenkins/.m2/repository/org/codehaus/jackson/jackson-core-asl/1.8.8/jackson-core-asl-1.8.8.jar
Setting project property: maven.dependency.org.codehaus.jackson.jackson-jaxrs.jar.path ->
/home/jenkins/.m2/repository/org/codehaus/jackson/jackson-jaxrs/1.8.8/jackson-jaxrs-1.8.8.jar
Setting project property: maven.dependency.org.codehaus.jackson.jackson-xc.jar.path ->
/home/jenkins/.m2/repository/org/codehaus/jackson/jackson-xc/1.8.8/jackson-xc-1.8.8.jar
Setting project property: maven.dependency.com.sun.jersey.jersey-server.jar.path -> /home/jenkins/.m2/repository/com/sun/jersey/jersey-server/1.8/jersey-server-1.8.jar
Setting project property: maven.dependency.tomcat.jasper-compiler.jar.path -> /home/jenkins/.m2/repository/tomcat/jasper-compiler/5.5.23/jasper-compiler-5.5.23.jar
Setting project property: maven.dependency.tomcat.jasper-runtime.jar.path -> /home/jenkins/.m2/repository/tomcat/jasper-runtime/5.5.23/jasper-runtime-5.5.23.jar
Setting project property: maven.dependency.javax.servlet.jsp.jsp-api.jar.path -> /home/jenkins/.m2/repository/javax/servlet/jsp/jsp-api/2.1/jsp-api-2.1.jar
Setting project property: maven.dependency.commons-el.commons-el.jar.path -> /home/jenkins/.m2/repository/commons-el/commons-el/1.0/commons-el-1.0.jar
Setting project property: maven.dependency.commons-logging.commons-logging.jar.path ->
/home/jenkins/.m2/repository/commons-logging/commons-logging/1.1.1/commons-logging-1.1.1.jar
Setting project property: maven.dependency.commons-logging.commons-logging-api.jar.path ->
/home/jenkins/.m2/repository/commons-logging/commons-logging-api/1.1/commons-logging-api-1.1.jar
Setting project property: maven.dependency.log4j.log4j.jar.path -> /home/jenkins/.m2/repository/log4j/log4j/1.2.15/log4j-1.2.15.jar
Setting project property: maven.dependency.net.java.dev.jets3t.jets3t.jar.path -> /home/jenkins/.m2/repository/net/java/dev/jets3t/jets3t/0.6.1/jets3t-0.6.1.jar
Setting project property: maven.dependency.org.apache.mina.mina-core.jar.path -> /home/jenkins/.m2/repository/org/apache/mina/mina-core/2.0.0-M5/mina-core-2.0.0-M5.jar
Setting project property: maven.dependency.org.apache.ftpserver.ftplet-api.jar.path ->
/home/jenkins/.m2/repository/org/apache/ftpserver/ftplet-api/1.0.0/ftplet-api-1.0.0.jar
Setting project property: maven.dependency.org.apache.ftpserver.ftpserver-core.jar.path ->
/home/jenkins/.m2/repository/org/apache/ftpserver/ftpserver-core/1.0.0/ftpserver-core-1.0.0.jar
Setting project property: maven.dependency.org.apache.ftpserver.ftpserver-deprecated.jar.path
-> /home/jenkins/.m2/repository/org/apache/ftpserver/ftpserver-deprecated/1.0.0-M2/ftpserver-deprecated-1.0.0-M2.jar
Setting project property: maven.dependency.junit.junit.jar.path -> /home/jenkins/.m2/repository/junit/junit/4.8.2/junit-4.8.2.jar
Setting project property: maven.dependency.commons-lang.commons-lang.jar.path -> /home/jenkins/.m2/repository/commons-lang/commons-lang/2.5/commons-lang-2.5.jar
Setting project property: maven.dependency.commons-collections.commons-collections.jar.path
-> /home/jenkins/.m2/repository/commons-collections/commons-collections/3.2.1/commons-collections-3.2.1.jar
Setting project property: maven.dependency.commons-configuration.commons-configuration.jar.path
-> /home/jenkins/.m2/repository/commons-configuration/commons-configuration/1.6/commons-configuration-1.6.jar
Setting project property: maven.dependency.commons-digester.commons-digester.jar.path ->
/home/jenkins/.m2/repository/commons-digester/commons-digester/1.8/commons-digester-1.8.jar
Setting project property: maven.dependency.commons-beanutils.commons-beanutils.jar.path ->
/home/jenkins/.m2/repository/commons-beanutils/commons-beanutils/1.7.0/commons-beanutils-1.7.0.jar
Setting project property: maven.dependency.commons-beanutils.commons-beanutils-core.jar.path
-> /home/jenkins/.m2/repository/commons-beanutils/commons-beanutils-core/1.8.0/commons-beanutils-core-1.8.0.jar
Setting project property: maven.dependency.org.slf4j.slf4j-api.jar.path -> /home/jenkins/.m2/repository/org/slf4j/slf4j-api/1.6.1/slf4j-api-1.6.1.jar
Setting project property: maven.dependency.org.slf4j.slf4j-log4j12.jar.path -> /home/jenkins/.m2/repository/org/slf4j/slf4j-log4j12/1.6.1/slf4j-log4j12-1.6.1.jar
Setting project property: maven.dependency.org.eclipse.jdt.core.jar.path -> /home/jenkins/.m2/repository/org/eclipse/jdt/core/3.1.1/core-3.1.1.jar
Setting project property: maven.dependency.oro.oro.jar.path -> /home/jenkins/.m2/repository/oro/oro/2.0.8/oro-2.0.8.jar
Setting project property: maven.dependency.org.codehaus.jackson.jackson-mapper-asl.jar.path
-> /home/jenkins/.m2/repository/org/codehaus/jackson/jackson-mapper-asl/1.8.8/jackson-mapper-asl-1.8.8.jar
Setting project property: maven.dependency.org.aspectj.aspectjrt.jar.path -> /home/jenkins/.m2/repository/org/aspectj/aspectjrt/1.6.5/aspectjrt-1.6.5.jar
Setting project property: maven.dependency.org.mockito.mockito-all.jar.path -> /home/jenkins/.m2/repository/org/mockito/mockito-all/1.8.5/mockito-all-1.8.5.jar
Setting project property: maven.dependency.org.apache.avro.avro.jar.path -> /home/jenkins/.m2/repository/org/apache/avro/avro/1.5.3/avro-1.5.3.jar
Setting project property: maven.dependency.com.thoughtworks.paranamer.paranamer.jar.path ->
/home/jenkins/.m2/repository/com/thoughtworks/paranamer/paranamer/2.3/paranamer-2.3.jar
Setting project property: maven.dependency.org.xerial.snappy.snappy-java.jar.path -> /home/jenkins/.m2/repository/org/xerial/snappy/snappy-java/1.0.3.2/snappy-java-1.0.3.2.jar
Setting project property: maven.dependency.net.sf.kosmosfs.kfs.jar.path -> /home/jenkins/.m2/repository/net/sf/kosmosfs/kfs/0.3/kfs-0.3.jar
Setting project property: maven.dependency.org.apache.ant.ant.jar.path -> /home/jenkins/.m2/repository/org/apache/ant/ant/1.8.1/ant-1.8.1.jar
Setting project property: maven.dependency.org.apache.ant.ant-launcher.jar.path -> /home/jenkins/.m2/repository/org/apache/ant/ant-launcher/1.8.1/ant-launcher-1.8.1.jar
Setting project property: maven.dependency.com.google.protobuf.protobuf-java.jar.path ->
/home/jenkins/.m2/repository/com/google/protobuf/protobuf-java/2.4.0a/protobuf-java-2.4.0a.jar
Setting project property: maven.dependency.org.apache.hadoop.hadoop-auth.jar.path -> <https://builds.apache.org/job/Hadoop-Common-trunk/ws/trunk/hadoop-common-project/hadoop-auth/target/hadoop-auth-3.0.0-SNAPSHOT.jar>
Setting project property: maven.dependency.com.googlecode.json-simple.json-simple.jar.path
-> /home/jenkins/.m2/repository/com/googlecode/json-simple/json-simple/1.1/json-simple-1.1.jar
Setting project property: maven.dependency.com.jcraft.jsch.jar.path -> /home/jenkins/.m2/repository/com/jcraft/jsch/0.1.42/jsch-0.1.42.jar
Setting project property: maven.dependency.org.apache.zookeeper.zookeeper.jar.path -> /home/jenkins/.m2/repository/org/apache/zookeeper/zookeeper/3.4.2/zookeeper-3.4.2.jar
Setting project property: maven.dependency.jline.jline.jar.path -> /home/jenkins/.m2/repository/jline/jline/0.9.94/jline-0.9.94.jar
Setting project property: maven.dependency.org.jboss.netty.netty.jar.path -> /home/jenkins/.m2/repository/org/jboss/netty/netty/3.2.3.Final/netty-3.2.3.Final.jar
Setting project property: maven.dependency.org.apache.zookeeper.zookeeper.tests.test-jar.path
-> /home/jenkins/.m2/repository/org/apache/zookeeper/zookeeper/3.4.2/zookeeper-3.4.2-tests.jar
Setting project property: maven.dependency.jdk.tools.jdk.tools.jar.path -> /home/jenkins/tools/java/jdk1.6.0_26/jre/../lib/tools.jar
[INFO] Executing tasks
Build sequence for target(s) `main' is [main]
Complete build sequence is [main, ]

main:
     [exec] Current OS is Linux
     [exec] Setting environment variable: CFLAGS=-I/usr/local/include
     [exec] Setting environment variable: LDFLAGS=-L/usr/local/lib
     [exec] Executing 'cmake' with arguments:
     [exec] '<https://builds.apache.org/job/Hadoop-Common-trunk/ws/trunk/hadoop-common-project/hadoop-common/src/'>
     [exec] '-DGENERATED_JAVAH=<https://builds.apache.org/job/Hadoop-Common-trunk/ws/trunk/hadoop-common-project/hadoop-common/target/native/javah'>
     [exec] '-DHADOOP_RUNAS_HOME='
     [exec] '-DJVM_ARCH_DATA_MODEL=32'
     [exec] 
     [exec] The ' characters around the executable and arguments are
     [exec] not part of the command.
Execute:Java13CommandLauncher: Executing 'cmake' with arguments:
'<https://builds.apache.org/job/Hadoop-Common-trunk/ws/trunk/hadoop-common-project/hadoop-common/src/'>
'-DGENERATED_JAVAH=<https://builds.apache.org/job/Hadoop-Common-trunk/ws/trunk/hadoop-common-project/hadoop-common/target/native/javah'>
'-DHADOOP_RUNAS_HOME='
'-DJVM_ARCH_DATA_MODEL=32'

The ' characters around the executable and arguments are
not part of the command.
     [exec] -- The C compiler identification is GNU
     [exec] -- The CXX compiler identification is GNU
     [exec] -- Check for working C compiler: /usr/bin/gcc
     [exec] -- Check for working C compiler: /usr/bin/gcc -- works
     [exec] -- Detecting C compiler ABI info
     [exec] -- Detecting C compiler ABI info - done
     [exec] -- Check for working CXX compiler: /usr/bin/c++
     [exec] -- Check for working CXX compiler: /usr/bin/c++ -- works
     [exec] -- Detecting CXX compiler ABI info
     [exec] -- Detecting CXX compiler ABI info - done
     [exec] -- Found ZLIB: /usr/lib/libz.so
     [exec] -- Looking for sync_file_range
     [exec] -- Looking for sync_file_range - found
     [exec] -- Looking for posix_fadvise
     [exec] -- Looking for posix_fadvise - found
     [exec] -- Configuring done
     [exec] -- Generating done
     [exec] -- Build files have been written to: <https://builds.apache.org/job/Hadoop-Common-trunk/ws/trunk/hadoop-common-project/hadoop-common/target/native>
     [exec] Current OS is Linux
     [exec] Executing 'make' with arguments:
     [exec] 'VERBOSE=1'
     [exec] 
     [exec] The ' characters around the executable and arguments are
     [exec] not part of the command.
Execute:Java13CommandLauncher: Executing 'make' with arguments:
'VERBOSE=1'

The ' characters around the executable and arguments are
not part of the command.
     [exec] /usr/bin/cmake -H<https://builds.apache.org/job/Hadoop-Common-trunk/ws/trunk/hadoop-common-project/hadoop-common/src>
-B<https://builds.apache.org/job/Hadoop-Common-trunk/ws/trunk/hadoop-common-project/hadoop-common/target/native>
--check-build-system CMakeFiles/Makefile.cmake 0
     [exec] /usr/bin/cmake -E cmake_progress_start <https://builds.apache.org/job/Hadoop-Common-trunk/ws/t/home/jenkins/jenkins-slave/workspace/Hadoop-Common-trunk/trunk/hadoop-common-project/hadoop-common/src/main/native/src/org/apacrunk/hadoop-common-project/hadoop-common/target/native/CMakeFiles>
<https://builds.apache.org/job/Hadoop-Common-trunk/ws/trunhe/hadoop/io/compress/lz4/Lz4Compressor.c>:
In function 'Java_org_apache_hadoop_io_compress_lz4_Lz4Compressor_compressBytesDirectk/hadoop-common-project/hadoop-common/target/native/CMakeFiles/progress.marks
     [exec] make -f CMakeFiles/Makefile2 all
     [exec] make[1]: Entering':
     [exec] <https://builds.apache.org/job/Hadoop-Common-trunk/ws/trunk/hadoop-common-project/hadoop-common/src/main/native/src/org/a>
directory `<https://builds.apache.org/job/Hadoop-Common-trunk/ws/trunk/hadoop-common-project/hadoop-common/target/native'>
     [exec] mpache/hadoop/io/compress/lz4/Lz4Compressor.c:89: warning: passing argument 1
of 'LZ4_compress' discards qualifiers from pointer ake -f CMakeFiles/hadoop.dir/build.make
CMakeFiles/hadoop.dir/depend
     [exec] make[2]: Entering directory `/home/jenkins/jenkins-slave/wotarget type
     [exec] <https://builds.apache.org/job/Hadoop-Common-trunk/ws/trunk/hadoop-common-project/hadoop-common/src/main/native/rkspace/Hadoop-Common-trunk/trunk/hadoop-common-project/hadoop-common/target/native'>
     [exec] cd /home/jenkins/jenkins-slave/workspace/Hasrc/org/apache/hadoop/io/compress/lz4/Lz4Compressor.c:27:
note: expected 'char *' but argument is of type 'const char *'
     [exec] doop-Common-trunk/trunk/hadoop-common-project/hadoop-common/target/native &&
/usr/bin/cmake -E cmake_depends "Unix Makefiles" <https://builds.apache.org/job/Hadoop-Common-trunk/ws/trunk/hadoop-common-project/hadoop-common/src>
<https://builds.apache.org/job/Hadoop-Common-trunk/ws/trunk/hadoop-common-project/hadoop-common/src>
<https://builds.apache.org/job/Hadoop-Common-trunk/ws/trunk/hadoop-common-project/hadoop-common/target/native>
<https://builds.apache.org/job/Hadoop-Common-trunk/ws/trunk/hadoop-common-project/hadoop-common/target/native>
<https://builds.apache.org/job/Hadoop-Common-trunk/ws/trunk/hadoop-common-project/hadoop-common/target/native/CMakeFiles/hadoop.dir/DependInfo.cmake>
--color=
     [exec] Dependee "<https://builds.apache.org/job/Hadoop-Common-trunk/ws/trunk/hadoop-common-project/hadoop-common/target/native/CMakeFiles/hadoop.dir/DependInfo.cmake">
is newer than depender "<https://builds.apache.org/job/Hadoop-Common-trunk/ws/trunk/hadoop-common-project/hadoop-common/target/native/CMakeFiles/hadoop.dir/depend.internal".>
     [exec] Dependee "<https://builds.apache.org/job/Hadoop-Common-trunk/ws/trunk/hadoop-common-project/hadoop-common/target/native/CMakeFiles/CMakeDirectoryInformation.cmake">
is newer than depender "<https://builds.apache.org/job/Hadoop-Common-trunk/ws/trunk/hadoop-common-project/hadoop-common/target/native/CMakeFiles/hadoop.dir/depend.internal".>
     [exec] Scanning dependencies of target hadoop
     [exec] make[2]: Leaving directory `<https://builds.apache.org/job/Hadoop-Common-trunk/ws/trunk/hadoop-common-project/hadoop-common/target/native'>
     [exec] make -f CMakeFiles/hadoop.dir/build.make CMakeFiles/hadoop.dir/build
     [exec] make[2]: Entering directory `<https://builds.apache.org/job/Hadoop-Common-trunk/ws/trunk/hadoop-common-project/hadoop-common/target/native'>
     [exec] /usr/bin/cmake -E cmake_progress_report <https://builds.apache.org/job/Hadoop-Common-trunk/ws/trunk/hadoop-common-project/hadoop-common/target/native/CMakeFiles>
1
     [exec] [  3%] Building C object CMakeFiles/hadoop.dir/main/native/src/org/apache/hadoop/io/compress/lz4/Lz4Compressor.c.o
     [exec] /usr/bin/gcc  -Dhadoop_EXPORTS -I/usr/local/include  -m32 -g -Wall -O2 -D_REENTRANT
-D_FILE_OFFSET_BITS=64 -fPIC -I<https://builds.apache.org/job/Hadoop-Common-trunk/ws/trunk/hadoop-common-project/hadoop-common/target/native/javah>
-I<https://builds.apache.org/job/Hadoop-Common-trunk/ws/trunk/hadoop-common-project/hadoop-common/src/main/native/src>
-I<https://builds.apache.org/job/Hadoop-Common-trunk/ws/trunk/hadoop-common-project/hadoop-common/src>
-I<https://builds.apache.org/job/Hadoop-Common-trunk/ws/trunk/hadoop-common-project/hadoop-common/src/src>
-I<https://builds.apache.org/job/Hadoop-Common-trunk/ws/trunk/hadoop-common-project/hadoop-common/target/native>
-I/home/jenkins/tools/java/latest/include -I/home/jenkins/tools/java/latest/include/linux
  -o CMakeFiles/hadoop.dir/main/native/src/org/apache/hadoop/io/compress/lz4/Lz4Compressor.c.o
  -c <https://builds.apache.org/job/Hadoop-Common-trunk/ws/trunk/hadoop-common-project/hadoop-common/src/main/native/src/org/apache/hadoop/io/compress/lz4/Lz4Compressor.c>
     [exec] <https://builds.apache.org/job/Hadoop-Common-trunk/ws/trunk/hadoop-common-project/hadoop-common/src/main/native/src/org/apache/hadoop/io/compress/lz4/Lz4Decompressor.c>:
In function 'Java_org_apache_hadoop_io_compress_lz4_Lz4Decompressor_decompressBytesDirect':
     [exec] <https://builds.apache.org/job/Hadoop-Common-trunk/ws/trunk/hadoop-common-project/hadoop-common/src/main/native/src/org/apache/hadoop/io/compress/lz4/Lz4Decompressor.c>:86:
warning: passing argument 1 of 'LZ4_uncompress_unknownOutputSize' discards qualifiers from
pointer target type
     [exec] <https://builds.apache.org/job/Hadoop-Common-trunk/ws/trunk/hadoop-common-project/hadoop-common/src/main/native/src/org/apache/hadoop/io/compress/lz4/Lz4Decompressor.c>:23:
note: expected 'char *' but argument is of type 'const char *'
     [exec] /usr/bin/cmake -E cmake_progress_report <https://builds.apache.org/job/Hadoop-Common-trunk/ws/trunk/hadoop-common-project/hadoop-common/target/native/CMakeFiles>
2
     [exec] [  7%] Building C object CMakeFiles/hadoop.dir/main/native/src/org/apache/hadoop/io/compress/lz4/Lz4Decompressor.c.o
     [exec] /usr/bin/gcc  -Dhadoop_EXPORTS -I/usr/local/include  -m32 -g -Wall -O2 -D_REENTRANT
-D_FILE_OFFSET_BITS=64 -fPIC -I<https://builds.apache.org/job/Hadoop-Common-trunk/ws/trunk/hadoop-common-project/hadoop-common/target/native/javah>
-I<https://builds.apache.org/job/Hadoop-Common-trunk/ws/trunk/hadoop-common-project/hadoop-common/src/main/native/src>
-I<https://builds.apache.org/job/Hadoop-Common-trunk/ws/trunk/hadoop-common-project/hadoop-common/src>
-I<https://builds.apache.org/job/Hadoop-Common-trunk/ws/trunk/hadoop-common-project/hadoop-common/src/src>
-I<https://builds.apache.org/job/Hadoop-Common-trunk/ws/trunk/hadoop-common-project/hadoop-common/target/native>
-I/home/jenkins/tools/java/latest/include -I/home/jenkins/tools/java/latest/include/linux
  -o CMakeFiles/hadoop.dir/main/native/src/org/apache/hadoop/io/compress/lz4/Lz4Decompressor.c.o
  -c <https://builds.apache.org/job/Hadoop-Common-trunk/ws/trunk/hadoop-common-project/hadoop-common/src/main/native/src/org/apache/hadoop/io/compress/lz4/Lz4Decompressor.c>
     [exec] /usr/bin/cmake -E cmake_progress_report <https://builds.apache.org/job/Hadoop-Common-trunk/ws/trunk/hadoop-common-project/hadoop-common/target/native/CMakeFiles>
3
     [exec] [ 11%] Building C object CMakeFiles/hadoop.dir/main/native/src/org/apache/hadoop/io/compress/lz4/lz4.c.o
     [exec] /usr/bin/gcc  -Dhadoop_EXPORTS -I/usr/local/include  -m32 -g -Wall -O2 -D_REENTRANT
-D_FILE_OFFSET_BITS=64 -fPIC -I<https://builds.apache.org/job/Hadoop-Common-trunk/ws/trunk/hadoop-common-project/hadoop-common/target/native/javah>
-I<https://builds.apache.org/job/Hadoop-Common-trunk/ws/trunk/hadoop-common-project/hadoop-common/src/main/native/src>
-I<https://builds.apache.org/job/Hadoop-Common-trunk/ws/trunk/hadoop-common-project/hadoop-common/src>
-I<https://builds.apache.org/job/Hadoop-Common-trunk/ws/trunk/hadoop-common-project/hadoop-common/src/src>
-I<https://builds.apache.org/job/Hadoop-Common-trunk/ws/trunk/hadoop-common-project/hadoop-common/target/native>
-I/home/jenkins/tools/java/latest/include -I/home/jenkins/tools/java/latest/include/linux
  -o CMakeFiles/hadoop.dir/main/native/src/org/apache/hadoop/io/compress/lz4/lz4.c.o   -c
<https://builds.apache.org/job/Hadoop-Common-trunk/ws/trunk/hadoop-common-project/hadoop-common/src/main/native/src/org/apache/hadoop/io/compress/lz4/lz4.c>
     [exec] /usr/bin/cmake -E cmake_progress_report <https://builds.apache.org/job/Hadoop-Common-trunk/ws/trunk/hadoop-common-project/hadoop-common/target/native/CMakeFiles>
4
     [exec] [ 15%] Building C object CMakeFiles/hadoop.dir/main/native/src/org/apache/hadoop/io/compress/zlib/ZlibCompressor.c.o
     [exec] /usr/bin/gcc  -Dhadoop_EXPORTS -I/usr/local/include  -m32 -g -Wall -O2 -D_REENTRANT
-D_FILE_OFFSET_BITS=64 -fPIC -I<https://builds.apache.org/job/Hadoop-Common-trunk/ws/trunk/hadoop-common-project/hadoop-common/target/native/javah>
-I<https://builds.apache.org/job/Hadoop-Common-trunk/ws/trunk/hadoop-common-project/hadoop-common/src/main/native/src>
-I<https://builds.apache.org/job/Hadoop-Common-trunk/ws/trunk/hadoop-common-project/hadoop-common/src>
-I<https://builds.apache.org/job/Hadoop-Common-trunk/ws/trunk/hadoop-common-project/hadoop-common/src/src>
-I<https://builds.apache.org/job/Hadoop-Common-trunk/ws/trunk/hadoop-common-project/hadoop-common/target/native>
-I/home/jenkins/tools/java/latest/include -I/home/jenkins/tools/java/latest/include/linux
  -o CMakeFiles/hadoop.dir/main/native/src/org/apache/hadoop/io/compress/zlib/ZlibCompressor.c.o
  -c <https://builds.apache.org/job/Hadoop-Common-trunk/ws/trunk/hadoop-common-project/hadoop-common/src/main/native/src/org/apache/hadoop/io/compress/zlib/ZlibCompressor.c>
     [exec] /usr/bin/cmake -E cmake_progress_report <https://builds.apache.org/job/Hadoop-Common-trunk/ws/trunk/hadoop-common-project/hadoop-common/target/native/CMakeFiles>
5
     [exec] [ 19%] Building C object CMakeFiles/hadoop.dir/main/native/src/org/apache/hadoop/io/compress/zlib/ZlibDecompressor.c.o
     [exec] /usr/bin/gcc  -Dhadoop_EXPORTS -I/usr/local/include  -m32 -g -Wall -O2 -D_REENTRANT
-D_FILE_OFFSET_BITS=64 -fPIC -I<https://builds.apache.org/job/Hadoop-Common-trunk/ws/trunk/hadoop-common-project/hadoop-common/target/native/javah>
-I<https://builds.apache.org/job/Hadoop-Common-trunk/ws/trunk/hadoop-common-project/hadoop-common/src/main/native/src>
-I<https://builds.apache.org/job/Hadoop-Common-trunk/ws/trunk/hadoop-common-project/hadoop-common/src>
-I<https://builds.apache.org/job/Hadoop-Common-trunk/ws/trunk/hadoop-common-project/hadoop-common/src/src>
-I<https://builds.apache.org/job/Hadoop-Common-trunk/ws/trunk/hadoop-common-project/hadoop-common/target/native>
-I/home/jenkins/tools/java/latest/include -I/home/jenkins/tools/java/latest/include/linux
  -o CMakeFiles/hadoop.dir/main/native/src/org/apache/hadoop/io/compress/zlib/ZlibDecompressor.c.o
  -c <https://builds.apache.org/job/Hadoop-Common-trunk/ws/trunk/hadoop-common-project/hadoop-common/src/main/native/src/org/apache/hadoop/io/compress/zlib/ZlibDecompressor.c>
     [exec] <https://builds.apache.org/job/Hadoop-Common-trunk/ws/trunk/hadoop-common-project/hadoop-common/src/main/native/src/org/apache/hadoop/io/nativeio/NativeIO.c>:
In function 'Java_org_apache_hadoop_io_nativeio_NativeIO_sync_1file_1range':
     [exec] <https://builds.apache.org/job/Hadoop-Common-trunk/ws/trunk/hadoop-common-project/hadoop-common/src/main/native/src/org/apache/hadoop/io/nativeio/NativeIO.c>:297:
warning: implicit declaration of function 'sync_file_range'
     [exec] /usr/bin/cmake -E cmake_progress_report <https://builds.apache.org/job/Hadoop-Common-trunk/ws/trunk/hadoop-common-project/hadoop-common/target/native/CMakeFiles>
6
     [exec] [ 23%] Building C object CMakeFiles/hadoop.dir/main/native/src/org/apache/hadoop/io/nativeio/NativeIO.c.o
     [exec] /usr/bin/gcc  -Dhadoop_EXPORTS -I/usr/local/include  -m32 -g -Wall -O2 -D_REENTRANT
-D_FILE_OFFSET_BITS=64 -fPIC -I<https://builds.apache.org/job/Hadoop-Common-trunk/ws/trunk/hadoop-common-project/hadoop-common/target/native/javah>
-I<https://builds.apache.org/job/Hadoop-Common-trunk/ws/trunk/hadoop-common-project/hadoop-common/src/main/native/src>
-I<https://builds.apache.org/job/Hadoop-Common-trunk/ws/trunk/hadoop-common-project/hadoop-common/src>
-I<https://builds.apache.org/job/Hadoop-Common-trunk/ws/trunk/hadoop-common-project/hadoop-common/src/src>
-I<https://builds.apache.org/job/Hadoop-Common-trunk/ws/trunk/hadoop-common-project/hadoop-common/target/native>
-I/home/jenkins/tools/java/latest/include -I/home/jenkins/tools/java/latest/include/linux
  -o CMakeFiles/hadoop.dir/main/native/src/org/apache/hadoop/io/nativeio/NativeIO.c.o   -c
<https://builds.apache.org/job/Hadoop-Common-trunk/ws/trunk/hadoop-common-project/hadoop-common/src/main/native/src/org/apache/hadoop/io/nativeio/NativeIO.c>
     [exec] /usr/bin/cmake -E cmake_progress_report <https://builds.apache.org/job/Hadoop-Common-trunk/ws/trunk/hadoop-common-project/hadoop-common/target/native/CMakeFiles>
7
     [exec] [ 26%] Building C object CMakeFiles/hadoop.dir/main/native/src/org/apache/hadoop/io/nativeio/errno_enum.c.o
     [exec] /usr/bin/gcc  -Dhadoop_EXPORTS -I/usr/local/include  -m32 -g -Wall -O2 -D_REENTRANT
-D_FILE_OFFSET_BITS=64 -fPIC -I<https://builds.apache.org/job/Hadoop-Common-trunk/ws/trunk/hadoop-common-project/hadoop-common/target/native/javah>
-I<https://builds.apache.org/job/Hadoop-Common-trunk/ws/trunk/hadoop-common-project/hadoop-common/src/main/native/src>
-I<https://builds.apache.org/job/Hadoop-Common-trunk/ws/trunk/hadoop-common-project/hadoop-common/src>
-I<https://builds.apache.org/job/Hadoop-Common-trunk/ws/trunk/hadoop-common-project/hadoop-common/src/src>
-I<https://builds.apache.org/job/Hadoop-Common-trunk/ws/trunk/hadoop-common-project/hadoop-common/target/native>
-I/home/jenkins/tools/java/latest/include -I/home/jenkins/tools/java/latest/include/linux
  -o CMakeFiles/hadoop.dir/main/native/src/org/apache/hadoop/io/nativeio/errno_enum.c.o  
-c <https://builds.apache.org/job/Hadoop-Common-trunk/ws/trunk/hadoop-common-project/hadoop-common/src/main/native/src/org/apache/hadoop/io/nativeio/errno_enum.c>
     [exec] /usr/bin/cmake -E cmake_progress_report <https://builds.apache.org/job/Hadoop-Common-trunk/ws/trunk/hadoop-common-project/hadoop-common/target/native/CMakeFiles>
8
     [exec] [ 30%] Building C object CMakeFiles/hadoop.dir/main/native/src/org/apache/hadoop/io/nativeio/file_descriptor.c.o
     [exec] /usr/bin/gcc  -Dhadoop_EXPORTS -I/usr/local/include  -m32 -g -Wall -O2 -D_REENTRANT
-D_FILE_OFFSET_BITS=64 -fPIC -I<https://builds.apache.org/job/Hadoop-Common-trunk/ws/trunk/hadoop-common-project/hadoop-common/target/native/javah>
-I<https://builds.apache.org/job/Hadoop-Common-trunk/ws/trunk/hadoop-common-project/hadoop-common/src/main/native/src>
-I<https://builds.apache.org/job/Hadoop-Common-trunk/ws/trunk/hadoop-common-project/hadoop-common/src>
-I<https://builds.apache.org/job/Hadoop-Common-trunk/ws/trunk/hadoop-common-project/hadoop-common/src/src>
-I<https://builds.apache.org/job/Hadoop-Common-trunk/ws/trunk/hadoop-common-project/hadoop-common/target/native>
-I/home/jenkins/tools/java/latest/include -I/home/jenkins/tools/java/latest/include/linux
  -o CMakeFiles/hadoop.dir/main/native/src/org/apache/hadoop/io/nativeio/file_descriptor.c.o
  -c <https://builds.apache.org/job/Hadoop-Common-trunk/ws/trunk/hadoop-common-project/hadoop-common/src/main/native/src/org/apache/hadoop/io/nativeio/file_descriptor.c>
     [exec] <https://builds.apache.org/job/Hadoop-Common-trunk/ws/trunk/hadoop-common-project/hadoop-common/src/main/native/src/org/apache/hadoop/security/JniBasedUnixGroupsMapping.c>:
In function 'Java_org_apache_hadoop_security_JniBasedUnixGroupsMapping_getGroupForUser':
     [exec] <https://builds.apache.org/job/Hadoop-Common-trunk/ws/trunk/hadoop-common-project/hadoop-common/src/main/native/src/org/apache/hadoop/security/JniBasedUnixGroupsMapping.c>:44:
warning: 'jgroups' may be used uninitialized in this function
     [exec] <https://builds.apache.org/job/Hadoop-Common-trunk/ws/trunk/hadoop-common-project/hadoop-common/src/main/native/src/org/apache/hadoop/security/JniBasedUnixGroupsMapping.c>:59:
warning: 'cuser' may be used uninitialized in this function
     [exec] /usr/bin/cmake -E cmake_progress_report <https://builds.apache.org/job/Hadoop-Common-trunk/ws/trunk/hadoop-common-project/hadoop-common/target/native/CMakeFiles>
9
     [exec] [ 34%] Building C object CMakeFiles/hadoop.dir/main/native/src/org/apache/hadoop/security/JniBasedUnixGroupsMapping.c.o
     [exec] /usr/bin/gcc  -Dhadoop_EXPORTS -I/usr/local/include  -m32 -g -Wall -O2 -D_REENTRANT
-D_FILE_OFFSET_BITS=64 -fPIC -I<https://builds.apache.org/job/Hadoop-Common-trunk/ws/trunk/hadoop-common-project/hadoop-common/target/native/javah>
-I<https://builds.apache.org/job/Hadoop-Common-trunk/ws/trunk/hadoop-common-project/hadoop-common/src/main/native/src>
-I<https://builds.apache.org/job/Hadoop-Common-trunk/ws/trunk/hadoop-common-project/hadoop-common/src>
-I<https://builds.apache.org/job/Hadoop-Common-trunk/ws/trunk/hadoop-common-project/hadoop-common/src/src>
-I<https://builds.apache.org/job/Hadoop-Common-trunk/ws/trunk/hadoop-common-project/hadoop-common/target/native>
-I/home/jenkins/tools/java/latest/include -I/home/jenkins/tools/java/latest/include/linux
  -o CMakeFiles/hadoop.dir/main/native/src/org/apache/hadoop/security/JniBasedUnixGroupsMapping.c.o
  -c <https://builds.apache.org/job/Hadoop-Common-trunk/ws/trunk/hadoop-common-project/hadoop-common/src/main/native/src/org/apache/hadoop/security/JniBasedUnixGroupsMapping.c>
     [exec] /usr/bin/cmake -E cmake_progress_report <https://builds.apache.org/job/Hadoop-Common-trunk/ws/trunk/hadoop-common-project/hadoop-common/target/native/CMakeFiles>
10
     [exec] [ 38%] <https://builds.apache.org/job/Hadoop-Common-trunk/ws/trunk/hadoop-common-project/hadoop-common/src/main/native/src/org/apache/hadoop/security/JniBasedUnixGroupsNetgroupMapping.c>:
In function 'Java_org_apache_hadoop_security_JniBasedUnixGroupsNetgroupMapping_getUsersForNetgroupJNI':
     [exec] <https://builds.apache.org/job/Hadoop-Common-trunk/ws/trunk/hadoop-common-project/hadoop-common/src/main/native/src/org/apache/hadoop/security/JniBasedUnixGroupsNetgroupMapping.c>:68:
warning: 'userListHead' may be used uninitialized in this function
     [exec] Building C object CMakeFiles/hadoop.dir/main/native/src/org/apache/hadoop/security/JniBasedUnixGroupsNetgroupMapping.c.o
     [exec] /usr/bin/gcc  -Dhadoop_EXPORTS -I/usr/local/include  -m32 -g -Wall -O2 -D_REENTRANT
-D_FILE_OFFSET_BITS=64 -fPIC -I<https://builds.apache.org/job/Hadoop-Common-trunk/ws/trunk/hadoop-common-project/hadoop-common/target/native/javah>
-I<https://builds.apache.org/job/Hadoop-Common-trunk/ws/trunk/hadoop-common-project/hadoop-common/src/main/native/src>
-I<https://builds.apache.org/job/Hadoop-Common-trunk/ws/trunk/hadoop-common-project/hadoop-common/src>
-I<https://builds.apache.org/job/Hadoop-Common-trunk/ws/trunk/hadoop-common-project/hadoop-common/src/src>
-I<https://builds.apache.org/job/Hadoop-Common-trunk/ws/trunk/hadoop-common-project/hadoop-common/target/native>
-I/home/jenkins/tools/java/latest/include -I/home/jenkins/tools/java/latest/include/linux
  -o CMakeFiles/hadoop.dir/main/native/src/org/apache/hadoop/security/JniBasedUnixGroupsNetgroupMapping.c.o
  -c <https://builds.apache.org/job/Hadoop-Common-trunk/ws/trunk/hadoop-common-project/hadoop-common/src/main/native/src/org/apache/hadoop/security/JniBasedUnixGroupsNetgroupMapping.c>
     [exec] /usr/bin/cmake -E cmake_progress_report <https://builds.apache.org/job/Hadoop-Common-trunk/ws/trunk/hadoop-common-project/hadoop-common/target/native/CMakeFiles>
11
     [exec] [ 42%] Building C object CMakeFiles/hadoop.dir/main/native/src/org/apache/hadoop/security/getGroup.c.o
     [exec] /usr/bin/gcc  -Dhadoop_EXPORTS -I/usr/local/include  -m32 -g -Wall -O2 -D_REENTRANT
-D_FILE_OFFSET_BITS=64 -fPIC -I<https://builds.apache.org/job/Hadoop-Common-trunk/ws/trunk/hadoop-common-project/hadoop-common/target/native/javah>
-I<https://builds.apache.org/job/Hadoop-Common-trunk/ws/trunk/hadoop-common-project/hadoop-common/src/main/native/src>
-I<https://builds.apache.org/job/Hadoop-Common-trunk/ws/trunk/hadoop-common-project/hadoop-common/src>
-I<https://builds.apache.org/job/Hadoop-Common-trunk/ws/trunk/hadoop-common-project/hadoop-common/src/src>
-I<https://builds.apache.org/job/Hadoop-Common-trunk/ws/trunk/hadoop-common-project/hadoop-common/target/native>
-I/home/jenkins/tools/java/latest/include -I/home/jenkins/tools/java/latest/include/linux
  -o CMakeFiles/hadoop.dir/main/native/src/org/apache/hadoop/security/getGroup.c.o   -c <https://builds.apache.org/job/Hadoop-Common-trunk/ws/trunk/hadoop-common-project/hadoop-common/src/main/native/src/org/apache/hadoop/security/getGroup.c>
     [exec] /usr/bin/cmake -E cmake_progress_report <https://builds.apache.org/job/Hadoop-Common-trunk/ws/trunk/hadoop-common-project/hadoop-common/target/native/CMakeFiles>
12
     [exec] [ 46%] Building C object CMakeFiles/hadoop.dir/main/native/src/org/apache/hadoop/util/NativeCrc32.c.o
     [exec] /usr/bin/gcc  -Dhadoop_EXPORTS -I/usr/local/include  -m32 -g -Wall -O2 -D_REENTRANT
-D_FILE_OFFSET_BITS=64 -fPIC -I<https://builds.apache.org/job/Hadoop-Common-trunk/ws/trunk/hadoop-common-project/hadoop-common/target/native/javah>
-I<https://builds.apache.org/job/Hadoop-Common-trunk/ws/trunk/hadoop-common-project/hadoop-common/src/main/native/src>
-I<https://builds.apache.org/job/Hadoop-Common-trunk/ws/trunk/hadoop-common-project/hadoop-common/src>
-I<https://builds.apache.org/job/Hadoop-Common-trunk/ws/trunk/hadoop-common-project/hadoop-common/src/src>
-I<https://builds.apache.org/job/Hadoop-Common-trunk/ws/trunk/hadoop-common-project/hadoop-common/target/native>
-I/home/jenkins/tools/java/latest/include -I/home/jenkins/tools/java/latest/include/linux
  -o CMakeFiles/hadoop.dir/main/native/src/org/apache/hadoop/util/NativeCrc32.c.o   -c <https://builds.apache.org/job/Hadoop-Common-trunk/ws/trunk/hadoop-common-project/hadoop-common/src/main/native/src/org/apache/hadoop/util/NativeCrc32.c>
     [exec] <https://builds.apache.org/job/Hadoop-Common-trunk/ws/trunk/hadoop-common-project/hadoop-common/src/main/native/src/org/apache/hadoop/util/NativeCrc32.c>:
In function 'throw_checksum_exception':
     [exec] <https://builds.apache.org/job/Hadoop-Common-trunk/ws/trunk/hadoop-common-project/hadoop-common/src/main/native/src/org/apache/hadoop/util/NativeCrc32.c>:54:
warning: format '%ld' expects type 'long int', but argument 5 has type 'jlong'
     [exec] <https://builds.apache.org/job/Hadoop-Common-trunk/ws/trunk/hadoop-common-project/hadoop-common/src/main/native/src/org/apache/hadoop/util/NativeCrc32.c>:54:
warning: format '%ld' expects type 'long int', but argument 5 has type 'jlong'
     [exec] /usr/bin/cmake -E cmake_progress_report <https://builds.apache.org/job/Hadoop-Common-trunk/ws/trunk/hadoop-common-project/hadoop-common/target/native/CMakeFiles>
13
     [exec] [ 50%] Building C object CMakeFiles/hadoop.dir/main/native/src/org/apache/hadoop/util/bulk_crc32.c.o
     [exec] /usr/bin/gcc  -Dhadoop_EXPORTS -I/usr/local/include  -m32 -g -Wall -O2 -D_REENTRANT
-D_FILE_OFFSET_BITS=64 -fPIC -I<https://builds.apache.org/job/Hadoop-Common-trunk/ws/trunk/hadoop-common-project/hadoop-common/target/native/javah>
-I<https://builds.apache.org/job/Hadoop-Common-trunk/ws/trunk/hadoop-common-project/hadoop-common/src/main/native/src>
-I<https://builds.apache.org/job/Hadoop-Common-trunk/ws/trunk/hadoop-common-project/hadoop-common/src>
-I<https://builds.apache.org/job/Hadoop-Common-trunk/ws/trunk/hadoop-common-project/hadoop-common/src/src>
-I<https://builds.apache.org/job/Hadoop-Common-trunk/ws/trunk/hadoop-common-project/hadoop-common/target/native>
-I/home/jenkins/tools/java/latest/include -I/home/jenkins/tools/java/latest/include/linux
  -o CMakeFiles/hadoop.dir/main/native/src/org/apache/hadoop/util/bulk_crc32.c.o   -c <https://builds.apache.org/job/Hadoop-Common-trunk/ws/trunk/hadoop-common-project/hadoop-common/src/main/native/src/org/apache/hadoop/util/bulk_crc32.c>
     [exec] <https://builds.apache.org/job/Hadoop-Common-trunk/ws/trunk/hadoop-common-project/hadoop-common/src/main/native/src/org/apache/hadoop/util/bulk_crc32.c>:44:8:
warning: extra tokens at end of #endif directive
     [exec] /usr/lib/jvm/java-6-openjdk/jre/lib/amd64/server/libjvm.so: could not read symbols:
File in wrong format
     [exec] collect2: ld returned 1 exit status
     [exec] make[2]: *** [target/usr/local/lib/libhadoop.so.1.0.0] Error 1
     [exec] make[1]: *** [CMakeFiles/hadoop.dir/all] Error 2
     [exec] make: *** [all] Error 2
     [exec] Linking C shared library target/usr/local/lib/libhadoop.so
     [exec] /usr/bin/cmake -E cmake_link_script CMakeFiles/hadoop.dir/link.txt --verbose=1
     [exec] /usr/bin/gcc  -fPIC -I/usr/local/include  -m32 -g -Wall -O2 -D_REENTRANT -D_FILE_OFFSET_BITS=64
-L/usr/local/lib -shared -Wl,-soname,libhadoop.so.1.0.0 -o target/usr/local/lib/libhadoop.so.1.0.0
CMakeFiles/hadoop.dir/main/native/src/org/apache/hadoop/io/compress/lz4/Lz4Compressor.c.o
CMakeFiles/hadoop.dir/main/native/src/org/apache/hadoop/io/compress/lz4/Lz4Decompressor.c.o
CMakeFiles/hadoop.dir/main/native/src/org/apache/hadoop/io/compress/lz4/lz4.c.o CMakeFiles/hadoop.dir/main/native/src/org/apache/hadoop/io/compress/zlib/ZlibCompressor.c.o
CMakeFiles/hadoop.dir/main/native/src/org/apache/hadoop/io/compress/zlib/ZlibDecompressor.c.o
CMakeFiles/hadoop.dir/main/native/src/org/apache/hadoop/io/nativeio/NativeIO.c.o CMakeFiles/hadoop.dir/main/native/src/org/apache/hadoop/io/nativeio/errno_enum.c.o
CMakeFiles/hadoop.dir/main/native/src/org/apache/hadoop/io/nativeio/file_descriptor.c.o CMakeFiles/hadoop.dir/main/native/src/org/apache/hadoop/security/JniBasedUnixGroupsMapping.c.o
CMakeFiles/hadoop.dir/main/native/src/org/apache/hadoop/security/JniBasedUnixGroupsNetgroupMapping.c.o
CMakeFiles/hadoop.dir/main/native/src/org/apache/hadoop/security/getGroup.c.o CMakeFiles/hadoop.dir/main/native/src/org/apache/hadoop/util/NativeCrc32.c.o
CMakeFiles/hadoop.dir/main/native/src/org/apache/hadoop/util/bulk_crc32.c.o -ldl /usr/lib/jvm/java-6-openjdk/jre/lib/amd64/server/libjvm.so
-Wl,-rpath,/usr/lib/jvm/java-6-openjdk/jre/lib/amd64/server 
     [exec] make[2]: Leaving directory `<https://builds.apache.org/job/Hadoop-Common-trunk/ws/trunk/hadoop-common-project/hadoop-common/target/native'>
     [exec] make[1]: Leaving directory `<https://builds.apache.org/job/Hadoop-Common-trunk/ws/trunk/hadoop-common-project/hadoop-common/target/native'>
[INFO] ------------------------------------------------------------------------
[INFO] Reactor Summary:
[INFO] 
[INFO] Apache Hadoop Annotations ......................... SUCCESS [12.771s]
[INFO] Apache Hadoop Auth ................................ SUCCESS [20.469s]
[INFO] Apache Hadoop Auth Examples ....................... SUCCESS [7.487s]
[INFO] Apache Hadoop Common .............................. FAILURE [14.108s]
[INFO] Apache Hadoop Common Project ...................... SKIPPED
[INFO] ------------------------------------------------------------------------
[INFO] BUILD FAILURE
[INFO] ------------------------------------------------------------------------
[INFO] Total time: 55.950s
[INFO] Finished at: Thu Jun 07 09:05:31 UTC 2012
[INFO] Final Memory: 68M/664M
[INFO] ------------------------------------------------------------------------
[ERROR] Failed to execute goal org.apache.maven.plugins:maven-antrun-plugin:1.6:run (make)
on project hadoop-common: An Ant BuildException has occured: exec returned: 2 -> [Help
1]
org.apache.maven.lifecycle.LifecycleExecutionException: Failed to execute goal org.apache.maven.plugins:maven-antrun-plugin:1.6:run
(make) on project hadoop-common: An Ant BuildException has occured: exec returned: 2
	at org.apache.maven.lifecycle.internal.MojoExecutor.execute(MojoExecutor.java:217)
	at org.apache.maven.lifecycle.internal.MojoExecutor.execute(MojoExecutor.java:153)
	at org.apache.maven.lifecycle.internal.MojoExecutor.execute(MojoExecutor.java:145)
	at org.apache.maven.lifecycle.internal.LifecycleModuleBuilder.buildProject(LifecycleModuleBuilder.java:84)
	at org.apache.maven.lifecycle.internal.LifecycleModuleBuilder.buildProject(LifecycleModuleBuilder.java:59)
	at org.apache.maven.lifecycle.internal.LifecycleStarter.singleThreadedBuild(LifecycleStarter.java:183)
	at org.apache.maven.lifecycle.internal.LifecycleStarter.execute(LifecycleStarter.java:161)
	at org.apache.maven.DefaultMaven.doExecute(DefaultMaven.java:319)
	at org.apache.maven.DefaultMaven.execute(DefaultMaven.java:156)
	at org.apache.maven.cli.MavenCli.execute(MavenCli.java:537)
	at org.apache.maven.cli.MavenCli.doMain(MavenCli.java:196)
	at org.apache.maven.cli.MavenCli.main(MavenCli.java:141)
	at sun.reflect.NativeMethodAccessorImpl.invoke0(Native Method)
	at sun.reflect.NativeMethodAccessorImpl.invoke(NativeMethodAccessorImpl.java:39)
	at sun.reflect.DelegatingMethodAccessorImpl.invoke(DelegatingMethodAccessorImpl.java:25)
	at java.lang.reflect.Method.invoke(Method.java:597)
	at org.codehaus.plexus.classworlds.launcher.Launcher.launchEnhanced(Launcher.java:290)
	at org.codehaus.plexus.classworlds.launcher.Launcher.launch(Launcher.java:230)
	at org.codehaus.plexus.classworlds.launcher.Launcher.mainWithExitCode(Launcher.java:409)
	at org.codehaus.plexus.classworlds.launcher.Launcher.main(Launcher.java:352)
Caused by: org.apache.maven.plugin.MojoExecutionException: An Ant BuildException has occured:
exec returned: 2
	at org.apache.maven.plugin.antrun.AntRunMojo.execute(AntRunMojo.java:283)
	at org.apache.maven.plugin.DefaultBuildPluginManager.executeMojo(DefaultBuildPluginManager.java:101)
	at org.apache.maven.lifecycle.internal.MojoExecutor.execute(MojoExecutor.java:209)
	... 19 more
Caused by: <https://builds.apache.org/job/Hadoop-Common-trunk/ws/trunk/hadoop-common-project/hadoop-common/target/antrun/build-main.xml>:9:
exec returned: 2
	at org.apache.tools.ant.taskdefs.ExecTask.runExecute(ExecTask.java:650)
	at org.apache.tools.ant.taskdefs.ExecTask.runExec(ExecTask.java:676)
	at org.apache.tools.ant.taskdefs.ExecTask.execute(ExecTask.java:502)
	at org.apache.tools.ant.UnknownElement.execute(UnknownElement.java:291)
	at sun.reflect.GeneratedMethodAccessor123.invoke(Unknown Source)
	at sun.reflect.DelegatingMethodAccessorImpl.invoke(DelegatingMethodAccessorImpl.java:25)
	at java.lang.reflect.Method.invoke(Method.java:597)
	at org.apache.tools.ant.dispatch.DispatchUtils.execute(DispatchUtils.java:106)
	at org.apache.tools.ant.Task.perform(Task.java:348)
	at org.apache.tools.ant.Target.execute(Target.java:390)
	at org.apache.tools.ant.Target.performTasks(Target.java:411)
	at org.apache.tools.ant.Project.executeSortedTargets(Project.java:1397)
	at org.apache.tools.ant.Project.executeTarget(Project.java:1366)
	at org.apache.maven.plugin.antrun.AntRunMojo.execute(AntRunMojo.java:270)
	... 21 more
[ERROR] 
[ERROR] 
[ERROR] For more information about the errors and possible solutions, please read the following
articles:
[ERROR] [Help 1] http://cwiki.apache.org/confluence/display/MAVEN/MojoExecutionException
[ERROR] 
[ERROR] After correcting the problems, you can resume the build with the command
[ERROR]   mvn <goals> -rf :hadoop-common
Build step 'Execute shell' marked build as failure
Archiving artifacts

Mime
View raw message