hadoop-common-dev mailing list archives

Site index · List index
Message view « Date » · « Thread »
Top « Date » · « Thread »
From Apache Jenkins Server <jenk...@builds.apache.org>
Subject Build failed in Jenkins: Hadoop-Common-0.23-Build #283
Date Thu, 14 Jun 2012 09:15:23 GMT
See <https://builds.apache.org/job/Hadoop-Common-0.23-Build/283/>

------------------------------------------
[...truncated 69171 lines...]
245 KB   321 KB   
245 KB   324 KB   
245 KB   324 KB   
                  
Downloaded: http://repo1.maven.org/maven2/org/codehaus/plexus/plexus-utils/1.5.6/plexus-utils-1.5.6.jar
(245 KB at 26.4 KB/sec)
                  
Downloaded: http://repo1.maven.org/maven2/backport-util-concurrent/backport-util-concurrent/3.1/backport-util-concurrent-3.1.jar
(324 KB at 34.5 KB/sec)
[INFO] Clover Version 3.0.2, built on April 13 2010 (build-790)
[INFO] Loaded from: /home/jenkins/.m2/repository/com/cenqua/clover/clover/3.0.2/clover-3.0.2.jar
[INFO] Clover: Open Source License registered to Apache.
[INFO] Creating new database at '<https://builds.apache.org/job/Hadoop-Common-0.23-Build/ws/trunk/hadoop-common-project/hadoop-annotations/target/clover/hadoop-coverage.db'.>
[INFO] Processing files at 1.6 source level.
[INFO] Clover all over. Instrumented 8 files (2 packages).
[INFO] Elapsed time = 0.196 secs. (40.816 files/sec, 3,122.449 srclines/sec)
[INFO] No Clover instrumentation done on source files in: [<https://builds.apache.org/job/Hadoop-Common-0.23-Build/ws/trunk/hadoop-common-project/hadoop-annotations/src/test/java]>
as no matching sources files found
[INFO] 
[INFO] --- maven-resources-plugin:2.2:resources (default-resources) @ hadoop-annotations ---
[INFO] Using default encoding to copy filtered resources.
[INFO] 
[INFO] --- maven-compiler-plugin:2.3.2:compile (default-compile) @ hadoop-annotations ---
[INFO] Compiling 8 source files to <https://builds.apache.org/job/Hadoop-Common-0.23-Build/ws/trunk/hadoop-common-project/hadoop-annotations/target/classes>
[INFO] 
[INFO] --- maven-resources-plugin:2.2:testResources (default-testResources) @ hadoop-annotations
---
[INFO] Using default encoding to copy filtered resources.
[INFO] 
[INFO] --- maven-compiler-plugin:2.3.2:testCompile (default-testCompile) @ hadoop-annotations
---
[INFO] No sources to compile
[INFO] 
[INFO] --- maven-surefire-plugin:2.10:test (default-test) @ hadoop-annotations ---
[INFO] No tests to run.
[INFO] Surefire report directory: <https://builds.apache.org/job/Hadoop-Common-0.23-Build/ws/trunk/hadoop-common-project/hadoop-annotations/target/surefire-reports>
Downloading: http://repo1.maven.org/maven2/org/apache/maven/surefire/surefire-junit3/2.10/surefire-junit3-2.10.pom
2 KB              
2 KB   
       
Downloaded: http://repo1.maven.org/maven2/org/apache/maven/surefire/surefire-junit3/2.10/surefire-junit3-2.10.pom
(2 KB at 0.8 KB/sec)
Downloading: http://repo1.maven.org/maven2/org/apache/maven/surefire/surefire-providers/2.10/surefire-providers-2.10.pom
886 B   
3 KB    
       
Downloaded: http://repo1.maven.org/maven2/org/apache/maven/surefire/surefire-providers/2.10/surefire-providers-2.10.pom
(3 KB at 1.4 KB/sec)
Downloading: http://repo1.maven.org/maven2/org/apache/maven/surefire/surefire-junit3/2.10/surefire-junit3-2.10.jar
848 B   
2 KB    
2 KB   
3 KB   
3 KB   
4 KB   
4 KB   
5 KB   
5 KB   
6 KB   
7 KB   
7 KB   
8 KB   
8 KB   
9 KB   
9 KB   
10 KB   
10 KB   
11 KB   
11 KB   
12 KB   
12 KB   
13 KB   
13 KB   
14 KB   
14 KB   
15 KB   
15 KB   
16 KB   
16 KB   
17 KB   
18 KB   
18 KB   
19 KB   
19 KB   
20 KB   
20 KB   
21 KB   
21 KB   
22 KB   
22 KB   
23 KB   
24 KB   
26 KB   
        
Downloaded: http://repo1.maven.org/maven2/org/apache/maven/surefire/surefire-junit3/2.10/surefire-junit3-2.10.jar
(26 KB at 9.1 KB/sec)

-------------------------------------------------------
 T E S T S
-------------------------------------------------------

-------------------------------------------------------
 T E S T S
-------------------------------------------------------

Results :

Tests run: 0, Failures: 0, Errors: 0, Skipped: 0

[INFO] 
[INFO] --- maven-clover2-plugin:3.0.5:clover (clover) @ hadoop-annotations ---
[INFO] Setting property: classpath.resource.loader.class => 'org.codehaus.plexus.velocity.ContextClassLoaderResourceLoader'.
[INFO] Setting property: velocimacro.messages.on => 'false'.
[INFO] Setting property: resource.loader => 'classpath'.
[INFO] Setting property: resource.manager.logwhenfound => 'false'.
[INFO] ************************************************************** 
[INFO] Starting Jakarta Velocity v1.4
[INFO] RuntimeInstance initializing.
[INFO] Default Properties File: org/apache/velocity/runtime/defaults/velocity.properties
[INFO] Default ResourceManager initializing. (class org.apache.velocity.runtime.resource.ResourceManagerImpl)
[INFO] Resource Loader Instantiated: org.codehaus.plexus.velocity.ContextClassLoaderResourceLoader
[INFO] ClasspathResourceLoader : initialization starting.
[INFO] ClasspathResourceLoader : initialization complete.
[INFO] ResourceCache : initialized. (class org.apache.velocity.runtime.resource.ResourceCacheImpl)
[INFO] Default ResourceManager initialization complete.
[INFO] Loaded System Directive: org.apache.velocity.runtime.directive.Literal
[INFO] Loaded System Directive: org.apache.velocity.runtime.directive.Macro
[INFO] Loaded System Directive: org.apache.velocity.runtime.directive.Parse
[INFO] Loaded System Directive: org.apache.velocity.runtime.directive.Include
[INFO] Loaded System Directive: org.apache.velocity.runtime.directive.Foreach
[INFO] Created: 20 parsers.
[INFO] Velocimacro : initialization starting.
[INFO] Velocimacro : adding VMs from VM library template : VM_global_library.vm
[ERROR] ResourceManager : unable to find resource 'VM_global_library.vm' in any resource loader.
[INFO] Velocimacro : error using  VM library template VM_global_library.vm : org.apache.velocity.exception.ResourceNotFoundException:
Unable to find resource 'VM_global_library.vm'
[INFO] Velocimacro :  VM library template macro registration complete.
[INFO] Velocimacro : allowInline = true : VMs can be defined inline in templates
[INFO] Velocimacro : allowInlineToOverride = false : VMs defined inline may NOT replace previous
VM definitions
[INFO] Velocimacro : allowInlineLocal = false : VMs defined inline will be  global in scope
if allowed.
[INFO] Velocimacro : initialization complete.
[INFO] Velocity successfully started.
[INFO] Using /default-clover-report descriptor.
[INFO] Using Clover report descriptor: /tmp/mvn2318222272160733472resource
[INFO] Clover Version 3.0.2, built on April 13 2010 (build-790)
[INFO] Loaded from: /home/jenkins/.m2/repository/com/cenqua/clover/clover/3.0.2/clover-3.0.2.jar
[INFO] Clover: Open Source License registered to Apache.
[INFO] Clover is enabled with initstring '<https://builds.apache.org/job/Hadoop-Common-0.23-Build/ws/trunk/hadoop-common-project/hadoop-annotations/target/clover/hadoop-coverage.db'>
[WARNING] Clover historical directory [<https://builds.apache.org/job/Hadoop-Common-0.23-Build/ws/trunk/hadoop-common-project/hadoop-annotations/target/clover/history]>
does not exist, skipping Clover historical report generation ([<https://builds.apache.org/job/Hadoop-Common-0.23-Build/ws/trunk/hadoop-common-project/hadoop-annotations/target/clover])>
[INFO] Clover Version 3.0.2, built on April 13 2010 (build-790)
[INFO] Loaded from: /home/jenkins/.m2/repository/com/cenqua/clover/clover/3.0.2/clover-3.0.2.jar
[INFO] Clover: Open Source License registered to Apache.
[INFO] Loading coverage database from: '<https://builds.apache.org/job/Hadoop-Common-0.23-Build/ws/trunk/hadoop-common-project/hadoop-annotations/target/clover/hadoop-coverage.db'>
[INFO] Writing HTML report to '<https://builds.apache.org/job/Hadoop-Common-0.23-Build/ws/trunk/hadoop-common-project/hadoop-annotations/target/clover'>
[INFO] Done. Processed 2 packages in 897ms (448ms per package).
[INFO] Clover Version 3.0.2, built on April 13 2010 (build-790)
[INFO] Loaded from: /home/jenkins/.m2/repository/com/cenqua/clover/clover/3.0.2/clover-3.0.2.jar
[INFO] Clover: Open Source License registered to Apache.
[INFO] Clover is enabled with initstring '<https://builds.apache.org/job/Hadoop-Common-0.23-Build/ws/trunk/hadoop-common-project/hadoop-annotations/target/clover/hadoop-coverage.db'>
[WARNING] Clover historical directory [<https://builds.apache.org/job/Hadoop-Common-0.23-Build/ws/trunk/hadoop-common-project/hadoop-annotations/target/clover/history]>
does not exist, skipping Clover historical report generation ([<https://builds.apache.org/job/Hadoop-Common-0.23-Build/ws/trunk/hadoop-common-project/hadoop-annotations/target/clover/clover.xml])>
[INFO] Clover Version 3.0.2, built on April 13 2010 (build-790)
[INFO] Loaded from: /home/jenkins/.m2/repository/com/cenqua/clover/clover/3.0.2/clover-3.0.2.jar
[INFO] Clover: Open Source License registered to Apache.
[INFO] Loading coverage database from: '<https://builds.apache.org/job/Hadoop-Common-0.23-Build/ws/trunk/hadoop-common-project/hadoop-annotations/target/clover/hadoop-coverage.db'>
[INFO] Writing report to '<https://builds.apache.org/job/Hadoop-Common-0.23-Build/ws/trunk/hadoop-common-project/hadoop-annotations/target/clover/clover.xml'>
[INFO]                                                                         
[INFO] ------------------------------------------------------------------------
[INFO] Building Apache Hadoop Auth 0.23.3-SNAPSHOT
[INFO] ------------------------------------------------------------------------
[INFO] 
[INFO] --- maven-antrun-plugin:1.6:run (create-testdirs) @ hadoop-auth ---
[INFO] Executing tasks

main:
[INFO] Executed tasks
[INFO] 
[INFO] --- maven-clover2-plugin:3.0.5:setup (setup) @ hadoop-auth ---
[INFO] Clover Version 3.0.2, built on April 13 2010 (build-790)
[INFO] Loaded from: /home/jenkins/.m2/repository/com/cenqua/clover/clover/3.0.2/clover-3.0.2.jar
[INFO] Clover: Open Source License registered to Apache.
[INFO] Creating new database at '<https://builds.apache.org/job/Hadoop-Common-0.23-Build/ws/trunk/hadoop-common-project/hadoop-auth/target/clover/hadoop-coverage.db'.>
[INFO] Processing files at 1.6 source level.
[INFO] Clover all over. Instrumented 13 files (3 packages).
[INFO] Elapsed time = 0.19 secs. (68.421 files/sec, 12,689.474 srclines/sec)
[INFO] Clover Version 3.0.2, built on April 13 2010 (build-790)
[INFO] Loaded from: /home/jenkins/.m2/repository/com/cenqua/clover/clover/3.0.2/clover-3.0.2.jar
[INFO] Clover: Open Source License registered to Apache.
[INFO] Updating existing database at '<https://builds.apache.org/job/Hadoop-Common-0.23-Build/ws/trunk/hadoop-common-project/hadoop-auth/target/clover/hadoop-coverage.db'.>
[INFO] Processing files at 1.6 source level.
[INFO] Clover all over. Instrumented 11 files (4 packages).
[INFO] 55 test methods detected.
[INFO] Elapsed time = 0.27 secs. (40.741 files/sec, 6,659.259 srclines/sec)
[INFO] 
[INFO] --- maven-resources-plugin:2.2:resources (default-resources) @ hadoop-auth ---
[INFO] Using default encoding to copy filtered resources.
[INFO] 
[INFO] --- maven-compiler-plugin:2.3.2:compile (default-compile) @ hadoop-auth ---
[INFO] Compiling 13 source files to <https://builds.apache.org/job/Hadoop-Common-0.23-Build/ws/trunk/hadoop-common-project/hadoop-auth/target/classes>
[WARNING] <https://builds.apache.org/job/Hadoop-Common-0.23-Build/ws/trunk/hadoop-common-project/hadoop-auth/target/clover/src-instrumented/org/apache/hadoop/security/authentication/util/KerberosName.java>:[30,24]
sun.security.krb5.Config is Sun proprietary API and may be removed in a future release
[WARNING] <https://builds.apache.org/job/Hadoop-Common-0.23-Build/ws/trunk/hadoop-common-project/hadoop-auth/target/clover/src-instrumented/org/apache/hadoop/security/authentication/util/KerberosName.java>:[31,24]
sun.security.krb5.KrbException is Sun proprietary API and may be removed in a future release
[WARNING] <https://builds.apache.org/job/Hadoop-Common-0.23-Build/ws/trunk/hadoop-common-project/hadoop-auth/target/clover/src-instrumented/org/apache/hadoop/security/authentication/util/KerberosName.java>:[80,17]
sun.security.krb5.Config is Sun proprietary API and may be removed in a future release
[WARNING] <https://builds.apache.org/job/Hadoop-Common-0.23-Build/ws/trunk/hadoop-common-project/hadoop-auth/target/clover/src-instrumented/org/apache/hadoop/security/authentication/client/KerberosAuthenticator.java>:[21,24]
sun.security.jgss.GSSUtil is Sun proprietary API and may be removed in a future release
[WARNING] <https://builds.apache.org/job/Hadoop-Common-0.23-Build/ws/trunk/hadoop-common-project/hadoop-auth/target/clover/src-instrumented/org/apache/hadoop/security/authentication/util/KerberosName.java>:[84,51]
sun.security.krb5.Config is Sun proprietary API and may be removed in a future release
[WARNING] <https://builds.apache.org/job/Hadoop-Common-0.23-Build/ws/trunk/hadoop-common-project/hadoop-auth/target/clover/src-instrumented/org/apache/hadoop/security/authentication/util/KerberosName.java>:[86,13]
sun.security.krb5.KrbException is Sun proprietary API and may be removed in a future release
[WARNING] <https://builds.apache.org/job/Hadoop-Common-0.23-Build/ws/trunk/hadoop-common-project/hadoop-auth/target/clover/src-instrumented/org/apache/hadoop/security/authentication/client/KerberosAuthenticator.java>:[199,56]
sun.security.jgss.GSSUtil is Sun proprietary API and may be removed in a future release
[WARNING] <https://builds.apache.org/job/Hadoop-Common-0.23-Build/ws/trunk/hadoop-common-project/hadoop-auth/target/clover/src-instrumented/org/apache/hadoop/security/authentication/client/KerberosAuthenticator.java>:[200,97]
sun.security.jgss.GSSUtil is Sun proprietary API and may be removed in a future release
[INFO] 
[INFO] --- maven-resources-plugin:2.2:testResources (default-testResources) @ hadoop-auth
---
[INFO] Using default encoding to copy filtered resources.
[INFO] 
[INFO] --- maven-compiler-plugin:2.3.2:testCompile (default-testCompile) @ hadoop-auth ---
[INFO] Compiling 11 source files to <https://builds.apache.org/job/Hadoop-Common-0.23-Build/ws/trunk/hadoop-common-project/hadoop-auth/target/test-classes>
[WARNING] <https://builds.apache.org/job/Hadoop-Common-0.23-Build/ws/trunk/hadoop-common-project/hadoop-auth/target/clover/src-test-instrumented/org/apache/hadoop/security/authentication/server/TestKerberosAuthenticationHandler.java>:[26,24]
sun.security.jgss.GSSUtil is Sun proprietary API and may be removed in a future release
[WARNING] <https://builds.apache.org/job/Hadoop-Common-0.23-Build/ws/trunk/hadoop-common-project/hadoop-auth/target/clover/src-test-instrumented/org/apache/hadoop/security/authentication/server/TestKerberosAuthenticationHandler.java>:[146,109]
sun.security.jgss.GSSUtil is Sun proprietary API and may be removed in a future release
[WARNING] <https://builds.apache.org/job/Hadoop-Common-0.23-Build/ws/trunk/hadoop-common-project/hadoop-auth/target/clover/src-test-instrumented/org/apache/hadoop/security/authentication/server/TestKerberosAuthenticationHandler.java>:[147,98]
sun.security.jgss.GSSUtil is Sun proprietary API and may be removed in a future release
[INFO] 
[INFO] --- maven-surefire-plugin:2.10:test (default-test) @ hadoop-auth ---
[INFO] Surefire report directory: <https://builds.apache.org/job/Hadoop-Common-0.23-Build/ws/trunk/hadoop-common-project/hadoop-auth/target/surefire-reports>
Downloading: http://repo1.maven.org/maven2/org/apache/maven/surefire/surefire-junit4/2.10/surefire-junit4-2.10.pom
        
[INFO] ------------------------------------------------------------------------
[INFO] Reactor Summary:
[INFO] 
[INFO] Apache Hadoop Annotations ......................... SUCCESS [42.742s]
[INFO] Apache Hadoop Auth ................................ FAILURE [24.336s]
[INFO] Apache Hadoop Auth Examples ....................... SKIPPED
[INFO] Apache Hadoop Common .............................. SKIPPED
[INFO] Apache Hadoop Common Project ...................... SKIPPED
[INFO] ------------------------------------------------------------------------
[INFO] BUILD FAILURE
[INFO] ------------------------------------------------------------------------
[INFO] Total time: 1:07.403s
[INFO] Finished at: Thu Jun 14 09:15:21 UTC 2012
[INFO] Final Memory: 26M/107M
[INFO] ------------------------------------------------------------------------
[ERROR] Failed to execute goal org.apache.maven.plugins:maven-surefire-plugin:2.10:test (default-test)
on project hadoop-auth: Unable to generate classpath: org.apache.maven.artifact.resolver.ArtifactResolutionException:
Unable to get dependency information for org.apache.maven.surefire:surefire-junit4:jar:2.10:
Failed to retrieve POM for org.apache.maven.surefire:surefire-junit4:jar:2.10: Could not transfer
artifact org.apache.maven.surefire:surefire-junit4:pom:2.10 from/to central (http://repo1.maven.org/maven2):
Error transferring file: Connection timed out
[ERROR] org.apache.maven.surefire:surefire-junit4:jar:2.10
[ERROR] 
[ERROR] from the specified remote repositories:
[ERROR] central (http://repo1.maven.org/maven2, releases=true, snapshots=false)
[ERROR] Path to dependency:
[ERROR] 1) dummy:dummy:jar:1.0
[ERROR] -> [Help 1]
[ERROR] 
[ERROR] To see the full stack trace of the errors, re-run Maven with the -e switch.
[ERROR] Re-run Maven using the -X switch to enable full debug logging.
[ERROR] 
[ERROR] For more information about the errors and possible solutions, please read the following
articles:
[ERROR] [Help 1] http://cwiki.apache.org/confluence/display/MAVEN/MojoExecutionException
[ERROR] 
[ERROR] After correcting the problems, you can resume the build with the command
[ERROR]   mvn <goals> -rf :hadoop-auth
Build step 'Execute shell' marked build as failure
[WARNINGS] Skipping publisher since build result is FAILURE
Archiving artifacts
Recording fingerprints
Publishing Javadoc
Recording test results

Mime
View raw message