hadoop-common-dev mailing list archives

Site index · List index
Message view « Date » · « Thread »
Top « Date » · « Thread »
From Apache Jenkins Server <jenk...@builds.apache.org>
Subject Build failed in Jenkins: Hadoop-Common-trunk #380
Date Wed, 18 Apr 2012 09:10:01 GMT
See <https://builds.apache.org/job/Hadoop-Common-trunk/380/changes>

Changes:

[szetszwo] HDFS-3294. Fix code indentation in NamenodeWebHdfsMethods and DatanodeWebHdfsMethods.

[sseth] MAPREDUCE-3972. Fix locking and exception issues in JobHistory server. (Contributed
by Robert Joseph Evans)

[szetszwo] HDFS-2652. Add support for host-based delegation tokens.  Contributed by Daryn
Sharp

[bobby] MAPREDUCE-4134. Remove references of mapred.child.ulimit etc. since they are not being
used any more (Ravi Prakash via bobby)

[tgraves] MAPREDUCE-4151. RM scheduler web page should filter apps to those that are relevant
to scheduling (Jason Lowe via tgraves)

[tgraves] MAPREDUCE-4160. some mrv1 ant tests fail with timeout - due to 4156 (tgraves)

[sseth] MAPREDUCE-3942. Randomize master key generation for ApplicationTokenSecretManager
and roll it every so often. (Contributed by Vinod Kumar Vavilapalli)

[atm] HADOOP-8280. Move VersionUtil/TestVersionUtil and GenericTestUtils from HDFS into Common.
Contributed by Ahmed Radwan.

[atm] Revert HADOOP-8280 so it can be recommitted using `svn mv'

[bobby] Pulled HADOOP-8108 into branch-0.23

[bobby] HADOOP-8227. Allow RPC to limit ephemeral port range. (bobby)

[bobby] HADOOP-8286. Simplify getting a socket address from conf (Daryn Sharp via bobby)

------------------------------------------
[...truncated 44807 lines...]
[DEBUG]   (f) notree = false
[DEBUG]   (f) offlineLinks = []
[DEBUG]   (f) old = false
[DEBUG]   (f) outputDirectory = <https://builds.apache.org/job/Hadoop-Common-trunk/ws/trunk/hadoop-common-project/hadoop-common/api>
[DEBUG]   (f) overview = <https://builds.apache.org/job/Hadoop-Common-trunk/ws/trunk/hadoop-common-project/hadoop-common/src/main/javadoc/overview.html>
[DEBUG]   (f) project = MavenProject: org.apache.hadoop:hadoop-common:3.0.0-SNAPSHOT @ <https://builds.apache.org/job/Hadoop-Common-trunk/ws/trunk/hadoop-common-project/hadoop-common/pom.xml>
[DEBUG]   (f) quiet = true
[DEBUG]   (f) reactorProjects = [MavenProject: org.apache.hadoop:hadoop-annotations:3.0.0-SNAPSHOT
@ <https://builds.apache.org/job/Hadoop-Common-trunk/ws/trunk/hadoop-common-project/hadoop-annotations/pom.xml,>
MavenProject: org.apache.hadoop:hadoop-auth:3.0.0-SNAPSHOT @ <https://builds.apache.org/job/Hadoop-Common-trunk/ws/trunk/hadoop-common-project/hadoop-auth/pom.xml,>
MavenProject: org.apache.hadoop:hadoop-auth-examples:3.0.0-SNAPSHOT @ <https://builds.apache.org/job/Hadoop-Common-trunk/ws/trunk/hadoop-common-project/hadoop-auth-examples/pom.xml,>
MavenProject: org.apache.hadoop:hadoop-common:3.0.0-SNAPSHOT @ <https://builds.apache.org/job/Hadoop-Common-trunk/ws/trunk/hadoop-common-project/hadoop-common/pom.xml,>
MavenProject: org.apache.hadoop:hadoop-common-project:3.0.0-SNAPSHOT @ <https://builds.apache.org/job/Hadoop-Common-trunk/ws/trunk/hadoop-common-project/pom.xml]>
[DEBUG]   (f) remoteRepositories = [       id: apache.snapshots.https
      url: https://repository.apache.org/content/repositories/snapshots
   layout: default
snapshots: [enabled => true, update => daily]
 releases: [enabled => true, update => daily]
,        id: repository.jboss.org
      url: http://repository.jboss.org/nexus/content/groups/public/
   layout: default
snapshots: [enabled => false, update => daily]
 releases: [enabled => true, update => daily]
,        id: central
      url: http://repo1.maven.org/maven2
   layout: default
snapshots: [enabled => false, update => daily]
 releases: [enabled => true, update => daily]
]
[DEBUG]   (s) reportOutputDirectory = <https://builds.apache.org/job/Hadoop-Common-trunk/ws/trunk/hadoop-common-project/hadoop-common/target/site>
[DEBUG]   (f) resourcesArtifacts = []
[DEBUG]   (f) serialwarn = false
[DEBUG]   (f) session = org.apache.maven.execution.MavenSession@13f348b
[DEBUG]   (f) settings = org.apache.maven.execution.SettingsAdapter@1c8f3cd
[DEBUG]   (f) show = protected
[DEBUG]   (f) skip = false
[DEBUG]   (f) sourceDependencyCacheDir = <https://builds.apache.org/job/Hadoop-Common-trunk/ws/trunk/hadoop-common-project/hadoop-common/target/distro-javadoc-sources>
[DEBUG]   (f) splitindex = false
[DEBUG]   (f) stylesheet = java
[DEBUG]   (f) tagletArtifact = groupId = 'null'
artifactId = 'null'
version = 'null'
[DEBUG]   (f) tagletArtifacts = []
[DEBUG]   (f) taglets = []
[DEBUG]   (f) tags = []
[DEBUG]   (f) use = true
[DEBUG]   (f) useStandardDocletOptions = true
[DEBUG]   (f) validateLinks = false
[DEBUG]   (f) verbose = false
[DEBUG]   (f) version = true
[DEBUG]   (f) windowtitle = Apache Hadoop Common 3.0.0-SNAPSHOT API
[DEBUG] -- end configuration --
[DEBUG] org.apache.hadoop:hadoop-annotations:jar:3.0.0-SNAPSHOT (selected for null)
[DEBUG]   jdiff:jdiff:jar:1.0.9:compile (selected for compile)
[DEBUG]   jdk.tools:jdk.tools:jar:1.6:system (selected for system)
[DEBUG] Found Java API link: http://download.oracle.com/javase/6/docs/api/
[DEBUG] Trying to add links for modules...
[DEBUG] /home/jenkins/tools/java/jdk1.6.0_27/jre/../bin/javadoc -J-Xmx512m @options @packages
[INFO] 
ExcludePrivateAnnotationsStandardDoclet
7 warnings
[WARNING] Javadoc Warnings
[WARNING] <https://builds.apache.org/job/Hadoop-Common-trunk/ws/trunk/hadoop-common-project/hadoop-common/src/main/java/org/apache/hadoop/security/SecurityUtil.java>:54:
warning: sun.net.dns.ResolverConfiguration is Sun proprietary API and may be removed in a
future release
[WARNING] import sun.net.dns.ResolverConfiguration;
[WARNING] ^
[WARNING] <https://builds.apache.org/job/Hadoop-Common-trunk/ws/trunk/hadoop-common-project/hadoop-common/src/main/java/org/apache/hadoop/security/SecurityUtil.java>:55:
warning: sun.net.util.IPAddressUtil is Sun proprietary API and may be removed in a future
release
[WARNING] import sun.net.util.IPAddressUtil;
[WARNING] ^
[WARNING] <https://builds.apache.org/job/Hadoop-Common-trunk/ws/trunk/hadoop-common-project/hadoop-common/src/main/java/org/apache/hadoop/io/FastByteComparisons.java>:25:
warning: sun.misc.Unsafe is Sun proprietary API and may be removed in a future release
[WARNING] import sun.misc.Unsafe;
[WARNING] ^
[WARNING] <https://builds.apache.org/job/Hadoop-Common-trunk/ws/trunk/hadoop-common-project/hadoop-common/src/main/java/org/apache/hadoop/io/FastByteComparisons.java>:117:
warning: sun.misc.Unsafe is Sun proprietary API and may be removed in a future release
[WARNING] static final Unsafe theUnsafe;
[WARNING] ^
[WARNING] <https://builds.apache.org/job/Hadoop-Common-trunk/ws/trunk/hadoop-common-project/hadoop-common/src/main/java/org/apache/hadoop/ha/FenceMethod.java>:63:
warning - @param argument "serviceAddr" is not a parameter name.
[WARNING] <https://builds.apache.org/job/Hadoop-Common-trunk/ws/trunk/hadoop-common-project/hadoop-common/src/main/java/org/apache/hadoop/ha/HAServiceProtocol.java>:127:
warning - Tag @see cannot be used in inline documentation.  It can only be used in the following
types of documentation: overview, package, class/interface, constructor, field, method.
[WARNING] <https://builds.apache.org/job/Hadoop-Common-trunk/ws/trunk/hadoop-common-project/hadoop-common/src/main/java/org/apache/hadoop/ha/HAServiceProtocol.java>:127:
warning - Tag @see cannot be used in inline documentation.  It can only be used in the following
types of documentation: overview, package, class/interface, constructor, field, method.
[INFO] 
[INFO] --- maven-assembly-plugin:2.2.1:single (dist) @ hadoop-common ---
[DEBUG] Skipped remote update check for org.apache.hadoop:hadoop-assemblies:3.0.0-SNAPSHOT/maven-metadata.xml,
locally built metadata up-to-date.
[DEBUG] Skipped remote update check for org.apache.hadoop:hadoop-assemblies:3.0.0-SNAPSHOT/maven-metadata.xml,
locally built metadata up-to-date.
[DEBUG] Skipped remote update check for org.apache.hadoop:hadoop-project:3.0.0-SNAPSHOT/maven-metadata.xml,
locally built metadata up-to-date.
[DEBUG] Skipped remote update check for org.apache.hadoop:hadoop-main:3.0.0-SNAPSHOT/maven-metadata.xml,
locally built metadata up-to-date.
[DEBUG] Using connector WagonRepositoryConnector with priority 0 for http://repo1.maven.org/maven2
Downloading: http://repo1.maven.org/maven2/org/apache/maven/maven-core/2.2.1/maven-core-2.2.1.pom
       
[DEBUG] Reading resolution tracking file /home/jenkins/.m2/repository/org/apache/maven/maven-core/2.2.1/maven-core-2.2.1.pom.lastUpdated
[DEBUG] Writing resolution tracking file /home/jenkins/.m2/repository/org/apache/maven/maven-core/2.2.1/maven-core-2.2.1.pom.lastUpdated
[DEBUG] Using connector WagonRepositoryConnector with priority 0 for http://repo1.maven.org/maven2
Downloading: http://repo1.maven.org/maven2/org/codehaus/plexus/plexus-archiver/1.1/plexus-archiver-1.1.pom
2 KB   
2 KB   
       
Downloaded: http://repo1.maven.org/maven2/org/codehaus/plexus/plexus-archiver/1.1/plexus-archiver-1.1.pom
(2 KB at 0.3 KB/sec)
[DEBUG] Reading resolution tracking file /home/jenkins/.m2/repository/org/codehaus/plexus/plexus-archiver/1.1/plexus-archiver-1.1.pom.lastUpdated
[DEBUG] Writing resolution tracking file /home/jenkins/.m2/repository/org/codehaus/plexus/plexus-archiver/1.1/plexus-archiver-1.1.pom.lastUpdated
[DEBUG] Using connector WagonRepositoryConnector with priority 0 for http://repo1.maven.org/maven2
Downloading: http://repo1.maven.org/maven2/org/codehaus/plexus/plexus-io/1.0.1/plexus-io-1.0.1.pom
2 KB   
       
Downloaded: http://repo1.maven.org/maven2/org/codehaus/plexus/plexus-io/1.0.1/plexus-io-1.0.1.pom
(2 KB at 0.9 KB/sec)
[DEBUG] Reading resolution tracking file /home/jenkins/.m2/repository/org/codehaus/plexus/plexus-io/1.0.1/plexus-io-1.0.1.pom.lastUpdated
[DEBUG] Writing resolution tracking file /home/jenkins/.m2/repository/org/codehaus/plexus/plexus-io/1.0.1/plexus-io-1.0.1.pom.lastUpdated
[DEBUG] Using connector WagonRepositoryConnector with priority 0 for http://repo1.maven.org/maven2
Downloading: http://repo1.maven.org/maven2/org/apache/maven/shared/maven-filtering/1.0/maven-filtering-1.0.pom
849 B   
3 KB    
6 KB   
6 KB   
       
Downloaded: http://repo1.maven.org/maven2/org/apache/maven/shared/maven-filtering/1.0/maven-filtering-1.0.pom
(6 KB at 7.8 KB/sec)
[DEBUG] Reading resolution tracking file /home/jenkins/.m2/repository/org/apache/maven/shared/maven-filtering/1.0/maven-filtering-1.0.pom.lastUpdated
[DEBUG] Writing resolution tracking file /home/jenkins/.m2/repository/org/apache/maven/shared/maven-filtering/1.0/maven-filtering-1.0.pom.lastUpdated
[DEBUG] Using connector WagonRepositoryConnector with priority 0 for http://repo1.maven.org/maven2
Downloading: http://repo1.maven.org/maven2/org/apache/maven/shared/maven-repository-builder/1.0-alpha-2/maven-repository-builder-1.0-alpha-2.pom
3 KB   
4 KB   
       
Downloaded: http://repo1.maven.org/maven2/org/apache/maven/shared/maven-repository-builder/1.0-alpha-2/maven-repository-builder-1.0-alpha-2.pom
(4 KB at 1.5 KB/sec)
[DEBUG] Reading resolution tracking file /home/jenkins/.m2/repository/org/apache/maven/shared/maven-repository-builder/1.0-alpha-2/maven-repository-builder-1.0-alpha-2.pom.lastUpdated
[DEBUG] Writing resolution tracking file /home/jenkins/.m2/repository/org/apache/maven/shared/maven-repository-builder/1.0-alpha-2/maven-repository-builder-1.0-alpha-2.pom.lastUpdated
[DEBUG] Using connector WagonRepositoryConnector with priority 0 for http://repo1.maven.org/maven2
Downloading: http://repo1.maven.org/maven2/org/apache/maven/shared/maven-common-artifact-filters/1.0-alpha-1/maven-common-artifact-filters-1.0-alpha-1.pom
2 KB   
       
Downloaded: http://repo1.maven.org/maven2/org/apache/maven/shared/maven-common-artifact-filters/1.0-alpha-1/maven-common-artifact-filters-1.0-alpha-1.pom
(2 KB at 0.6 KB/sec)
[DEBUG] Reading resolution tracking file /home/jenkins/.m2/repository/org/apache/maven/shared/maven-common-artifact-filters/1.0-alpha-1/maven-common-artifact-filters-1.0-alpha-1.pom.lastUpdated
[DEBUG] Writing resolution tracking file /home/jenkins/.m2/repository/org/apache/maven/shared/maven-common-artifact-filters/1.0-alpha-1/maven-common-artifact-filters-1.0-alpha-1.pom.lastUpdated
[DEBUG] Using connector WagonRepositoryConnector with priority 0 for http://repo1.maven.org/maven2
Downloading: http://repo1.maven.org/maven2/org/apache/maven/shared/maven-shared-components/6/maven-shared-components-6.pom
2 KB   
4 KB   
       
Downloaded: http://repo1.maven.org/maven2/org/apache/maven/shared/maven-shared-components/6/maven-shared-components-6.pom
(4 KB at 0.8 KB/sec)
[DEBUG] Reading resolution tracking file /home/jenkins/.m2/repository/org/apache/maven/shared/maven-shared-components/6/maven-shared-components-6.pom.lastUpdated
[DEBUG] Writing resolution tracking file /home/jenkins/.m2/repository/org/apache/maven/shared/maven-shared-components/6/maven-shared-components-6.pom.lastUpdated
[INFO] ------------------------------------------------------------------------
[INFO] Reactor Summary:
[INFO] 
[INFO] Apache Hadoop Annotations ......................... SUCCESS [18.761s]
[INFO] Apache Hadoop Auth ................................ SUCCESS [1:04.064s]
[INFO] Apache Hadoop Auth Examples ....................... SUCCESS [10.505s]
[INFO] Apache Hadoop Common .............................. FAILURE [3:02.868s]
[INFO] Apache Hadoop Common Project ...................... SKIPPED
[INFO] ------------------------------------------------------------------------
[INFO] BUILD FAILURE
[INFO] ------------------------------------------------------------------------
[INFO] Total time: 4:37.307s
[INFO] Finished at: Wed Apr 18 09:09:24 UTC 2012
[INFO] Final Memory: 76M/586M
[INFO] ------------------------------------------------------------------------
[ERROR] Failed to execute goal org.apache.maven.plugins:maven-assembly-plugin:2.2.1:single
(dist) on project hadoop-common: Execution dist of goal org.apache.maven.plugins:maven-assembly-plugin:2.2.1:single
failed: Plugin org.apache.maven.plugins:maven-assembly-plugin:2.2.1 or one of its dependencies
could not be resolved: Failed to collect dependencies for org.apache.maven.plugins:maven-assembly-plugin:jar:2.2.1
(): Failed to read artifact descriptor for org.apache.maven:maven-core:jar:2.2.1: Could not
transfer artifact org.apache.maven:maven-core:pom:2.2.1 from/to central (http://repo1.maven.org/maven2):
Error transferring file: Connection timed out -> [Help 1]
org.apache.maven.lifecycle.LifecycleExecutionException: Failed to execute goal org.apache.maven.plugins:maven-assembly-plugin:2.2.1:single
(dist) on project hadoop-common: Execution dist of goal org.apache.maven.plugins:maven-assembly-plugin:2.2.1:single
failed: Plugin org.apache.maven.plugins:maven-assembly-plugin:2.2.1 or one of its dependencies
could not be resolved: Failed to collect dependencies for org.apache.maven.plugins:maven-assembly-plugin:jar:2.2.1
()
	at org.apache.maven.lifecycle.internal.MojoExecutor.execute(MojoExecutor.java:225)
	at org.apache.maven.lifecycle.internal.MojoExecutor.execute(MojoExecutor.java:153)
	at org.apache.maven.lifecycle.internal.MojoExecutor.execute(MojoExecutor.java:145)
	at org.apache.maven.lifecycle.internal.LifecycleModuleBuilder.buildProject(LifecycleModuleBuilder.java:84)
	at org.apache.maven.lifecycle.internal.LifecycleModuleBuilder.buildProject(LifecycleModuleBuilder.java:59)
	at org.apache.maven.lifecycle.internal.LifecycleStarter.singleThreadedBuild(LifecycleStarter.java:183)
	at org.apache.maven.lifecycle.internal.LifecycleStarter.execute(LifecycleStarter.java:161)
	at org.apache.maven.DefaultMaven.doExecute(DefaultMaven.java:319)
	at org.apache.maven.DefaultMaven.execute(DefaultMaven.java:156)
	at org.apache.maven.cli.MavenCli.execute(MavenCli.java:537)
	at org.apache.maven.cli.MavenCli.doMain(MavenCli.java:196)
	at org.apache.maven.cli.MavenCli.main(MavenCli.java:141)
	at sun.reflect.NativeMethodAccessorImpl.invoke0(Native Method)
	at sun.reflect.NativeMethodAccessorImpl.invoke(NativeMethodAccessorImpl.java:39)
	at sun.reflect.DelegatingMethodAccessorImpl.invoke(DelegatingMethodAccessorImpl.java:25)
	at java.lang.reflect.Method.invoke(Method.java:597)
	at org.codehaus.plexus.classworlds.launcher.Launcher.launchEnhanced(Launcher.java:290)
	at org.codehaus.plexus.classworlds.launcher.Launcher.launch(Launcher.java:230)
	at org.codehaus.plexus.classworlds.launcher.Launcher.mainWithExitCode(Launcher.java:409)
	at org.codehaus.plexus.classworlds.launcher.Launcher.main(Launcher.java:352)
Caused by: org.apache.maven.plugin.PluginExecutionException: Execution dist of goal org.apache.maven.plugins:maven-assembly-plugin:2.2.1:single
failed: Plugin org.apache.maven.plugins:maven-assembly-plugin:2.2.1 or one of its dependencies
could not be resolved: Failed to collect dependencies for org.apache.maven.plugins:maven-assembly-plugin:jar:2.2.1
()
	at org.apache.maven.plugin.DefaultBuildPluginManager.executeMojo(DefaultBuildPluginManager.java:82)
	at org.apache.maven.lifecycle.internal.MojoExecutor.execute(MojoExecutor.java:209)
	... 19 more
Caused by: org.apache.maven.plugin.PluginResolutionException: Plugin org.apache.maven.plugins:maven-assembly-plugin:2.2.1
or one of its dependencies could not be resolved: Failed to collect dependencies for org.apache.maven.plugins:maven-assembly-plugin:jar:2.2.1
()
	at org.apache.maven.plugin.internal.DefaultPluginDependenciesResolver.resolve(DefaultPluginDependenciesResolver.java:211)
	at org.apache.maven.plugin.internal.DefaultMavenPluginManager.createPluginRealm(DefaultMavenPluginManager.java:353)
	at org.apache.maven.plugin.internal.DefaultMavenPluginManager.setupPluginRealm(DefaultMavenPluginManager.java:321)
	at org.apache.maven.plugin.DefaultBuildPluginManager.getPluginRealm(DefaultBuildPluginManager.java:175)
	at org.apache.maven.plugin.DefaultBuildPluginManager.executeMojo(DefaultBuildPluginManager.java:78)
	... 20 more
Caused by: org.sonatype.aether.collection.DependencyCollectionException: Failed to collect
dependencies for org.apache.maven.plugins:maven-assembly-plugin:jar:2.2.1 ()
	at org.sonatype.aether.impl.internal.DefaultDependencyCollector.collectDependencies(DefaultDependencyCollector.java:262)
	at org.sonatype.aether.impl.internal.DefaultRepositorySystem.collectDependencies(DefaultRepositorySystem.java:345)
	at org.apache.maven.plugin.internal.DefaultPluginDependenciesResolver.resolve(DefaultPluginDependenciesResolver.java:199)
	... 24 more
Caused by: org.sonatype.aether.resolution.ArtifactDescriptorException: Failed to read artifact
descriptor for org.apache.maven:maven-core:jar:2.2.1
	at org.apache.maven.repository.internal.DefaultArtifactDescriptorReader.loadPom(DefaultArtifactDescriptorReader.java:282)
	at org.apache.maven.repository.internal.DefaultArtifactDescriptorReader.readArtifactDescriptor(DefaultArtifactDescriptorReader.java:172)
	at org.sonatype.aether.impl.internal.DefaultDependencyCollector.process(DefaultDependencyCollector.java:419)
	at org.sonatype.aether.impl.internal.DefaultDependencyCollector.collectDependencies(DefaultDependencyCollector.java:243)
	... 26 more
Caused by: org.sonatype.aether.resolution.ArtifactResolutionException: Could not transfer
artifact org.apache.maven:maven-core:pom:2.2.1 from/to central (http://repo1.maven.org/maven2):
Error transferring file: Connection timed out
	at org.sonatype.aether.impl.internal.DefaultArtifactResolver.resolve(DefaultArtifactResolver.java:541)
	at org.sonatype.aether.impl.internal.DefaultArtifactResolver.resolveArtifacts(DefaultArtifactResolver.java:220)
	at org.sonatype.aether.impl.internal.DefaultArtifactResolver.resolveArtifact(DefaultArtifactResolver.java:197)
	at org.apache.maven.repository.internal.DefaultArtifactDescriptorReader.loadPom(DefaultArtifactDescriptorReader.java:267)
	... 29 more
Caused by: org.sonatype.aether.transfer.ArtifactTransferException: Could not transfer artifact
org.apache.maven:maven-core:pom:2.2.1 from/to central (http://repo1.maven.org/maven2): Error
transferring file: Connection timed out
	at org.sonatype.aether.connector.wagon.WagonRepositoryConnector$4.wrap(WagonRepositoryConnector.java:949)
	at org.sonatype.aether.connector.wagon.WagonRepositoryConnector$4.wrap(WagonRepositoryConnector.java:940)
	at org.sonatype.aether.connector.wagon.WagonRepositoryConnector$GetTask.flush(WagonRepositoryConnector.java:695)
	at org.sonatype.aether.connector.wagon.WagonRepositoryConnector$GetTask.flush(WagonRepositoryConnector.java:689)
	at org.sonatype.aether.connector.wagon.WagonRepositoryConnector.get(WagonRepositoryConnector.java:445)
	at org.sonatype.aether.impl.internal.DefaultArtifactResolver.resolve(DefaultArtifactResolver.java:460)
	... 32 more
Caused by: org.apache.maven.wagon.TransferFailedException: Error transferring file: Connection
timed out
	at org.apache.maven.wagon.providers.http.LightweightHttpWagon.fillInputData(LightweightHttpWagon.java:143)
	at org.apache.maven.wagon.StreamWagon.getInputStream(StreamWagon.java:116)
	at org.apache.maven.wagon.StreamWagon.getIfNewer(StreamWagon.java:88)
	at org.apache.maven.wagon.StreamWagon.get(StreamWagon.java:61)
	at org.sonatype.aether.connector.wagon.WagonRepositoryConnector$GetTask.run(WagonRepositoryConnector.java:608)
	at org.sonatype.aether.util.concurrency.RunnableErrorForwarder$1.run(RunnableErrorForwarder.java:64)
	at java.util.concurrent.ThreadPoolExecutor$Worker.runTask(ThreadPoolExecutor.java:886)
	at java.util.concurrent.ThreadPoolExecutor$Worker.run(ThreadPoolExecutor.java:908)
	at java.lang.Thread.run(Thread.java:662)
Caused by: java.net.ConnectException: Connection timed out
	at java.net.PlainSocketImpl.socketConnect(Native Method)
	at java.net.PlainSocketImpl.doConnect(PlainSocketImpl.java:351)
	at java.net.PlainSocketImpl.connectToAddress(PlainSocketImpl.java:213)
	at java.net.PlainSocketImpl.connect(PlainSocketImpl.java:200)
	at java.net.SocksSocketImpl.connect(SocksSocketImpl.java:366)
	at java.net.Socket.connect(Socket.java:529)
	at java.net.Socket.connect(Socket.java:478)
	at sun.net.NetworkClient.doConnect(NetworkClient.java:163)
	at sun.net.www.http.HttpClient.openServer(HttpClient.java:395)
	at sun.net.www.http.HttpClient.openServer(HttpClient.java:530)
	at sun.net.www.http.HttpClient.<init>(HttpClient.java:234)
	at sun.net.www.http.HttpClient.New(HttpClient.java:307)
	at sun.net.www.http.HttpClient.New(HttpClient.java:324)
	at sun.net.www.protocol.http.HttpURLConnection.getNewHttpClient(HttpURLConnection.java:970)
	at sun.net.www.protocol.http.HttpURLConnection.plainConnect(HttpURLConnection.java:911)
	at sun.net.www.protocol.http.HttpURLConnection.connect(HttpURLConnection.java:836)
	at sun.net.www.protocol.http.HttpURLConnection.getInputStream(HttpURLConnection.java:1172)
	at java.net.HttpURLConnection.getResponseCode(HttpURLConnection.java:379)
	at org.apache.maven.wagon.providers.http.LightweightHttpWagon.fillInputData(LightweightHttpWagon.java:115)
	... 8 more
[ERROR] 
[ERROR] 
[ERROR] For more information about the errors and possible solutions, please read the following
articles:
[ERROR] [Help 1] http://cwiki.apache.org/confluence/display/MAVEN/PluginResolutionException
[ERROR] 
[ERROR] After correcting the problems, you can resume the build with the command
[ERROR]   mvn <goals> -rf :hadoop-common
+ /home/jenkins/tools/maven/latest/bin/mvn test -Pclover -DcloverLicenseLocation=/home/jenkins/tools/clover/latest/lib/clover.license
Build step 'Execute shell' marked build as failure
[WARNINGS] Skipping publisher since build result is FAILURE
Archiving artifacts
Recording test results
Publishing Javadoc
Recording fingerprints

Mime
View raw message