hadoop-common-dev mailing list archives

Site index · List index
Message view « Date » · « Thread »
Top « Date » · « Thread »
From Apache Jenkins Server <jenk...@builds.apache.org>
Subject Build failed in Jenkins: Hadoop-Common-trunk #346
Date Wed, 14 Mar 2012 09:30:01 GMT
See <https://builds.apache.org/job/Hadoop-Common-trunk/346/changes>

Changes:

[szetszwo] HDFS-3082. Clean up FSDatasetInterface and change DataNode.data to package private.

[suresh] HADOOP-8164. Back slash as path separator is handled for Windows only. Contributed
by Daryn Sharp.

------------------------------------------
[...truncated 50941 lines...]
112 KB   
113 KB   
113 KB   
114 KB   
114 KB   
115 KB   
115 KB   
116 KB   
116 KB   
117 KB   
117 KB   
118 KB   
118 KB   
118 KB   
119 KB   
119 KB   
120 KB   
120 KB   
121 KB   
121 KB   
122 KB   
122 KB   
123 KB   
123 KB   
124 KB   
124 KB   
125 KB   
125 KB   
126 KB   
126 KB   
127 KB   
127 KB   
128 KB   
128 KB   
129 KB   
129 KB   
130 KB   
130 KB   
131 KB   
131 KB   
132 KB   
132 KB   
133 KB   
133 KB   
134 KB   
134 KB   
135 KB   
135 KB   
136 KB   
136 KB   
137 KB   
137 KB   
138 KB   
138 KB   
139 KB   
139 KB   
140 KB   
140 KB   
141 KB   
141 KB   
142 KB   
142 KB   
143 KB   
143 KB   
144 KB   
144 KB   
145 KB   
145 KB   
146 KB   
146 KB   
147 KB   
147 KB   
148 KB   
149 KB   
149 KB   
150 KB   
150 KB   
151 KB   
151 KB   
151 KB   
152 KB   
152 KB   
153 KB   
153 KB   
154 KB   
154 KB   
155 KB   
155 KB   
156 KB   
157 KB   
157 KB   
158 KB   
158 KB   
159 KB   
159 KB   
160 KB   
160 KB   
160 KB   
161 KB   
161 KB   
162 KB   
162 KB   
163 KB   
163 KB   
164 KB   
165 KB   
167 KB   
169 KB   
171 KB   
173 KB   
176 KB   
176 KB   
         
Downloaded: http://repo1.maven.org/maven2/com/thoughtworks/qdox/qdox/1.12/qdox-1.12.jar (176
KB at 132.7 KB/sec)
         
         
         
[DEBUG] Reading resolution tracking file /home/jenkins/.m2/repository/org/apache/maven/shared/maven-invoker/2.0.9/maven-invoker-2.0.9.jar.lastUpdated
[DEBUG] Writing resolution tracking file /home/jenkins/.m2/repository/org/apache/maven/shared/maven-invoker/2.0.9/maven-invoker-2.0.9.jar.lastUpdated
[DEBUG] Reading resolution tracking file /home/jenkins/.m2/repository/org/apache/maven/doxia/doxia-sink-api/1.0/doxia-sink-api-1.0.jar.lastUpdated
[DEBUG] Writing resolution tracking file /home/jenkins/.m2/repository/org/apache/maven/doxia/doxia-sink-api/1.0/doxia-sink-api-1.0.jar.lastUpdated
[DEBUG] Reading resolution tracking file /home/jenkins/.m2/repository/org/apache/maven/doxia/doxia-site-renderer/1.0/doxia-site-renderer-1.0.jar.lastUpdated
[DEBUG] Writing resolution tracking file /home/jenkins/.m2/repository/org/apache/maven/doxia/doxia-site-renderer/1.0/doxia-site-renderer-1.0.jar.lastUpdated
[DEBUG] Reading resolution tracking file /home/jenkins/.m2/repository/org/apache/maven/doxia/doxia-core/1.0/doxia-core-1.0.jar.lastUpdated
[DEBUG] Writing resolution tracking file /home/jenkins/.m2/repository/org/apache/maven/doxia/doxia-core/1.0/doxia-core-1.0.jar.lastUpdated
[DEBUG] Reading resolution tracking file /home/jenkins/.m2/repository/org/apache/maven/doxia/doxia-decoration-model/1.0/doxia-decoration-model-1.0.jar.lastUpdated
[DEBUG] Writing resolution tracking file /home/jenkins/.m2/repository/org/apache/maven/doxia/doxia-decoration-model/1.0/doxia-decoration-model-1.0.jar.lastUpdated
[DEBUG] Reading resolution tracking file /home/jenkins/.m2/repository/org/apache/maven/doxia/doxia-module-apt/1.0/doxia-module-apt-1.0.jar.lastUpdated
[DEBUG] Writing resolution tracking file /home/jenkins/.m2/repository/org/apache/maven/doxia/doxia-module-apt/1.0/doxia-module-apt-1.0.jar.lastUpdated
[DEBUG] Reading resolution tracking file /home/jenkins/.m2/repository/org/apache/maven/doxia/doxia-module-fml/1.0/doxia-module-fml-1.0.jar.lastUpdated
[DEBUG] Writing resolution tracking file /home/jenkins/.m2/repository/org/apache/maven/doxia/doxia-module-fml/1.0/doxia-module-fml-1.0.jar.lastUpdated
[DEBUG] Reading resolution tracking file /home/jenkins/.m2/repository/org/apache/maven/doxia/doxia-module-xdoc/1.0/doxia-module-xdoc-1.0.jar.lastUpdated
[DEBUG] Writing resolution tracking file /home/jenkins/.m2/repository/org/apache/maven/doxia/doxia-module-xdoc/1.0/doxia-module-xdoc-1.0.jar.lastUpdated
[DEBUG] Reading resolution tracking file /home/jenkins/.m2/repository/org/apache/maven/doxia/doxia-module-xhtml/1.0/doxia-module-xhtml-1.0.jar.lastUpdated
[DEBUG] Writing resolution tracking file /home/jenkins/.m2/repository/org/apache/maven/doxia/doxia-module-xhtml/1.0/doxia-module-xhtml-1.0.jar.lastUpdated
[DEBUG] Reading resolution tracking file /home/jenkins/.m2/repository/log4j/log4j/1.2.14/log4j-1.2.14.jar.lastUpdated
[DEBUG] Writing resolution tracking file /home/jenkins/.m2/repository/log4j/log4j/1.2.14/log4j-1.2.14.jar.lastUpdated
[DEBUG] Reading resolution tracking file /home/jenkins/.m2/repository/com/thoughtworks/qdox/qdox/1.12/qdox-1.12.jar.lastUpdated
[DEBUG] Writing resolution tracking file /home/jenkins/.m2/repository/com/thoughtworks/qdox/qdox/1.12/qdox-1.12.jar.lastUpdated
[DEBUG] Reading resolution tracking file /home/jenkins/.m2/repository/org/mockito/mockito-core/1.8.5/mockito-core-1.8.5.jar.lastUpdated
[DEBUG] Writing resolution tracking file /home/jenkins/.m2/repository/org/mockito/mockito-core/1.8.5/mockito-core-1.8.5.jar.lastUpdated
[DEBUG] Reading resolution tracking file /home/jenkins/.m2/repository/org/hamcrest/hamcrest-core/1.1/hamcrest-core-1.1.jar.lastUpdated
[DEBUG] Writing resolution tracking file /home/jenkins/.m2/repository/org/hamcrest/hamcrest-core/1.1/hamcrest-core-1.1.jar.lastUpdated
[DEBUG] Reading resolution tracking file /home/jenkins/.m2/repository/org/objenesis/objenesis/1.0/objenesis-1.0.jar.lastUpdated
[DEBUG] Writing resolution tracking file /home/jenkins/.m2/repository/org/objenesis/objenesis/1.0/objenesis-1.0.jar.lastUpdated
[INFO] ------------------------------------------------------------------------
[INFO] Reactor Summary:
[INFO] 
[INFO] Apache Hadoop Annotations ......................... FAILURE [1:37.142s]
[INFO] Apache Hadoop Auth ................................ SKIPPED
[INFO] Apache Hadoop Auth Examples ....................... SKIPPED
[INFO] Apache Hadoop Common .............................. SKIPPED
[INFO] Apache Hadoop Common Project ...................... SKIPPED
[INFO] ------------------------------------------------------------------------
[INFO] BUILD FAILURE
[INFO] ------------------------------------------------------------------------
[INFO] Total time: 2:38.355s
[INFO] Finished at: Wed Mar 14 09:11:53 UTC 2012
[INFO] Final Memory: 16M/129M
[INFO] ------------------------------------------------------------------------
[ERROR] Failed to execute goal org.apache.maven.plugins:maven-javadoc-plugin:2.8.1:jar (module-javadocs)
on project hadoop-annotations: Execution module-javadocs of goal org.apache.maven.plugins:maven-javadoc-plugin:2.8.1:jar
failed: Plugin org.apache.maven.plugins:maven-javadoc-plugin:2.8.1 or one of its dependencies
could not be resolved: The following artifacts could not be resolved: org.apache.maven.shared:maven-invoker:jar:2.0.9,
org.apache.maven.doxia:doxia-site-renderer:jar:1.0, org.apache.maven.doxia:doxia-core:jar:1.0,
org.apache.maven.doxia:doxia-decoration-model:jar:1.0, org.mockito:mockito-core:jar:1.8.5,
org.hamcrest:hamcrest-core:jar:1.1, org.objenesis:objenesis:jar:1.0: Could not transfer artifact
org.apache.maven.shared:maven-invoker:jar:2.0.9 from/to central (http://repo1.maven.org/maven2):
Error transferring file: Connection timed out -> [Help 1]
org.apache.maven.lifecycle.LifecycleExecutionException: Failed to execute goal org.apache.maven.plugins:maven-javadoc-plugin:2.8.1:jar
(module-javadocs) on project hadoop-annotations: Execution module-javadocs of goal org.apache.maven.plugins:maven-javadoc-plugin:2.8.1:jar
failed: Plugin org.apache.maven.plugins:maven-javadoc-plugin:2.8.1 or one of its dependencies
could not be resolved: The following artifacts could not be resolved: org.apache.maven.shared:maven-invoker:jar:2.0.9,
org.apache.maven.doxia:doxia-site-renderer:jar:1.0, org.apache.maven.doxia:doxia-core:jar:1.0,
org.apache.maven.doxia:doxia-decoration-model:jar:1.0, org.mockito:mockito-core:jar:1.8.5,
org.hamcrest:hamcrest-core:jar:1.1, org.objenesis:objenesis:jar:1.0: Could not transfer artifact
org.apache.maven.shared:maven-invoker:jar:2.0.9 from/to central (http://repo1.maven.org/maven2):
Error transferring file: Connection timed out
	at org.apache.maven.lifecycle.internal.MojoExecutor.execute(MojoExecutor.java:225)
	at org.apache.maven.lifecycle.internal.MojoExecutor.execute(MojoExecutor.java:153)
	at org.apache.maven.lifecycle.internal.MojoExecutor.execute(MojoExecutor.java:145)
	at org.apache.maven.lifecycle.internal.LifecycleModuleBuilder.buildProject(LifecycleModuleBuilder.java:84)
	at org.apache.maven.lifecycle.internal.LifecycleModuleBuilder.buildProject(LifecycleModuleBuilder.java:59)
	at org.apache.maven.lifecycle.internal.LifecycleStarter.singleThreadedBuild(LifecycleStarter.java:183)
	at org.apache.maven.lifecycle.internal.LifecycleStarter.execute(LifecycleStarter.java:161)
	at org.apache.maven.DefaultMaven.doExecute(DefaultMaven.java:319)
	at org.apache.maven.DefaultMaven.execute(DefaultMaven.java:156)
	at org.apache.maven.cli.MavenCli.execute(MavenCli.java:537)
	at org.apache.maven.cli.MavenCli.doMain(MavenCli.java:196)
	at org.apache.maven.cli.MavenCli.main(MavenCli.java:141)
	at sun.reflect.NativeMethodAccessorImpl.invoke0(Native Method)
	at sun.reflect.NativeMethodAccessorImpl.invoke(NativeMethodAccessorImpl.java:39)
	at sun.reflect.DelegatingMethodAccessorImpl.invoke(DelegatingMethodAccessorImpl.java:25)
	at java.lang.reflect.Method.invoke(Method.java:597)
	at org.codehaus.plexus.classworlds.launcher.Launcher.launchEnhanced(Launcher.java:290)
	at org.codehaus.plexus.classworlds.launcher.Launcher.launch(Launcher.java:230)
	at org.codehaus.plexus.classworlds.launcher.Launcher.mainWithExitCode(Launcher.java:409)
	at org.codehaus.plexus.classworlds.launcher.Launcher.main(Launcher.java:352)
Caused by: org.apache.maven.plugin.PluginExecutionException: Execution module-javadocs of
goal org.apache.maven.plugins:maven-javadoc-plugin:2.8.1:jar failed: Plugin org.apache.maven.plugins:maven-javadoc-plugin:2.8.1
or one of its dependencies could not be resolved: The following artifacts could not be resolved:
org.apache.maven.shared:maven-invoker:jar:2.0.9, org.apache.maven.doxia:doxia-site-renderer:jar:1.0,
org.apache.maven.doxia:doxia-core:jar:1.0, org.apache.maven.doxia:doxia-decoration-model:jar:1.0,
org.mockito:mockito-core:jar:1.8.5, org.hamcrest:hamcrest-core:jar:1.1, org.objenesis:objenesis:jar:1.0:
Could not transfer artifact org.apache.maven.shared:maven-invoker:jar:2.0.9 from/to central
(http://repo1.maven.org/maven2): Error transferring file: Connection timed out
	at org.apache.maven.plugin.DefaultBuildPluginManager.executeMojo(DefaultBuildPluginManager.java:82)
	at org.apache.maven.lifecycle.internal.MojoExecutor.execute(MojoExecutor.java:209)
	... 19 more
Caused by: org.apache.maven.plugin.PluginResolutionException: Plugin org.apache.maven.plugins:maven-javadoc-plugin:2.8.1
or one of its dependencies could not be resolved: The following artifacts could not be resolved:
org.apache.maven.shared:maven-invoker:jar:2.0.9, org.apache.maven.doxia:doxia-site-renderer:jar:1.0,
org.apache.maven.doxia:doxia-core:jar:1.0, org.apache.maven.doxia:doxia-decoration-model:jar:1.0,
org.mockito:mockito-core:jar:1.8.5, org.hamcrest:hamcrest-core:jar:1.1, org.objenesis:objenesis:jar:1.0:
Could not transfer artifact org.apache.maven.shared:maven-invoker:jar:2.0.9 from/to central
(http://repo1.maven.org/maven2): Error transferring file: Connection timed out
	at org.apache.maven.plugin.internal.DefaultPluginDependenciesResolver.resolve(DefaultPluginDependenciesResolver.java:215)
	at org.apache.maven.plugin.internal.DefaultMavenPluginManager.createPluginRealm(DefaultMavenPluginManager.java:353)
	at org.apache.maven.plugin.internal.DefaultMavenPluginManager.setupPluginRealm(DefaultMavenPluginManager.java:321)
	at org.apache.maven.plugin.DefaultBuildPluginManager.getPluginRealm(DefaultBuildPluginManager.java:175)
	at org.apache.maven.plugin.DefaultBuildPluginManager.executeMojo(DefaultBuildPluginManager.java:78)
	... 20 more
Caused by: org.sonatype.aether.resolution.ArtifactResolutionException: The following artifacts
could not be resolved: org.apache.maven.shared:maven-invoker:jar:2.0.9, org.apache.maven.doxia:doxia-site-renderer:jar:1.0,
org.apache.maven.doxia:doxia-core:jar:1.0, org.apache.maven.doxia:doxia-decoration-model:jar:1.0,
org.mockito:mockito-core:jar:1.8.5, org.hamcrest:hamcrest-core:jar:1.1, org.objenesis:objenesis:jar:1.0:
Could not transfer artifact org.apache.maven.shared:maven-invoker:jar:2.0.9 from/to central
(http://repo1.maven.org/maven2): Error transferring file: Connection timed out
	at org.sonatype.aether.impl.internal.DefaultArtifactResolver.resolve(DefaultArtifactResolver.java:541)
	at org.sonatype.aether.impl.internal.DefaultArtifactResolver.resolveArtifacts(DefaultArtifactResolver.java:220)
	at org.sonatype.aether.impl.internal.DefaultRepositorySystem.resolveDependencies(DefaultRepositorySystem.java:395)
	at org.apache.maven.plugin.internal.DefaultPluginDependenciesResolver.resolve(DefaultPluginDependenciesResolver.java:207)
	... 24 more
Caused by: org.sonatype.aether.transfer.ArtifactTransferException: Could not transfer artifact
org.apache.maven.shared:maven-invoker:jar:2.0.9 from/to central (http://repo1.maven.org/maven2):
Error transferring file: Connection timed out
	at org.sonatype.aether.connector.wagon.WagonRepositoryConnector$4.wrap(WagonRepositoryConnector.java:949)
	at org.sonatype.aether.connector.wagon.WagonRepositoryConnector$4.wrap(WagonRepositoryConnector.java:940)
	at org.sonatype.aether.connector.wagon.WagonRepositoryConnector$GetTask.flush(WagonRepositoryConnector.java:695)
	at org.sonatype.aether.connector.wagon.WagonRepositoryConnector$GetTask.flush(WagonRepositoryConnector.java:689)
	at org.sonatype.aether.connector.wagon.WagonRepositoryConnector.get(WagonRepositoryConnector.java:445)
	at org.sonatype.aether.impl.internal.DefaultArtifactResolver.resolve(DefaultArtifactResolver.java:460)
	... 27 more
Caused by: org.apache.maven.wagon.TransferFailedException: Error transferring file: Connection
timed out
	at org.apache.maven.wagon.providers.http.LightweightHttpWagon.fillInputData(LightweightHttpWagon.java:143)
	at org.apache.maven.wagon.StreamWagon.getInputStream(StreamWagon.java:116)
	at org.apache.maven.wagon.StreamWagon.getIfNewer(StreamWagon.java:88)
	at org.apache.maven.wagon.StreamWagon.get(StreamWagon.java:61)
	at org.sonatype.aether.connector.wagon.WagonRepositoryConnector$GetTask.run(WagonRepositoryConnector.java:608)
	at org.sonatype.aether.util.concurrency.RunnableErrorForwarder$1.run(RunnableErrorForwarder.java:64)
	at java.util.concurrent.ThreadPoolExecutor$Worker.runTask(ThreadPoolExecutor.java:886)
	at java.util.concurrent.ThreadPoolExecutor$Worker.run(ThreadPoolExecutor.java:908)
	at java.lang.Thread.run(Thread.java:662)
Caused by: java.net.ConnectException: Connection timed out
	at java.net.PlainSocketImpl.socketConnect(Native Method)
	at java.net.PlainSocketImpl.doConnect(PlainSocketImpl.java:351)
	at java.net.PlainSocketImpl.connectToAddress(PlainSocketImpl.java:213)
	at java.net.PlainSocketImpl.connect(PlainSocketImpl.java:200)
	at java.net.SocksSocketImpl.connect(SocksSocketImpl.java:366)
	at java.net.Socket.connect(Socket.java:529)
	at java.net.Socket.connect(Socket.java:478)
	at sun.net.NetworkClient.doConnect(NetworkClient.java:163)
	at sun.net.www.http.HttpClient.openServer(HttpClient.java:394)
	at sun.net.www.http.HttpClient.openServer(HttpClient.java:529)
	at sun.net.www.http.HttpClient.<init>(HttpClient.java:233)
	at sun.net.www.http.HttpClient.New(HttpClient.java:306)
	at sun.net.www.http.HttpClient.New(HttpClient.java:323)
	at sun.net.www.protocol.http.HttpURLConnection.getNewHttpClient(HttpURLConnection.java:970)
	at sun.net.www.protocol.http.HttpURLConnection.plainConnect(HttpURLConnection.java:911)
	at sun.net.www.protocol.http.HttpURLConnection.connect(HttpURLConnection.java:836)
	at sun.net.www.protocol.http.HttpURLConnection.getInputStream(HttpURLConnection.java:1172)
	at java.net.HttpURLConnection.getResponseCode(HttpURLConnection.java:379)
	at org.apache.maven.wagon.providers.http.LightweightHttpWagon.fillInputData(LightweightHttpWagon.java:115)
	... 8 more
[ERROR] 
[ERROR] 
[ERROR] For more information about the errors and possible solutions, please read the following
articles:
[ERROR] [Help 1] http://cwiki.apache.org/confluence/display/MAVEN/PluginResolutionException
+ /home/jenkins/tools/maven/latest/bin/mvn test -Pclover -DcloverLicenseLocation=/home/jenkins/tools/clover/latest/lib/clover.license
Build step 'Execute shell' marked build as failure
[WARNINGS] Skipping publisher since build result is FAILURE
Archiving artifacts
Recording test results
Publishing Javadoc
Recording fingerprints


Mime
View raw message