hadoop-common-dev mailing list archives

Site index · List index
Message view « Date » · « Thread »
Top « Date » · « Thread »
From Apache Jenkins Server <jenk...@builds.apache.org>
Subject Hadoop-Common-22-branch - Build # 101 - Failure
Date Tue, 29 Nov 2011 09:36:59 GMT
See https://builds.apache.org/job/Hadoop-Common-22-branch/101/

###################################################################################
########################## LAST 60 LINES OF THE CONSOLE ###########################
[...truncated 2742 lines...]
     [exec] libtool: install: chmod 644 /home/jenkins/jenkins-slave/workspace/Hadoop-Common-22-branch/trunk/build-fi/system/native/Linux-i386-32/lib/libhadoop.a
     [exec] libtool: install: ranlib /home/jenkins/jenkins-slave/workspace/Hadoop-Common-22-branch/trunk/build-fi/system/native/Linux-i386-32/lib/libhadoop.a
     [exec] libtool: install: warning: remember to run `libtool --finish /usr/local/lib'

compile-core:

jar:
      [tar] Building tar: /home/jenkins/jenkins-slave/workspace/Hadoop-Common-22-branch/trunk/build-fi/system/classes/bin.tgz
      [jar] Building jar: /home/jenkins/jenkins-slave/workspace/Hadoop-Common-22-branch/trunk/build-fi/system/hadoop-common-instrumented-0.22.0.jar
      [jar] Building jar: /home/jenkins/jenkins-slave/workspace/Hadoop-Common-22-branch/trunk/build-fi/system/hadoop-common-instrumented-0.22.0-sources.jar
      [jar] Updating jar: /home/jenkins/jenkins-slave/workspace/Hadoop-Common-22-branch/trunk/build-fi/system/hadoop-common-instrumented-0.22.0-sources.jar

set-version:
     [copy] Copying 1 file to /home/jenkins/jenkins-slave/workspace/Hadoop-Common-22-branch/trunk/ivy
     [copy] Copying 1 file to /home/jenkins/jenkins-slave/workspace/Hadoop-Common-22-branch/trunk/ivy
     [copy] Copying 1 file to /home/jenkins/jenkins-slave/workspace/Hadoop-Common-22-branch/trunk/ivy

clean-sign:

sign:

signanddeploy:

simpledeploy:
[artifact:install-provider] Installing provider: org.apache.maven.wagon:wagon-http:jar:1.0-beta-2:runtime
[artifact:deploy] Deploying to https://repository.apache.org/content/repositories/snapshots
[artifact:deploy] Uploading: org/apache/hadoop/hadoop-common/0.22.0/hadoop-common-0.22.0.jar
to apache.snapshots.https
[artifact:deploy] Uploaded 1355K
[artifact:deploy] An error has occurred while processing the Maven artifact tasks.
[artifact:deploy]  Diagnosis:
[artifact:deploy] 
[artifact:deploy] Error deploying artifact 'org.apache.hadoop:hadoop-common:jar': Error deploying
artifact: Failed to transfer file: https://repository.apache.org/content/repositories/snapshots/org/apache/hadoop/hadoop-common/0.22.0/hadoop-common-0.22.0.jar.
Return code is: 400

BUILD FAILED
/home/jenkins/jenkins-slave/workspace/Hadoop-Common-22-branch/trunk/build.xml:1315: Error
deploying artifact 'org.apache.hadoop:hadoop-common:jar': Error deploying artifact: Failed
to transfer file: https://repository.apache.org/content/repositories/snapshots/org/apache/hadoop/hadoop-common/0.22.0/hadoop-common-0.22.0.jar.
Return code is: 400

Total time: 3 minutes 15 seconds


======================================================================
======================================================================
STORE: saving artifacts
======================================================================
======================================================================


mv: cannot stat `build/test/findbugs': No such file or directory
Build Failed
Build step 'Execute shell' marked build as failure
[FINDBUGS] Skipping publisher since build result is FAILURE
[WARNINGS] Skipping publisher since build result is FAILURE
Archiving artifacts
Recording fingerprints
Recording test results
Publishing Javadoc
Publishing Clover coverage report...
No Clover report will be published due to a Build Failure
Email was triggered for: Failure
Sending email for trigger: Failure



###################################################################################
############################## FAILED TESTS (if any) ##############################
No tests ran.

Mime
View raw message