hadoop-common-dev mailing list archives

Site index · List index
Message view « Date » · « Thread »
Top « Date » · « Thread »
From Apache Jenkins Server <jenk...@builds.apache.org>
Subject Build failed in Jenkins: Hadoop-Common-0.23-Build #70
Date Sat, 19 Nov 2011 09:12:29 GMT
See <https://builds.apache.org/job/Hadoop-Common-0.23-Build/70/changes>

Changes:

[tucu] Merge -r 1203940:1203941 from trunk to branch. FIXES: HADOOP-7590

[todd] HDFS-2563. Some cleanup in BPOfferService. Contributed by Todd Lipcon.

[todd] HDFS-2562. Refactor DN configuration variables out of DataNode class. Contributed by
Todd Lipcon.

------------------------------------------
[...truncated 6289 lines...]
A         buildMR-279Branch.sh
AU        hudsonBuildHadoopPatch.sh
AU        hudsonBuildHadoopRelease.sh
AU        processHadoopPatchEmailRemote.sh
AU        hudsonPatchQueueAdmin.sh
AU        processHadoopPatchEmail.sh
A         README.txt
A         test-patch
A         test-patch/test-patch.sh
At revision 1203963
no change for http://svn.apache.org/repos/asf/hadoop/nightly since the previous build
[Hadoop-Common-0.23-Build] $ /bin/bash -x /tmp/hudson4313395825121431546.sh
+ source <https://builds.apache.org/job/Hadoop-Common-0.23-Build/ws/nightly/hudsonEnv.sh>
++ export JAVA_HOME=/home/jenkins/tools/java/latest
++ JAVA_HOME=/home/jenkins/tools/java/latest
++ export ANT_HOME=/home/jenkins/tools/ant/latest
++ ANT_HOME=/home/jenkins/tools/ant/latest
++ export XERCES_HOME=/home/jenkins/tools/xerces/latest
++ XERCES_HOME=/home/jenkins/tools/xerces/latest
++ export ECLIPSE_HOME=/home/jenkins/tools/eclipse/latest
++ ECLIPSE_HOME=/home/jenkins/tools/eclipse/latest
++ export FORREST_HOME=/home/jenkins/tools/forrest/latest
++ FORREST_HOME=/home/jenkins/tools/forrest/latest
++ export JAVA5_HOME=/home/jenkins/tools/java5/latest
++ JAVA5_HOME=/home/jenkins/tools/java5/latest
++ export FINDBUGS_HOME=/home/jenkins/tools/findbugs/latest
++ FINDBUGS_HOME=/home/jenkins/tools/findbugs/latest
++ export CLOVER_HOME=/home/jenkins/tools/clover/latest
++ CLOVER_HOME=/home/jenkins/tools/clover/latest
++ export MAVEN_HOME=/home/jenkins/tools/maven/latest
++ MAVEN_HOME=/home/jenkins/tools/maven/latest
++ export PATH=/home/hudson/tools/java/latest1.6/bin:/usr/local/sbin:/usr/local/bin:/usr/sbin:/usr/bin:/sbin:/bin:/usr/games:/home/jenkins/tools/java/latest/bin:/home/jenkins/tools/ant/latest/bin:
++ PATH=/home/hudson/tools/java/latest1.6/bin:/usr/local/sbin:/usr/local/bin:/usr/sbin:/usr/bin:/sbin:/bin:/usr/games:/home/jenkins/tools/java/latest/bin:/home/jenkins/tools/ant/latest/bin:
++ export ANT_OPTS=-Xmx2048m
++ ANT_OPTS=-Xmx2048m
++ export MAVEN_OPTS=-Xmx2048m
++ MAVEN_OPTS=-Xmx2048m
++ TRUNK=<https://builds.apache.org/job/Hadoop-Common-0.23-Build/ws/trunk>
++ ulimit -n
32768
+ export MAVEN_OPTS=-Xmx2048m
+ MAVEN_OPTS=-Xmx2048m
+ cd trunk/
+ /home/jenkins/tools/maven/latest/bin/mvn clean install -DskipTests
[INFO] Scanning for projects...
[ERROR] The build could not read 1 project -> [Help 1]
[ERROR]   
[ERROR]   The project org.apache.hadoop:hadoop-mapreduce-examples:0.24.0-SNAPSHOT (<https://builds.apache.org/job/Hadoop-Common-0.23-Build/ws/trunk/hadoop-mapreduce-project/hadoop-mapreduce-examples/pom.xml)>
has 1 error
[ERROR]     'dependencies.dependency.version' for org.apache.hadoop:hadoop-mapreduce-client-jobclient:jar
is missing. @ line 31, column 17
[ERROR] 
[ERROR] To see the full stack trace of the errors, re-run Maven with the -e switch.
[ERROR] Re-run Maven using the -X switch to enable full debug logging.
[ERROR] 
[ERROR] For more information about the errors and possible solutions, please read the following
articles:
[ERROR] [Help 1] http://cwiki.apache.org/confluence/display/MAVEN/ProjectBuildingException
+ cd hadoop-common-project
+ /home/jenkins/tools/maven/latest/bin/mvn clean verify checkstyle:checkstyle findbugs:findbugs
-DskipTests -Pdist -Dtar -Psrc -Pnative -Pdocs
[INFO] Scanning for projects...
[INFO] ------------------------------------------------------------------------
[INFO] Reactor Build Order:
[INFO] 
[INFO] Apache Hadoop Annotations
[INFO] Apache Hadoop Auth
[INFO] Apache Hadoop Auth Examples
[INFO] Apache Hadoop Common
[INFO] Apache Hadoop Common Project
[INFO]                                                                         
[INFO] ------------------------------------------------------------------------
[INFO] Building Apache Hadoop Annotations 0.23.0-SNAPSHOT
[INFO] ------------------------------------------------------------------------
[INFO] 
[INFO] --- maven-clean-plugin:2.4.1:clean (default-clean) @ hadoop-annotations ---
[INFO] 
[INFO] --- maven-resources-plugin:2.4.3:resources (default-resources) @ hadoop-annotations
---
[INFO] Using 'UTF-8' encoding to copy filtered resources.
[INFO] skip non existing resourceDirectory <https://builds.apache.org/job/Hadoop-Common-0.23-Build/ws/trunk/hadoop-common-project/hadoop-annotations/src/main/resources>
[INFO] 
[INFO] --- maven-compiler-plugin:2.3.2:compile (default-compile) @ hadoop-annotations ---
[INFO] Compiling 8 source files to <https://builds.apache.org/job/Hadoop-Common-0.23-Build/ws/trunk/hadoop-common-project/hadoop-annotations/target/classes>
[INFO] 
[INFO] --- maven-resources-plugin:2.4.3:testResources (default-testResources) @ hadoop-annotations
---
[INFO] Using 'UTF-8' encoding to copy filtered resources.
[INFO] skip non existing resourceDirectory <https://builds.apache.org/job/Hadoop-Common-0.23-Build/ws/trunk/hadoop-common-project/hadoop-annotations/src/test/resources>
[INFO] 
[INFO] --- maven-compiler-plugin:2.3.2:testCompile (default-testCompile) @ hadoop-annotations
---
[INFO] No sources to compile
[INFO] 
[INFO] --- maven-surefire-plugin:2.9:test (default-test) @ hadoop-annotations ---
[INFO] Tests are skipped.
[INFO] 
[INFO] --- maven-jar-plugin:2.3.1:jar (default-jar) @ hadoop-annotations ---
[INFO] Building jar: <https://builds.apache.org/job/Hadoop-Common-0.23-Build/ws/trunk/hadoop-common-project/hadoop-annotations/target/hadoop-annotations-0.23.0-SNAPSHOT.jar>
[INFO] 
[INFO] --- maven-javadoc-plugin:2.7:jar (module-javadocs) @ hadoop-annotations ---
[INFO] 
Loading source files for package org.apache.hadoop.classification...
Loading source files for package org.apache.hadoop.classification.tools...
Constructing Javadoc information...
Standard Doclet version 1.6.0_26
Building tree for all the packages and classes...
Generating <https://builds.apache.org/job/Hadoop-Common-0.23-Build/ws/trunk/hadoop-common-project/hadoop-annotations/target/apidocs/org/apache/hadoop/classification//InterfaceAudience.html...>
Generating <https://builds.apache.org/job/Hadoop-Common-0.23-Build/ws/trunk/hadoop-common-project/hadoop-annotations/target/apidocs/org/apache/hadoop/classification//InterfaceAudience.LimitedPrivate.html...>
Generating <https://builds.apache.org/job/Hadoop-Common-0.23-Build/ws/trunk/hadoop-common-project/hadoop-annotations/target/apidocs/org/apache/hadoop/classification//InterfaceAudience.Private.html...>
Generating <https://builds.apache.org/job/Hadoop-Common-0.23-Build/ws/trunk/hadoop-common-project/hadoop-annotations/target/apidocs/org/apache/hadoop/classification//InterfaceAudience.Public.html...>
Generating <https://builds.apache.org/job/Hadoop-Common-0.23-Build/ws/trunk/hadoop-common-project/hadoop-annotations/target/apidocs/org/apache/hadoop/classification//InterfaceStability.html...>
Generating <https://builds.apache.org/job/Hadoop-Common-0.23-Build/ws/trunk/hadoop-common-project/hadoop-annotations/target/apidocs/org/apache/hadoop/classification//InterfaceStability.Evolving.html...>
Generating <https://builds.apache.org/job/Hadoop-Common-0.23-Build/ws/trunk/hadoop-common-project/hadoop-annotations/target/apidocs/org/apache/hadoop/classification//InterfaceStability.Stable.html...>
Generating <https://builds.apache.org/job/Hadoop-Common-0.23-Build/ws/trunk/hadoop-common-project/hadoop-annotations/target/apidocs/org/apache/hadoop/classification//InterfaceStability.Unstable.html...>
Generating <https://builds.apache.org/job/Hadoop-Common-0.23-Build/ws/trunk/hadoop-common-project/hadoop-annotations/target/apidocs/org/apache/hadoop/classification/tools//ExcludePrivateAnnotationsJDiffDoclet.html...>
Generating <https://builds.apache.org/job/Hadoop-Common-0.23-Build/ws/trunk/hadoop-common-project/hadoop-annotations/target/apidocs/org/apache/hadoop/classification/tools//ExcludePrivateAnnotationsStandardDoclet.html...>
Generating <https://builds.apache.org/job/Hadoop-Common-0.23-Build/ws/trunk/hadoop-common-project/hadoop-annotations/target/apidocs/org/apache/hadoop/classification/tools//IncludePublicAnnotationsStandardDoclet.html...>
Generating <https://builds.apache.org/job/Hadoop-Common-0.23-Build/ws/trunk/hadoop-common-project/hadoop-annotations/target/apidocs/overview-frame.html...>
Generating <https://builds.apache.org/job/Hadoop-Common-0.23-Build/ws/trunk/hadoop-common-project/hadoop-annotations/target/apidocs/org/apache/hadoop/classification//package-frame.html...>
Generating <https://builds.apache.org/job/Hadoop-Common-0.23-Build/ws/trunk/hadoop-common-project/hadoop-annotations/target/apidocs/org/apache/hadoop/classification//package-summary.html...>
Generating <https://builds.apache.org/job/Hadoop-Common-0.23-Build/ws/trunk/hadoop-common-project/hadoop-annotations/target/apidocs/org/apache/hadoop/classification//package-tree.html...>
Generating <https://builds.apache.org/job/Hadoop-Common-0.23-Build/ws/trunk/hadoop-common-project/hadoop-annotations/target/apidocs/org/apache/hadoop/classification/tools//package-frame.html...>
Generating <https://builds.apache.org/job/Hadoop-Common-0.23-Build/ws/trunk/hadoop-common-project/hadoop-annotations/target/apidocs/org/apache/hadoop/classification/tools//package-summary.html...>
Generating <https://builds.apache.org/job/Hadoop-Common-0.23-Build/ws/trunk/hadoop-common-project/hadoop-annotations/target/apidocs/org/apache/hadoop/classification/tools//package-tree.html...>
Generating <https://builds.apache.org/job/Hadoop-Common-0.23-Build/ws/trunk/hadoop-common-project/hadoop-annotations/target/apidocs/constant-values.html...>
Generating <https://builds.apache.org/job/Hadoop-Common-0.23-Build/ws/trunk/hadoop-common-project/hadoop-annotations/target/apidocs/org/apache/hadoop/classification//class-use/InterfaceStability.html...>
Generating <https://builds.apache.org/job/Hadoop-Common-0.23-Build/ws/trunk/hadoop-common-project/hadoop-annotations/target/apidocs/org/apache/hadoop/classification//class-use/InterfaceStability.Stable.html...>
Generating <https://builds.apache.org/job/Hadoop-Common-0.23-Build/ws/trunk/hadoop-common-project/hadoop-annotations/target/apidocs/org/apache/hadoop/classification//class-use/InterfaceStability.Evolving.html...>
Generating <https://builds.apache.org/job/Hadoop-Common-0.23-Build/ws/trunk/hadoop-common-project/hadoop-annotations/target/apidocs/org/apache/hadoop/classification//class-use/InterfaceStability.Unstable.html...>
Generating <https://builds.apache.org/job/Hadoop-Common-0.23-Build/ws/trunk/hadoop-common-project/hadoop-annotations/target/apidocs/org/apache/hadoop/classification//class-use/InterfaceAudience.html...>
Generating <https://builds.apache.org/job/Hadoop-Common-0.23-Build/ws/trunk/hadoop-common-project/hadoop-annotations/target/apidocs/org/apache/hadoop/classification//class-use/InterfaceAudience.Public.html...>
Generating <https://builds.apache.org/job/Hadoop-Common-0.23-Build/ws/trunk/hadoop-common-project/hadoop-annotations/target/apidocs/org/apache/hadoop/classification//class-use/InterfaceAudience.LimitedPrivate.html...>
Generating <https://builds.apache.org/job/Hadoop-Common-0.23-Build/ws/trunk/hadoop-common-project/hadoop-annotations/target/apidocs/org/apache/hadoop/classification//class-use/InterfaceAudience.Private.html...>
Generating <https://builds.apache.org/job/Hadoop-Common-0.23-Build/ws/trunk/hadoop-common-project/hadoop-annotations/target/apidocs/org/apache/hadoop/classification/tools//class-use/IncludePublicAnnotationsStandardDoclet.html...>
Generating <https://builds.apache.org/job/Hadoop-Common-0.23-Build/ws/trunk/hadoop-common-project/hadoop-annotations/target/apidocs/org/apache/hadoop/classification/tools//class-use/ExcludePrivateAnnotationsJDiffDoclet.html...>
Generating <https://builds.apache.org/job/Hadoop-Common-0.23-Build/ws/trunk/hadoop-common-project/hadoop-annotations/target/apidocs/org/apache/hadoop/classification/tools//class-use/ExcludePrivateAnnotationsStandardDoclet.html...>
Generating <https://builds.apache.org/job/Hadoop-Common-0.23-Build/ws/trunk/hadoop-common-project/hadoop-annotations/target/apidocs/org/apache/hadoop/classification//package-use.html...>
Generating <https://builds.apache.org/job/Hadoop-Common-0.23-Build/ws/trunk/hadoop-common-project/hadoop-annotations/target/apidocs/org/apache/hadoop/classification/tools//package-use.html...>
Building index for all the packages and classes...
Generating <https://builds.apache.org/job/Hadoop-Common-0.23-Build/ws/trunk/hadoop-common-project/hadoop-annotations/target/apidocs/overview-tree.html...>
Generating <https://builds.apache.org/job/Hadoop-Common-0.23-Build/ws/trunk/hadoop-common-project/hadoop-annotations/target/apidocs/index-all.html...>
Generating <https://builds.apache.org/job/Hadoop-Common-0.23-Build/ws/trunk/hadoop-common-project/hadoop-annotations/target/apidocs/deprecated-list.html...>
Building index for all classes...
Generating <https://builds.apache.org/job/Hadoop-Common-0.23-Build/ws/trunk/hadoop-common-project/hadoop-annotations/target/apidocs/allclasses-frame.html...>
Generating <https://builds.apache.org/job/Hadoop-Common-0.23-Build/ws/trunk/hadoop-common-project/hadoop-annotations/target/apidocs/allclasses-noframe.html...>
Generating <https://builds.apache.org/job/Hadoop-Common-0.23-Build/ws/trunk/hadoop-common-project/hadoop-annotations/target/apidocs/index.html...>
Generating <https://builds.apache.org/job/Hadoop-Common-0.23-Build/ws/trunk/hadoop-common-project/hadoop-annotations/target/apidocs/overview-summary.html...>
Generating <https://builds.apache.org/job/Hadoop-Common-0.23-Build/ws/trunk/hadoop-common-project/hadoop-annotations/target/apidocs/help-doc.html...>
Generating <https://builds.apache.org/job/Hadoop-Common-0.23-Build/ws/trunk/hadoop-common-project/hadoop-annotations/target/apidocs/stylesheet.css...>
[INFO] Building jar: <https://builds.apache.org/job/Hadoop-Common-0.23-Build/ws/trunk/hadoop-common-project/hadoop-annotations/target/hadoop-annotations-0.23.0-SNAPSHOT-javadoc.jar>
[INFO] 
[INFO] --- maven-source-plugin:2.1.2:jar-no-fork (hadoop-java-sources) @ hadoop-annotations
---
[INFO] Building jar: <https://builds.apache.org/job/Hadoop-Common-0.23-Build/ws/trunk/hadoop-common-project/hadoop-annotations/target/hadoop-annotations-0.23.0-SNAPSHOT-sources.jar>
[INFO] 
[INFO] --- maven-site-plugin:3.0:attach-descriptor (attach-descriptor) @ hadoop-annotations
---
[INFO] 
[INFO] --- maven-assembly-plugin:2.2-beta-3:single (src-dist) @ hadoop-annotations ---
[INFO] Reading assembly descriptor: hadoop-assemblies/src/main/resources/assemblies/hadoop-src.xml
[INFO] ------------------------------------------------------------------------
[INFO] Reactor Summary:
[INFO] 
[INFO] Apache Hadoop Annotations ......................... FAILURE [3.846s]
[INFO] Apache Hadoop Auth ................................ SKIPPED
[INFO] Apache Hadoop Auth Examples ....................... SKIPPED
[INFO] Apache Hadoop Common .............................. SKIPPED
[INFO] Apache Hadoop Common Project ...................... SKIPPED
[INFO] ------------------------------------------------------------------------
[INFO] BUILD FAILURE
[INFO] ------------------------------------------------------------------------
[INFO] Total time: 4.726s
[INFO] Finished at: Sat Nov 19 09:01:35 UTC 2011
[INFO] Final Memory: 17M/179M
[INFO] ------------------------------------------------------------------------
[ERROR] Failed to execute goal org.apache.maven.plugins:maven-assembly-plugin:2.2-beta-3:single
(src-dist) on project hadoop-annotations: Error reading assemblies: Error locating assembly
descriptor: hadoop-assemblies/src/main/resources/assemblies/hadoop-src.xml
[ERROR] 
[ERROR] [1] [INFO] Searching for file location: <https://builds.apache.org/job/Hadoop-Common-0.23-Build/ws/trunk/hadoop-common-project/hadoop-annotations/hadoop-assemblies/src/main/resources/assemblies/hadoop-src.xml>
[ERROR] 
[ERROR] [2] [INFO] File: <https://builds.apache.org/job/Hadoop-Common-0.23-Build/ws/trunk/hadoop-common-project/hadoop-annotations/hadoop-assemblies/src/main/resources/assemblies/hadoop-src.xml>
does not exist.
[ERROR] 
[ERROR] [3] [INFO] Invalid artifact specification: 'hadoop-assemblies/src/main/resources/assemblies/hadoop-src.xml'.
Must contain at least three fields, separated by ':'.
[ERROR] 
[ERROR] [4] [INFO] Failed to resolve classpath resource: /assemblies/hadoop-assemblies/src/main/resources/assemblies/hadoop-src.xml
from classloader: ClassRealm[plugin>org.apache.maven.plugins:maven-assembly-plugin:2.2-beta-3,
parent: sun.misc.Launcher$AppClassLoader@126b249]
[ERROR] 
[ERROR] [5] [INFO] Failed to resolve classpath resource: hadoop-assemblies/src/main/resources/assemblies/hadoop-src.xml
from classloader: ClassRealm[plugin>org.apache.maven.plugins:maven-assembly-plugin:2.2-beta-3,
parent: sun.misc.Launcher$AppClassLoader@126b249]
[ERROR] 
[ERROR] [6] [INFO] File: <https://builds.apache.org/job/Hadoop-Common-0.23-Build/ws/trunk/hadoop-common-project/hadoop-assemblies/src/main/resources/assemblies/hadoop-src.xml>
does not exist.
[ERROR] 
[ERROR] [7] [INFO] Building URL from location: hadoop-assemblies/src/main/resources/assemblies/hadoop-src.xml
[ERROR] Error:
[ERROR] java.net.MalformedURLException: no protocol: hadoop-assemblies/src/main/resources/assemblies/hadoop-src.xml
[ERROR] at java.net.URL.<init>(URL.java:567)
[ERROR] at java.net.URL.<init>(URL.java:464)
[ERROR] at java.net.URL.<init>(URL.java:413)
[ERROR] at org.apache.maven.shared.io.location.URLLocatorStrategy.resolve(URLLocatorStrategy.java:54)
[ERROR] at org.apache.maven.shared.io.location.Locator.resolve(Locator.java:81)
[ERROR] at org.apache.maven.plugin.assembly.io.DefaultAssemblyReader.addAssemblyFromDescriptor(DefaultAssemblyReader.java:309)
[ERROR] at org.apache.maven.plugin.assembly.io.DefaultAssemblyReader.readAssemblies(DefaultAssemblyReader.java:140)
[ERROR] at org.apache.maven.plugin.assembly.mojos.AbstractAssemblyMojo.execute(AbstractAssemblyMojo.java:328)
[ERROR] at org.apache.maven.plugin.DefaultBuildPluginManager.executeMojo(DefaultBuildPluginManager.java:101)
[ERROR] at org.apache.maven.lifecycle.internal.MojoExecutor.execute(MojoExecutor.java:209)
[ERROR] at org.apache.maven.lifecycle.internal.MojoExecutor.execute(MojoExecutor.java:153)
[ERROR] at org.apache.maven.lifecycle.internal.MojoExecutor.execute(MojoExecutor.java:145)
[ERROR] at org.apache.maven.lifecycle.internal.LifecycleModuleBuilder.buildProject(LifecycleModuleBuilder.java:84)
[ERROR] at org.apache.maven.lifecycle.internal.LifecycleModuleBuilder.buildProject(LifecycleModuleBuilder.java:59)
[ERROR] at org.apache.maven.lifecycle.internal.LifecycleStarter.singleThreadedBuild(LifecycleStarter.java:183)
[ERROR] at org.apache.maven.lifecycle.internal.LifecycleStarter.execute(LifecycleStarter.java:161)
[ERROR] at org.apache.maven.DefaultMaven.doExecute(DefaultMaven.java:319)
[ERROR] at org.apache.maven.DefaultMaven.execute(DefaultMaven.java:156)
[ERROR] at org.apache.maven.cli.MavenCli.execute(MavenCli.java:537)
[ERROR] at org.apache.maven.cli.MavenCli.doMain(MavenCli.java:196)
[ERROR] at org.apache.maven.cli.MavenCli.main(MavenCli.java:141)
[ERROR] at sun.reflect.NativeMethodAccessorImpl.invoke0(Native Method)
[ERROR] at sun.reflect.NativeMethodAccessorImpl.invoke(NativeMethodAccessorImpl.java:39)
[ERROR] at sun.reflect.DelegatingMethodAccessorImpl.invoke(DelegatingMethodAccessorImpl.java:25)
[ERROR] at java.lang.reflect.Method.invoke(Method.java:597)
[ERROR] at org.codehaus.plexus.classworlds.launcher.Launcher.launchEnhanced(Launcher.java:290)
[ERROR] at org.codehaus.plexus.classworlds.launcher.Launcher.launch(Launcher.java:230)
[ERROR] at org.codehaus.plexus.classworlds.launcher.Launcher.mainWithExitCode(Launcher.java:409)
[ERROR] at org.codehaus.plexus.classworlds.launcher.Launcher.main(Launcher.java:352)
[ERROR] -> [Help 1]
[ERROR] 
[ERROR] To see the full stack trace of the errors, re-run Maven with the -e switch.
[ERROR] Re-run Maven using the -X switch to enable full debug logging.
[ERROR] 
[ERROR] For more information about the errors and possible solutions, please read the following
articles:
[ERROR] [Help 1] http://cwiki.apache.org/confluence/display/MAVEN/MojoExecutionException
+ /home/jenkins/tools/maven/latest/bin/mvn test -Pclover -DcloverLicenseLocation=/home/jenkins/tools/clover/latest/lib/clover.license
[WARNINGS] Parsing warnings in console log with parsers [Java Compiler, JavaDoc]
[WARNINGS] Java Compiler : Found 0 warnings.
[WARNINGS] Java Compiler : Found 0 warnings.
[WARNINGS] JavaDoc : Found 0 warnings.
Archiving artifacts
Publishing Clover coverage report...
Publishing Clover HTML report...
Publishing Clover XML report...
Publishing Clover coverage results...
Recording test results
Publishing Javadoc
ERROR: Publisher hudson.tasks.JavadocArchiver aborted due to exception
<https://builds.apache.org/job/Hadoop-Common-0.23-Build/ws/trunk/hadoop-common-project/hadoop-common/target/site/api>
does not exist.
	at org.apache.tools.ant.types.AbstractFileSet.getDirectoryScanner(AbstractFileSet.java:474)
	at hudson.FilePath$34.hasMatch(FilePath.java:1801)
	at hudson.FilePath$34.invoke(FilePath.java:1710)
	at hudson.FilePath$34.invoke(FilePath.java:1701)
	at hudson.FilePath$FileCallableWrapper.call(FilePath.java:1995)
	at hudson.remoting.UserRequest.perform(UserRequest.java:118)
	at hudson.remoting.UserRequest.perform(UserRequest.java:48)
	at hudson.remoting.Request$2.run(Request.java:287)
	at java.util.concurrent.Executors$RunnableAdapter.call(Executors.java:441)
	at java.util.concurrent.FutureTask$Sync.innerRun(FutureTask.java:303)
	at java.util.concurrent.FutureTask.run(FutureTask.java:138)
	at java.util.concurrent.ThreadPoolExecutor$Worker.runTask(ThreadPoolExecutor.java:886)
	at java.util.concurrent.ThreadPoolExecutor$Worker.run(ThreadPoolExecutor.java:908)
	at java.lang.Thread.run(Thread.java:662)
Recording fingerprints


Mime
View raw message