hadoop-common-dev mailing list archives

Site index · List index
Message view « Date » · « Thread »
Top « Date » · « Thread »
From Apache Jenkins Server <jenk...@builds.apache.org>
Subject Hadoop-Common-22-branch - Build # 93 - Failure
Date Tue, 15 Nov 2011 23:08:04 GMT
See https://builds.apache.org/job/Hadoop-Common-22-branch/93/

###################################################################################
########################## LAST 60 LINES OF THE CONSOLE ###########################
[...truncated 2716 lines...]
[artifact:install-provider]   unspecified:unspecified:jar:0.0
[artifact:install-provider] 
[artifact:install-provider] from the specified remote repositories:
[artifact:install-provider]   central (http://repo1.maven.org/maven2)
[artifact:install-provider] 
[artifact:install-provider] 

BUILD FAILED
/home/jenkins/jenkins-slave/workspace/Hadoop-Common-22-branch/trunk/build.xml:1314: Error
downloading wagon provider from the remote repository: Missing:
----------
1) org.apache.maven.wagon:wagon-http:jar:${wagon-http.version}

  Try downloading the file manually from the project website.

  Then, install it using the command: 
      mvn install:install-file -DgroupId=org.apache.maven.wagon -DartifactId=wagon-http -Dversion=${wagon-http.version}
-Dpackaging=jar -Dfile=/path/to/file

  Alternatively, if you host your own repository you can deploy the file there: 
      mvn deploy:deploy-file -DgroupId=org.apache.maven.wagon -DartifactId=wagon-http -Dversion=${wagon-http.version}
-Dpackaging=jar -Dfile=/path/to/file -Durl=[url] -DrepositoryId=[id]

  Path to dependency: 
  	1) unspecified:unspecified:jar:0.0
  	2) org.apache.maven.wagon:wagon-http:jar:${wagon-http.version}

----------
1 required artifact is missing.

for artifact: 
  unspecified:unspecified:jar:0.0

from the specified remote repositories:
  central (http://repo1.maven.org/maven2)



Total time: 2 minutes 3 seconds


======================================================================
======================================================================
STORE: saving artifacts
======================================================================
======================================================================


mv: cannot stat `build/test/findbugs': No such file or directory
Build Failed
Build step 'Execute shell' marked build as failure
[FINDBUGS] Skipping publisher since build result is FAILURE
[WARNINGS] Skipping publisher since build result is FAILURE
Archiving artifacts
Recording fingerprints
Updating HADOOP-7450
Recording test results
Publishing Javadoc
Publishing Clover coverage report...
No Clover report will be published due to a Build Failure
Email was triggered for: Failure
Sending email for trigger: Failure



###################################################################################
############################## FAILED TESTS (if any) ##############################
No tests ran.

Mime
View raw message