hadoop-common-dev mailing list archives

Site index · List index
Message view « Date » · « Thread »
Top « Date » · « Thread »
From Apache Jenkins Server <jenk...@builds.apache.org>
Subject Build failed in Jenkins: Hadoop-Common-0.23-Build #72
Date Mon, 21 Nov 2011 09:02:16 GMT
See <https://builds.apache.org/job/Hadoop-Common-0.23-Build/72/changes>

Changes:

[mattf] CHANGES.txt formatting cleanup

[eli] HADOOP-6614. svn merge -c 1204388 from trunk

[eli] HADOOP-7783. svn merge -c 1204376 from trunk

[eli] HDFS-2514. svn merge -c 1204370 from trunk

[todd] MAPREDUCE-3437. Fix examples pom to refer to the correct 0.23 snapshot version. Contributed
by Jonathan Eagles.

[todd] HADOOP-7841. Run tests with non-secure random. Contributed by Todd Lipcon.

------------------------------------------
[...truncated 6662 lines...]
[WARNING] <https://builds.apache.org/job/Hadoop-Common-0.23-Build/ws/trunk/hadoop-common-project/hadoop-common/src/main/java/org/apache/hadoop/security/SecurityUtil.java>:[126,6]
sun.security.krb5.PrincipalName is Sun proprietary API and may be removed in a future release
[WARNING] <https://builds.apache.org/job/Hadoop-Common-0.23-Build/ws/trunk/hadoop-common-project/hadoop-common/src/main/java/org/apache/hadoop/security/SecurityUtil.java>:[126,36]
sun.security.krb5.PrincipalName is Sun proprietary API and may be removed in a future release
[WARNING] <https://builds.apache.org/job/Hadoop-Common-0.23-Build/ws/trunk/hadoop-common-project/hadoop-common/src/main/java/org/apache/hadoop/security/SecurityUtil.java>:[127,10]
sun.security.krb5.PrincipalName is Sun proprietary API and may be removed in a future release
[WARNING] <https://builds.apache.org/job/Hadoop-Common-0.23-Build/ws/trunk/hadoop-common-project/hadoop-common/src/main/java/org/apache/hadoop/security/SecurityUtil.java>:[129,23]
sun.security.jgss.krb5.Krb5Util is Sun proprietary API and may be removed in a future release
[WARNING] <https://builds.apache.org/job/Hadoop-Common-0.23-Build/ws/trunk/hadoop-common-project/hadoop-common/src/main/java/org/apache/hadoop/security/SecurityUtil.java>:[128,20]
sun.security.krb5.Credentials is Sun proprietary API and may be removed in a future release
[WARNING] <https://builds.apache.org/job/Hadoop-Common-0.23-Build/ws/trunk/hadoop-common-project/hadoop-common/src/main/java/org/apache/hadoop/security/SecurityUtil.java>:[138,13]
sun.security.jgss.krb5.Krb5Util is Sun proprietary API and may be removed in a future release
[WARNING] <https://builds.apache.org/job/Hadoop-Common-0.23-Build/ws/trunk/hadoop-common-project/hadoop-common/src/main/java/org/apache/hadoop/security/HadoopKerberosName.java>:[43,6]
sun.security.krb5.Config is Sun proprietary API and may be removed in a future release
[WARNING] <https://builds.apache.org/job/Hadoop-Common-0.23-Build/ws/trunk/hadoop-common-project/hadoop-common/src/main/java/org/apache/hadoop/security/HadoopKerberosName.java>:[44,13]
sun.security.krb5.KrbException is Sun proprietary API and may be removed in a future release
[INFO] 14 warnings 
[INFO] -------------------------------------------------------------
[INFO] -------------------------------------------------------------
[ERROR] COMPILATION ERROR : 
[INFO] -------------------------------------------------------------
[ERROR] <https://builds.apache.org/job/Hadoop-Common-0.23-Build/ws/trunk/hadoop-common-project/hadoop-common/src/main/java/org/apache/hadoop/util/RunJar.java>:[171,31]
local variable workDir is accessed from within inner class; needs to be declared final
[INFO] 1 error
[INFO] -------------------------------------------------------------
[INFO] ------------------------------------------------------------------------
[INFO] Reactor Summary:
[INFO] 
[INFO] Apache Hadoop Main ................................ SUCCESS [1.876s]
[INFO] Apache Hadoop Project POM ......................... SUCCESS [0.023s]
[INFO] Apache Hadoop Annotations ......................... SUCCESS [1.104s]
[INFO] Apache Hadoop Project Dist POM .................... SUCCESS [0.165s]
[INFO] Apache Hadoop Assemblies .......................... SUCCESS [0.085s]
[INFO] Apache Hadoop Auth ................................ SUCCESS [1.977s]
[INFO] Apache Hadoop Auth Examples ....................... SUCCESS [1.041s]
[INFO] Apache Hadoop Common .............................. FAILURE [7.484s]
[INFO] Apache Hadoop Common Project ...................... SKIPPED
[INFO] Apache Hadoop HDFS ................................ SKIPPED
[INFO] Apache Hadoop HDFS Project ........................ SKIPPED
[INFO] hadoop-yarn ....................................... SKIPPED
[INFO] hadoop-yarn-api ................................... SKIPPED
[INFO] hadoop-yarn-common ................................ SKIPPED
[INFO] hadoop-yarn-server ................................ SKIPPED
[INFO] hadoop-yarn-server-common ......................... SKIPPED
[INFO] hadoop-yarn-server-nodemanager .................... SKIPPED
[INFO] hadoop-yarn-server-web-proxy ...................... SKIPPED
[INFO] hadoop-yarn-server-resourcemanager ................ SKIPPED
[INFO] hadoop-yarn-server-tests .......................... SKIPPED
[INFO] hadoop-mapreduce-client ........................... SKIPPED
[INFO] hadoop-mapreduce-client-core ...................... SKIPPED
[INFO] hadoop-yarn-applications .......................... SKIPPED
[INFO] hadoop-yarn-applications-distributedshell ......... SKIPPED
[INFO] hadoop-yarn-site .................................. SKIPPED
[INFO] hadoop-mapreduce-client-common .................... SKIPPED
[INFO] hadoop-mapreduce-client-shuffle ................... SKIPPED
[INFO] hadoop-mapreduce-client-app ....................... SKIPPED
[INFO] hadoop-mapreduce-client-hs ........................ SKIPPED
[INFO] hadoop-mapreduce-client-jobclient ................. SKIPPED
[INFO] Apache Hadoop MapReduce Examples .................. SKIPPED
[INFO] hadoop-mapreduce .................................. SKIPPED
[INFO] Apache Hadoop MapReduce Streaming ................. SKIPPED
[INFO] Apache Hadoop Tools ............................... SKIPPED
[INFO] Apache Hadoop Distribution ........................ SKIPPED
[INFO] ------------------------------------------------------------------------
[INFO] BUILD FAILURE
[INFO] ------------------------------------------------------------------------
[INFO] Total time: 22.497s
[INFO] Finished at: Mon Nov 21 09:01:33 UTC 2011
[INFO] Final Memory: 40M/333M
[INFO] ------------------------------------------------------------------------
[ERROR] Failed to execute goal org.apache.maven.plugins:maven-compiler-plugin:2.3.2:compile
(default-compile) on project hadoop-common: Compilation failure
[ERROR] <https://builds.apache.org/job/Hadoop-Common-0.23-Build/ws/trunk/hadoop-common-project/hadoop-common/src/main/java/org/apache/hadoop/util/RunJar.java>:[171,31]
local variable workDir is accessed from within inner class; needs to be declared final
[ERROR] -> [Help 1]
[ERROR] 
[ERROR] To see the full stack trace of the errors, re-run Maven with the -e switch.
[ERROR] Re-run Maven using the -X switch to enable full debug logging.
[ERROR] 
[ERROR] For more information about the errors and possible solutions, please read the following
articles:
[ERROR] [Help 1] http://cwiki.apache.org/confluence/display/MAVEN/MojoFailureException
[ERROR] 
[ERROR] After correcting the problems, you can resume the build with the command
[ERROR]   mvn <goals> -rf :hadoop-common
+ cd hadoop-common-project
+ /home/jenkins/tools/maven/latest/bin/mvn clean verify checkstyle:checkstyle findbugs:findbugs
-DskipTests -Pdist -Dtar -Psrc -Pnative -Pdocs
[INFO] Scanning for projects...
[INFO] ------------------------------------------------------------------------
[INFO] Reactor Build Order:
[INFO] 
[INFO] Apache Hadoop Annotations
[INFO] Apache Hadoop Auth
[INFO] Apache Hadoop Auth Examples
[INFO] Apache Hadoop Common
[INFO] Apache Hadoop Common Project
[INFO]                                                                         
[INFO] ------------------------------------------------------------------------
[INFO] Building Apache Hadoop Annotations 0.23.0-SNAPSHOT
[INFO] ------------------------------------------------------------------------
[INFO] 
[INFO] --- maven-clean-plugin:2.4.1:clean (default-clean) @ hadoop-annotations ---
[INFO] Deleting <https://builds.apache.org/job/Hadoop-Common-0.23-Build/ws/trunk/hadoop-common-project/hadoop-annotations/target>
[INFO] 
[INFO] --- maven-resources-plugin:2.4.3:resources (default-resources) @ hadoop-annotations
---
[INFO] Using 'UTF-8' encoding to copy filtered resources.
[INFO] skip non existing resourceDirectory <https://builds.apache.org/job/Hadoop-Common-0.23-Build/ws/trunk/hadoop-common-project/hadoop-annotations/src/main/resources>
[INFO] 
[INFO] --- maven-compiler-plugin:2.3.2:compile (default-compile) @ hadoop-annotations ---
[INFO] Compiling 8 source files to <https://builds.apache.org/job/Hadoop-Common-0.23-Build/ws/trunk/hadoop-common-project/hadoop-annotations/target/classes>
[INFO] 
[INFO] --- maven-resources-plugin:2.4.3:testResources (default-testResources) @ hadoop-annotations
---
[INFO] Using 'UTF-8' encoding to copy filtered resources.
[INFO] skip non existing resourceDirectory <https://builds.apache.org/job/Hadoop-Common-0.23-Build/ws/trunk/hadoop-common-project/hadoop-annotations/src/test/resources>
[INFO] 
[INFO] --- maven-compiler-plugin:2.3.2:testCompile (default-testCompile) @ hadoop-annotations
---
[INFO] No sources to compile
[INFO] 
[INFO] --- maven-surefire-plugin:2.9:test (default-test) @ hadoop-annotations ---
[INFO] Tests are skipped.
[INFO] 
[INFO] --- maven-jar-plugin:2.3.1:jar (default-jar) @ hadoop-annotations ---
[INFO] Building jar: <https://builds.apache.org/job/Hadoop-Common-0.23-Build/ws/trunk/hadoop-common-project/hadoop-annotations/target/hadoop-annotations-0.23.0-SNAPSHOT.jar>
[INFO] 
[INFO] --- maven-javadoc-plugin:2.7:jar (module-javadocs) @ hadoop-annotations ---
[INFO] 
Loading source files for package org.apache.hadoop.classification...
Loading source files for package org.apache.hadoop.classification.tools...
Constructing Javadoc information...
Standard Doclet version 1.6.0_26
Building tree for all the packages and classes...
Generating <https://builds.apache.org/job/Hadoop-Common-0.23-Build/ws/trunk/hadoop-common-project/hadoop-annotations/target/apidocs/org/apache/hadoop/classification//InterfaceAudience.html...>
Generating <https://builds.apache.org/job/Hadoop-Common-0.23-Build/ws/trunk/hadoop-common-project/hadoop-annotations/target/apidocs/org/apache/hadoop/classification//InterfaceAudience.LimitedPrivate.html...>
Generating <https://builds.apache.org/job/Hadoop-Common-0.23-Build/ws/trunk/hadoop-common-project/hadoop-annotations/target/apidocs/org/apache/hadoop/classification//InterfaceAudience.Private.html...>
Generating <https://builds.apache.org/job/Hadoop-Common-0.23-Build/ws/trunk/hadoop-common-project/hadoop-annotations/target/apidocs/org/apache/hadoop/classification//InterfaceAudience.Public.html...>
Generating <https://builds.apache.org/job/Hadoop-Common-0.23-Build/ws/trunk/hadoop-common-project/hadoop-annotations/target/apidocs/org/apache/hadoop/classification//InterfaceStability.html...>
Generating <https://builds.apache.org/job/Hadoop-Common-0.23-Build/ws/trunk/hadoop-common-project/hadoop-annotations/target/apidocs/org/apache/hadoop/classification//InterfaceStability.Evolving.html...>
Generating <https://builds.apache.org/job/Hadoop-Common-0.23-Build/ws/trunk/hadoop-common-project/hadoop-annotations/target/apidocs/org/apache/hadoop/classification//InterfaceStability.Stable.html...>
Generating <https://builds.apache.org/job/Hadoop-Common-0.23-Build/ws/trunk/hadoop-common-project/hadoop-annotations/target/apidocs/org/apache/hadoop/classification//InterfaceStability.Unstable.html...>
Generating <https://builds.apache.org/job/Hadoop-Common-0.23-Build/ws/trunk/hadoop-common-project/hadoop-annotations/target/apidocs/org/apache/hadoop/classification/tools//ExcludePrivateAnnotationsJDiffDoclet.html...>
Generating <https://builds.apache.org/job/Hadoop-Common-0.23-Build/ws/trunk/hadoop-common-project/hadoop-annotations/target/apidocs/org/apache/hadoop/classification/tools//ExcludePrivateAnnotationsStandardDoclet.html...>
Generating <https://builds.apache.org/job/Hadoop-Common-0.23-Build/ws/trunk/hadoop-common-project/hadoop-annotations/target/apidocs/org/apache/hadoop/classification/tools//IncludePublicAnnotationsStandardDoclet.html...>
Generating <https://builds.apache.org/job/Hadoop-Common-0.23-Build/ws/trunk/hadoop-common-project/hadoop-annotations/target/apidocs/overview-frame.html...>
Generating <https://builds.apache.org/job/Hadoop-Common-0.23-Build/ws/trunk/hadoop-common-project/hadoop-annotations/target/apidocs/org/apache/hadoop/classification//package-frame.html...>
Generating <https://builds.apache.org/job/Hadoop-Common-0.23-Build/ws/trunk/hadoop-common-project/hadoop-annotations/target/apidocs/org/apache/hadoop/classification//package-summary.html...>
Generating <https://builds.apache.org/job/Hadoop-Common-0.23-Build/ws/trunk/hadoop-common-project/hadoop-annotations/target/apidocs/org/apache/hadoop/classification//package-tree.html...>
Generating <https://builds.apache.org/job/Hadoop-Common-0.23-Build/ws/trunk/hadoop-common-project/hadoop-annotations/target/apidocs/org/apache/hadoop/classification/tools//package-frame.html...>
Generating <https://builds.apache.org/job/Hadoop-Common-0.23-Build/ws/trunk/hadoop-common-project/hadoop-annotations/target/apidocs/org/apache/hadoop/classification/tools//package-summary.html...>
Generating <https://builds.apache.org/job/Hadoop-Common-0.23-Build/ws/trunk/hadoop-common-project/hadoop-annotations/target/apidocs/org/apache/hadoop/classification/tools//package-tree.html...>
Generating <https://builds.apache.org/job/Hadoop-Common-0.23-Build/ws/trunk/hadoop-common-project/hadoop-annotations/target/apidocs/constant-values.html...>
Generating <https://builds.apache.org/job/Hadoop-Common-0.23-Build/ws/trunk/hadoop-common-project/hadoop-annotations/target/apidocs/org/apache/hadoop/classification//class-use/InterfaceAudience.html...>
Generating <https://builds.apache.org/job/Hadoop-Common-0.23-Build/ws/trunk/hadoop-common-project/hadoop-annotations/target/apidocs/org/apache/hadoop/classification//class-use/InterfaceAudience.Public.html...>
Generating <https://builds.apache.org/job/Hadoop-Common-0.23-Build/ws/trunk/hadoop-common-project/hadoop-annotations/target/apidocs/org/apache/hadoop/classification//class-use/InterfaceAudience.LimitedPrivate.html...>
Generating <https://builds.apache.org/job/Hadoop-Common-0.23-Build/ws/trunk/hadoop-common-project/hadoop-annotations/target/apidocs/org/apache/hadoop/classification//class-use/InterfaceAudience.Private.html...>
Generating <https://builds.apache.org/job/Hadoop-Common-0.23-Build/ws/trunk/hadoop-common-project/hadoop-annotations/target/apidocs/org/apache/hadoop/classification//class-use/InterfaceStability.html...>
Generating <https://builds.apache.org/job/Hadoop-Common-0.23-Build/ws/trunk/hadoop-common-project/hadoop-annotations/target/apidocs/org/apache/hadoop/classification//class-use/InterfaceStability.Stable.html...>
Generating <https://builds.apache.org/job/Hadoop-Common-0.23-Build/ws/trunk/hadoop-common-project/hadoop-annotations/target/apidocs/org/apache/hadoop/classification//class-use/InterfaceStability.Evolving.html...>
Generating <https://builds.apache.org/job/Hadoop-Common-0.23-Build/ws/trunk/hadoop-common-project/hadoop-annotations/target/apidocs/org/apache/hadoop/classification//class-use/InterfaceStability.Unstable.html...>
Generating <https://builds.apache.org/job/Hadoop-Common-0.23-Build/ws/trunk/hadoop-common-project/hadoop-annotations/target/apidocs/org/apache/hadoop/classification/tools//class-use/ExcludePrivateAnnotationsStandardDoclet.html...>
Generating <https://builds.apache.org/job/Hadoop-Common-0.23-Build/ws/trunk/hadoop-common-project/hadoop-annotations/target/apidocs/org/apache/hadoop/classification/tools//class-use/ExcludePrivateAnnotationsJDiffDoclet.html...>
Generating <https://builds.apache.org/job/Hadoop-Common-0.23-Build/ws/trunk/hadoop-common-project/hadoop-annotations/target/apidocs/org/apache/hadoop/classification/tools//class-use/IncludePublicAnnotationsStandardDoclet.html...>
Generating <https://builds.apache.org/job/Hadoop-Common-0.23-Build/ws/trunk/hadoop-common-project/hadoop-annotations/target/apidocs/org/apache/hadoop/classification//package-use.html...>
Generating <https://builds.apache.org/job/Hadoop-Common-0.23-Build/ws/trunk/hadoop-common-project/hadoop-annotations/target/apidocs/org/apache/hadoop/classification/tools//package-use.html...>
Building index for all the packages and classes...
Generating <https://builds.apache.org/job/Hadoop-Common-0.23-Build/ws/trunk/hadoop-common-project/hadoop-annotations/target/apidocs/overview-tree.html...>
Generating <https://builds.apache.org/job/Hadoop-Common-0.23-Build/ws/trunk/hadoop-common-project/hadoop-annotations/target/apidocs/index-all.html...>
Generating <https://builds.apache.org/job/Hadoop-Common-0.23-Build/ws/trunk/hadoop-common-project/hadoop-annotations/target/apidocs/deprecated-list.html...>
Building index for all classes...
Generating <https://builds.apache.org/job/Hadoop-Common-0.23-Build/ws/trunk/hadoop-common-project/hadoop-annotations/target/apidocs/allclasses-frame.html...>
Generating <https://builds.apache.org/job/Hadoop-Common-0.23-Build/ws/trunk/hadoop-common-project/hadoop-annotations/target/apidocs/allclasses-noframe.html...>
Generating <https://builds.apache.org/job/Hadoop-Common-0.23-Build/ws/trunk/hadoop-common-project/hadoop-annotations/target/apidocs/index.html...>
Generating <https://builds.apache.org/job/Hadoop-Common-0.23-Build/ws/trunk/hadoop-common-project/hadoop-annotations/target/apidocs/overview-summary.html...>
Generating <https://builds.apache.org/job/Hadoop-Common-0.23-Build/ws/trunk/hadoop-common-project/hadoop-annotations/target/apidocs/help-doc.html...>
Generating <https://builds.apache.org/job/Hadoop-Common-0.23-Build/ws/trunk/hadoop-common-project/hadoop-annotations/target/apidocs/stylesheet.css...>
[INFO] Building jar: <https://builds.apache.org/job/Hadoop-Common-0.23-Build/ws/trunk/hadoop-common-project/hadoop-annotations/target/hadoop-annotations-0.23.0-SNAPSHOT-javadoc.jar>
[INFO] 
[INFO] --- maven-source-plugin:2.1.2:jar-no-fork (hadoop-java-sources) @ hadoop-annotations
---
[INFO] Building jar: <https://builds.apache.org/job/Hadoop-Common-0.23-Build/ws/trunk/hadoop-common-project/hadoop-annotations/target/hadoop-annotations-0.23.0-SNAPSHOT-sources.jar>
[INFO] 
[INFO] --- maven-site-plugin:3.0:attach-descriptor (attach-descriptor) @ hadoop-annotations
---
[INFO] 
[INFO] --- maven-assembly-plugin:2.2-beta-3:single (src-dist) @ hadoop-annotations ---
[INFO] Reading assembly descriptor: hadoop-assemblies/src/main/resources/assemblies/hadoop-src.xml
[INFO] ------------------------------------------------------------------------
[INFO] Reactor Summary:
[INFO] 
[INFO] Apache Hadoop Annotations ......................... FAILURE [4.121s]
[INFO] Apache Hadoop Auth ................................ SKIPPED
[INFO] Apache Hadoop Auth Examples ....................... SKIPPED
[INFO] Apache Hadoop Common .............................. SKIPPED
[INFO] Apache Hadoop Common Project ...................... SKIPPED
[INFO] ------------------------------------------------------------------------
[INFO] BUILD FAILURE
[INFO] ------------------------------------------------------------------------
[INFO] Total time: 5.012s
[INFO] Finished at: Mon Nov 21 09:01:39 UTC 2011
[INFO] Final Memory: 17M/177M
[INFO] ------------------------------------------------------------------------
[ERROR] Failed to execute goal org.apache.maven.plugins:maven-assembly-plugin:2.2-beta-3:single
(src-dist) on project hadoop-annotations: Error reading assemblies: Error locating assembly
descriptor: hadoop-assemblies/src/main/resources/assemblies/hadoop-src.xml
[ERROR] 
[ERROR] [1] [INFO] Searching for file location: <https://builds.apache.org/job/Hadoop-Common-0.23-Build/ws/trunk/hadoop-common-project/hadoop-annotations/hadoop-assemblies/src/main/resources/assemblies/hadoop-src.xml>
[ERROR] 
[ERROR] [2] [INFO] File: <https://builds.apache.org/job/Hadoop-Common-0.23-Build/ws/trunk/hadoop-common-project/hadoop-annotations/hadoop-assemblies/src/main/resources/assemblies/hadoop-src.xml>
does not exist.
[ERROR] 
[ERROR] [3] [INFO] Invalid artifact specification: 'hadoop-assemblies/src/main/resources/assemblies/hadoop-src.xml'.
Must contain at least three fields, separated by ':'.
[ERROR] 
[ERROR] [4] [INFO] Failed to resolve classpath resource: /assemblies/hadoop-assemblies/src/main/resources/assemblies/hadoop-src.xml
from classloader: ClassRealm[plugin>org.apache.maven.plugins:maven-assembly-plugin:2.2-beta-3,
parent: sun.misc.Launcher$AppClassLoader@126b249]
[ERROR] 
[ERROR] [5] [INFO] Failed to resolve classpath resource: hadoop-assemblies/src/main/resources/assemblies/hadoop-src.xml
from classloader: ClassRealm[plugin>org.apache.maven.plugins:maven-assembly-plugin:2.2-beta-3,
parent: sun.misc.Launcher$AppClassLoader@126b249]
[ERROR] 
[ERROR] [6] [INFO] File: <https://builds.apache.org/job/Hadoop-Common-0.23-Build/ws/trunk/hadoop-common-project/hadoop-assemblies/src/main/resources/assemblies/hadoop-src.xml>
does not exist.
[ERROR] 
[ERROR] [7] [INFO] Building URL from location: hadoop-assemblies/src/main/resources/assemblies/hadoop-src.xml
[ERROR] Error:
[ERROR] java.net.MalformedURLException: no protocol: hadoop-assemblies/src/main/resources/assemblies/hadoop-src.xml
[ERROR] at java.net.URL.<init>(URL.java:567)
[ERROR] at java.net.URL.<init>(URL.java:464)
[ERROR] at java.net.URL.<init>(URL.java:413)
[ERROR] at org.apache.maven.shared.io.location.URLLocatorStrategy.resolve(URLLocatorStrategy.java:54)
[ERROR] at org.apache.maven.shared.io.location.Locator.resolve(Locator.java:81)
[ERROR] at org.apache.maven.plugin.assembly.io.DefaultAssemblyReader.addAssemblyFromDescriptor(DefaultAssemblyReader.java:309)
[ERROR] at org.apache.maven.plugin.assembly.io.DefaultAssemblyReader.readAssemblies(DefaultAssemblyReader.java:140)
[ERROR] at org.apache.maven.plugin.assembly.mojos.AbstractAssemblyMojo.execute(AbstractAssemblyMojo.java:328)
[ERROR] at org.apache.maven.plugin.DefaultBuildPluginManager.executeMojo(DefaultBuildPluginManager.java:101)
[ERROR] at org.apache.maven.lifecycle.internal.MojoExecutor.execute(MojoExecutor.java:209)
[ERROR] at org.apache.maven.lifecycle.internal.MojoExecutor.execute(MojoExecutor.java:153)
[ERROR] at org.apache.maven.lifecycle.internal.MojoExecutor.execute(MojoExecutor.java:145)
[ERROR] at org.apache.maven.lifecycle.internal.LifecycleModuleBuilder.buildProject(LifecycleModuleBuilder.java:84)
[ERROR] at org.apache.maven.lifecycle.internal.LifecycleModuleBuilder.buildProject(LifecycleModuleBuilder.java:59)
[ERROR] at org.apache.maven.lifecycle.internal.LifecycleStarter.singleThreadedBuild(LifecycleStarter.java:183)
[ERROR] at org.apache.maven.lifecycle.internal.LifecycleStarter.execute(LifecycleStarter.java:161)
[ERROR] at org.apache.maven.DefaultMaven.doExecute(DefaultMaven.java:319)
[ERROR] at org.apache.maven.DefaultMaven.execute(DefaultMaven.java:156)
[ERROR] at org.apache.maven.cli.MavenCli.execute(MavenCli.java:537)
[ERROR] at org.apache.maven.cli.MavenCli.doMain(MavenCli.java:196)
[ERROR] at org.apache.maven.cli.MavenCli.main(MavenCli.java:141)
[ERROR] at sun.reflect.NativeMethodAccessorImpl.invoke0(Native Method)
[ERROR] at sun.reflect.NativeMethodAccessorImpl.invoke(NativeMethodAccessorImpl.java:39)
[ERROR] at sun.reflect.DelegatingMethodAccessorImpl.invoke(DelegatingMethodAccessorImpl.java:25)
[ERROR] at java.lang.reflect.Method.invoke(Method.java:597)
[ERROR] at org.codehaus.plexus.classworlds.launcher.Launcher.launchEnhanced(Launcher.java:290)
[ERROR] at org.codehaus.plexus.classworlds.launcher.Launcher.launch(Launcher.java:230)
[ERROR] at org.codehaus.plexus.classworlds.launcher.Launcher.mainWithExitCode(Launcher.java:409)
[ERROR] at org.codehaus.plexus.classworlds.launcher.Launcher.main(Launcher.java:352)
[ERROR] -> [Help 1]
[ERROR] 
[ERROR] To see the full stack trace of the errors, re-run Maven with the -e switch.
[ERROR] Re-run Maven using the -X switch to enable full debug logging.
[ERROR] 
[ERROR] For more information about the errors and possible solutions, please read the following
articles:
[ERROR] [Help 1] http://cwiki.apache.org/confluence/display/MAVEN/MojoExecutionException
+ /home/jenkins/tools/maven/latest/bin/mvn test -Pclover -DcloverLicenseLocation=/home/jenkins/tools/clover/latest/lib/clover.license
Build step 'Execute shell' marked build as failure
[WARNINGS] Skipping publisher since build result is FAILURE
Archiving artifacts
Publishing Clover coverage report...
Clover xml file does not exist in: <https://builds.apache.org/job/Hadoop-Common-0.23-Build/ws/trunk/hadoop-common-project/hadoop-common/target/clover>
called: clover.xml and will not be copied to: /home/hudson/hudson/jobs/Hadoop-Common-0.23-Build/builds/2011-11-21_09-00-29/clover.xml
Could not find 'trunk/hadoop-common-project/hadoop-common/target/clover//clover.xml'.  Did
you generate the XML report for Clover?
Recording test results
Publishing Javadoc
Recording fingerprints


Mime
View raw message