hadoop-common-dev mailing list archives

Site index · List index
Message view « Date » · « Thread »
Top « Date » · « Thread »
From Apache Jenkins Server <jenk...@builds.apache.org>
Subject Build failed in Jenkins: Hadoop-Common-0.23-Build #51
Date Mon, 31 Oct 2011 09:14:33 GMT
See <https://builds.apache.org/job/Hadoop-Common-0.23-Build/51/changes>

Changes:

[vinodkv] MAPREDUCE-3146. Added a MR specific command line to dump logs for a given TaskAttemptID.
Contributed by Siddharth Seth.
svn merge -c r1195349 --ignore-ancestry ../../trunk

[vinodkv] MAPREDUCE-2766. Fixed NM to set secure permissions for files and directories in
distributed-cache. Contributed by Hitesh Shah.            
svn merge -c r1195340 --ignore-ancestry ../../trunk/

[acmurthy] Adding executable svn prop on mock-container-executor.

[vinodkv] MAPREDUCE-3313. Fixed initialization of ClusterMetrics which was failing TestResourceTrackerService
sometimes. Contributed by Hitesh Shah.
svn merge -c r1195319 --ignore-ancestry ../../trunk/

[mahadev] MAPREDUCE-3171 merge from trunk reverted changes from MAPREDUCE-2747 MAPREDUCE-3240.

[vinodkv] MAPREDUCE-3274. Fixed a race condition in MRAppMaster that was causing a task-scheduling
deadlock. Contributed by Robert Joseph Evans.
svn merge -c r1195145 --ignore-ancestry ../../trunk/

------------------------------------------
[...truncated 7489 lines...]
[INFO] 
[INFO] --- maven-install-plugin:2.3.1:install (default-install) @ hadoop-mapreduce-client-jobclient
---
[INFO] Installing <https://builds.apache.org/job/Hadoop-Common-0.23-Build/ws/trunk/hadoop-mapreduce-project/hadoop-mapreduce-client/hadoop-mapreduce-client-jobclient/target/hadoop-mapreduce-client-jobclient-0.23.0-SNAPSHOT.jar>
to /home/jenkins/.m2/repository/org/apache/hadoop/hadoop-mapreduce-client-jobclient/0.23.0-SNAPSHOT/hadoop-mapreduce-client-jobclient-0.23.0-SNAPSHOT.jar
[INFO] Installing <https://builds.apache.org/job/Hadoop-Common-0.23-Build/ws/trunk/hadoop-mapreduce-project/hadoop-mapreduce-client/hadoop-mapreduce-client-jobclient/pom.xml>
to /home/jenkins/.m2/repository/org/apache/hadoop/hadoop-mapreduce-client-jobclient/0.23.0-SNAPSHOT/hadoop-mapreduce-client-jobclient-0.23.0-SNAPSHOT.pom
[INFO] Installing <https://builds.apache.org/job/Hadoop-Common-0.23-Build/ws/trunk/hadoop-mapreduce-project/hadoop-mapreduce-client/hadoop-mapreduce-client-jobclient/target/hadoop-mapreduce-client-jobclient-0.23.0-SNAPSHOT-tests.jar>
to /home/jenkins/.m2/repository/org/apache/hadoop/hadoop-mapreduce-client-jobclient/0.23.0-SNAPSHOT/hadoop-mapreduce-client-jobclient-0.23.0-SNAPSHOT-tests.jar
[INFO]                                                                         
[INFO] ------------------------------------------------------------------------
[INFO] Building hadoop-mapreduce 0.23.0-SNAPSHOT
[INFO] ------------------------------------------------------------------------
[INFO] 
[INFO] --- maven-clean-plugin:2.4.1:clean (default-clean) @ hadoop-mapreduce ---
[INFO] 
[INFO] --- maven-antrun-plugin:1.6:run (tar) @ hadoop-mapreduce ---
[INFO] Executing tasks

main:
[INFO] Executed tasks
[INFO] 
[INFO] --- maven-site-plugin:3.0:attach-descriptor (attach-descriptor) @ hadoop-mapreduce
---
[INFO] 
[INFO] --- maven-install-plugin:2.3.1:install (default-install) @ hadoop-mapreduce ---
[INFO] Installing <https://builds.apache.org/job/Hadoop-Common-0.23-Build/ws/trunk/hadoop-mapreduce-project/pom.xml>
to /home/jenkins/.m2/repository/org/apache/hadoop/hadoop-mapreduce/0.23.0-SNAPSHOT/hadoop-mapreduce-0.23.0-SNAPSHOT.pom
[INFO]                                                                         
[INFO] ------------------------------------------------------------------------
[INFO] Building Apache Hadoop Tools 0.23.0-SNAPSHOT
[INFO] ------------------------------------------------------------------------
[INFO] 
[INFO] --- maven-clean-plugin:2.4.1:clean (default-clean) @ hadoop-tools-project ---
[INFO] 
[INFO] --- maven-site-plugin:3.0:attach-descriptor (attach-descriptor) @ hadoop-tools-project
---
[INFO] 
[INFO] --- maven-install-plugin:2.3.1:install (default-install) @ hadoop-tools-project ---
[INFO] Installing <https://builds.apache.org/job/Hadoop-Common-0.23-Build/ws/trunk/hadoop-tools/pom.xml>
to /home/jenkins/.m2/repository/org/apache/hadoop/hadoop-tools-project/0.23.0-SNAPSHOT/hadoop-tools-project-0.23.0-SNAPSHOT.pom
[INFO]                                                                         
[INFO] ------------------------------------------------------------------------
[INFO] Building Apache Hadoop Distribution 0.23.0-SNAPSHOT
[INFO] ------------------------------------------------------------------------
[INFO] 
[INFO] --- maven-clean-plugin:2.4.1:clean (default-clean) @ hadoop-dist ---
[INFO] 
[INFO] --- maven-resources-plugin:2.4.3:resources (default-resources) @ hadoop-dist ---
[INFO] Using 'UTF-8' encoding to copy filtered resources.
[INFO] skip non existing resourceDirectory <https://builds.apache.org/job/Hadoop-Common-0.23-Build/ws/trunk/hadoop-dist/src/main/resources>
[INFO] 
[INFO] --- maven-compiler-plugin:2.3.2:compile (default-compile) @ hadoop-dist ---
[INFO] No sources to compile
[INFO] 
[INFO] --- maven-resources-plugin:2.4.3:testResources (default-testResources) @ hadoop-dist
---
[INFO] Using 'UTF-8' encoding to copy filtered resources.
[INFO] skip non existing resourceDirectory <https://builds.apache.org/job/Hadoop-Common-0.23-Build/ws/trunk/hadoop-dist/src/test/resources>
[INFO] 
[INFO] --- maven-compiler-plugin:2.3.2:testCompile (default-testCompile) @ hadoop-dist ---
[INFO] No sources to compile
[INFO] 
[INFO] --- maven-surefire-plugin:2.9:test (default-test) @ hadoop-dist ---
[INFO] Tests are skipped.
[INFO] 
[INFO] --- maven-jar-plugin:2.3.1:jar (default-jar) @ hadoop-dist ---
[WARNING] JAR will be empty - no content was marked for inclusion!
[INFO] Building jar: <https://builds.apache.org/job/Hadoop-Common-0.23-Build/ws/trunk/hadoop-dist/target/hadoop-dist-0.23.0-SNAPSHOT.jar>
[INFO] 
[INFO] --- maven-site-plugin:3.0:attach-descriptor (attach-descriptor) @ hadoop-dist ---
[INFO] 
[INFO] --- maven-install-plugin:2.3.1:install (default-install) @ hadoop-dist ---
[INFO] Installing <https://builds.apache.org/job/Hadoop-Common-0.23-Build/ws/trunk/hadoop-dist/target/hadoop-dist-0.23.0-SNAPSHOT.jar>
to /home/jenkins/.m2/repository/org/apache/hadoop/hadoop-dist/0.23.0-SNAPSHOT/hadoop-dist-0.23.0-SNAPSHOT.jar
[INFO] Installing <https://builds.apache.org/job/Hadoop-Common-0.23-Build/ws/trunk/hadoop-dist/pom.xml>
to /home/jenkins/.m2/repository/org/apache/hadoop/hadoop-dist/0.23.0-SNAPSHOT/hadoop-dist-0.23.0-SNAPSHOT.pom
[INFO] ------------------------------------------------------------------------
[INFO] Reactor Summary:
[INFO] 
[INFO] Apache Hadoop Main ................................ SUCCESS [3.311s]
[INFO] Apache Hadoop Project POM ......................... SUCCESS [0.021s]
[INFO] Apache Hadoop Annotations ......................... SUCCESS [1.134s]
[INFO] Apache Hadoop Project Dist POM .................... SUCCESS [0.152s]
[INFO] Apache Hadoop Assemblies .......................... SUCCESS [0.083s]
[INFO] Apache Hadoop Auth ................................ SUCCESS [8.151s]
[INFO] Apache Hadoop Auth Examples ....................... SUCCESS [1.064s]
[INFO] Apache Hadoop Common .............................. SUCCESS [19.004s]
[INFO] Apache Hadoop Common Project ...................... SUCCESS [0.029s]
[INFO] Apache Hadoop HDFS ................................ SUCCESS [18.349s]
[INFO] Apache Hadoop HDFS Project ........................ SUCCESS [0.026s]
[INFO] hadoop-yarn ....................................... SUCCESS [0.006s]
[INFO] hadoop-yarn-api ................................... SUCCESS [6.324s]
[INFO] hadoop-yarn-common ................................ SUCCESS [8.671s]
[INFO] hadoop-yarn-server ................................ SUCCESS [0.006s]
[INFO] hadoop-yarn-server-common ......................... SUCCESS [3.045s]
[INFO] hadoop-yarn-server-nodemanager .................... SUCCESS [5.467s]
[INFO] hadoop-yarn-server-web-proxy ...................... SUCCESS [1.868s]
[INFO] hadoop-yarn-server-resourcemanager ................ SUCCESS [7.491s]
[INFO] hadoop-yarn-server-tests .......................... SUCCESS [0.880s]
[INFO] hadoop-yarn-applications .......................... SUCCESS [0.006s]
[INFO] hadoop-yarn-applications-distributedshell ......... SUCCESS [4.700s]
[INFO] hadoop-yarn-site .................................. SUCCESS [0.085s]
[INFO] hadoop-mapreduce-client ........................... SUCCESS [0.006s]
[INFO] hadoop-mapreduce-client-core ...................... SUCCESS [7.336s]
[INFO] hadoop-mapreduce-client-common .................... SUCCESS [5.724s]
[INFO] hadoop-mapreduce-client-shuffle ................... SUCCESS [1.494s]
[INFO] hadoop-mapreduce-client-app ....................... SUCCESS [5.938s]
[INFO] hadoop-mapreduce-client-hs ........................ SUCCESS [2.140s]
[INFO] hadoop-mapreduce-client-jobclient ................. SUCCESS [2.209s]
[INFO] hadoop-mapreduce .................................. SUCCESS [0.070s]
[INFO] Apache Hadoop Tools ............................... SUCCESS [0.023s]
[INFO] Apache Hadoop Distribution ........................ SUCCESS [0.081s]
[INFO] ------------------------------------------------------------------------
[INFO] BUILD SUCCESS
[INFO] ------------------------------------------------------------------------
[INFO] Total time: 1:55.797s
[INFO] Finished at: Mon Oct 31 09:03:50 UTC 2011
[INFO] Final Memory: 125M/747M
[INFO] ------------------------------------------------------------------------
+ cd hadoop-common-project
+ /home/jenkins/tools/maven/latest/bin/mvn clean verify checkstyle:checkstyle findbugs:findbugs
-DskipTests -Pdist -Dtar -Psrc -Pnative -Pdocs
[INFO] Scanning for projects...
[INFO] ------------------------------------------------------------------------
[INFO] Reactor Build Order:
[INFO] 
[INFO] Apache Hadoop Annotations
[INFO] Apache Hadoop Auth
[INFO] Apache Hadoop Auth Examples
[INFO] Apache Hadoop Common
[INFO] Apache Hadoop Common Project
[INFO]                                                                         
[INFO] ------------------------------------------------------------------------
[INFO] Building Apache Hadoop Annotations 0.23.0-SNAPSHOT
[INFO] ------------------------------------------------------------------------
[INFO] 
[INFO] --- maven-clean-plugin:2.4.1:clean (default-clean) @ hadoop-annotations ---
[INFO] Deleting <https://builds.apache.org/job/Hadoop-Common-0.23-Build/ws/trunk/hadoop-common-project/hadoop-annotations/target>
[INFO] 
[INFO] --- maven-resources-plugin:2.4.3:resources (default-resources) @ hadoop-annotations
---
[INFO] Using 'UTF-8' encoding to copy filtered resources.
[INFO] skip non existing resourceDirectory <https://builds.apache.org/job/Hadoop-Common-0.23-Build/ws/trunk/hadoop-common-project/hadoop-annotations/src/main/resources>
[INFO] 
[INFO] --- maven-compiler-plugin:2.3.2:compile (default-compile) @ hadoop-annotations ---
[INFO] Compiling 7 source files to <https://builds.apache.org/job/Hadoop-Common-0.23-Build/ws/trunk/hadoop-common-project/hadoop-annotations/target/classes>
[INFO] 
[INFO] --- maven-resources-plugin:2.4.3:testResources (default-testResources) @ hadoop-annotations
---
[INFO] Using 'UTF-8' encoding to copy filtered resources.
[INFO] skip non existing resourceDirectory <https://builds.apache.org/job/Hadoop-Common-0.23-Build/ws/trunk/hadoop-common-project/hadoop-annotations/src/test/resources>
[INFO] 
[INFO] --- maven-compiler-plugin:2.3.2:testCompile (default-testCompile) @ hadoop-annotations
---
[INFO] No sources to compile
[INFO] 
[INFO] --- maven-surefire-plugin:2.9:test (default-test) @ hadoop-annotations ---
[INFO] Tests are skipped.
[INFO] 
[INFO] --- maven-jar-plugin:2.3.1:jar (default-jar) @ hadoop-annotations ---
[INFO] Building jar: <https://builds.apache.org/job/Hadoop-Common-0.23-Build/ws/trunk/hadoop-common-project/hadoop-annotations/target/hadoop-annotations-0.23.0-SNAPSHOT.jar>
[INFO] 
[INFO] --- maven-site-plugin:3.0:attach-descriptor (attach-descriptor) @ hadoop-annotations
---
[INFO] 
[INFO] --- maven-assembly-plugin:2.2-beta-3:single (src-dist) @ hadoop-annotations ---
[INFO] Reading assembly descriptor: hadoop-assemblies/src/main/resources/assemblies/hadoop-src.xml
[INFO] ------------------------------------------------------------------------
[INFO] Reactor Summary:
[INFO] 
[INFO] Apache Hadoop Annotations ......................... FAILURE [2.010s]
[INFO] Apache Hadoop Auth ................................ SKIPPED
[INFO] Apache Hadoop Auth Examples ....................... SKIPPED
[INFO] Apache Hadoop Common .............................. SKIPPED
[INFO] Apache Hadoop Common Project ...................... SKIPPED
[INFO] ------------------------------------------------------------------------
[INFO] BUILD FAILURE
[INFO] ------------------------------------------------------------------------
[INFO] Total time: 2.920s
[INFO] Finished at: Mon Oct 31 09:03:55 UTC 2011
[INFO] Final Memory: 16M/175M
[INFO] ------------------------------------------------------------------------
[ERROR] Failed to execute goal org.apache.maven.plugins:maven-assembly-plugin:2.2-beta-3:single
(src-dist) on project hadoop-annotations: Error reading assemblies: Error locating assembly
descriptor: hadoop-assemblies/src/main/resources/assemblies/hadoop-src.xml
[ERROR] 
[ERROR] [1] [INFO] Searching for file location: <https://builds.apache.org/job/Hadoop-Common-0.23-Build/ws/trunk/hadoop-common-project/hadoop-annotations/hadoop-assemblies/src/main/resources/assemblies/hadoop-src.xml>
[ERROR] 
[ERROR] [2] [INFO] File: <https://builds.apache.org/job/Hadoop-Common-0.23-Build/ws/trunk/hadoop-common-project/hadoop-annotations/hadoop-assemblies/src/main/resources/assemblies/hadoop-src.xml>
does not exist.
[ERROR] 
[ERROR] [3] [INFO] Invalid artifact specification: 'hadoop-assemblies/src/main/resources/assemblies/hadoop-src.xml'.
Must contain at least three fields, separated by ':'.
[ERROR] 
[ERROR] [4] [INFO] Failed to resolve classpath resource: /assemblies/hadoop-assemblies/src/main/resources/assemblies/hadoop-src.xml
from classloader: ClassRealm[plugin>org.apache.maven.plugins:maven-assembly-plugin:2.2-beta-3,
parent: sun.misc.Launcher$AppClassLoader@126b249]
[ERROR] 
[ERROR] [5] [INFO] Failed to resolve classpath resource: hadoop-assemblies/src/main/resources/assemblies/hadoop-src.xml
from classloader: ClassRealm[plugin>org.apache.maven.plugins:maven-assembly-plugin:2.2-beta-3,
parent: sun.misc.Launcher$AppClassLoader@126b249]
[ERROR] 
[ERROR] [6] [INFO] File: <https://builds.apache.org/job/Hadoop-Common-0.23-Build/ws/trunk/hadoop-common-project/hadoop-assemblies/src/main/resources/assemblies/hadoop-src.xml>
does not exist.
[ERROR] 
[ERROR] [7] [INFO] Building URL from location: hadoop-assemblies/src/main/resources/assemblies/hadoop-src.xml
[ERROR] Error:
[ERROR] java.net.MalformedURLException: no protocol: hadoop-assemblies/src/main/resources/assemblies/hadoop-src.xml
[ERROR] at java.net.URL.<init>(URL.java:567)
[ERROR] at java.net.URL.<init>(URL.java:464)
[ERROR] at java.net.URL.<init>(URL.java:413)
[ERROR] at org.apache.maven.shared.io.location.URLLocatorStrategy.resolve(URLLocatorStrategy.java:54)
[ERROR] at org.apache.maven.shared.io.location.Locator.resolve(Locator.java:81)
[ERROR] at org.apache.maven.plugin.assembly.io.DefaultAssemblyReader.addAssemblyFromDescriptor(DefaultAssemblyReader.java:309)
[ERROR] at org.apache.maven.plugin.assembly.io.DefaultAssemblyReader.readAssemblies(DefaultAssemblyReader.java:140)
[ERROR] at org.apache.maven.plugin.assembly.mojos.AbstractAssemblyMojo.execute(AbstractAssemblyMojo.java:328)
[ERROR] at org.apache.maven.plugin.DefaultBuildPluginManager.executeMojo(DefaultBuildPluginManager.java:101)
[ERROR] at org.apache.maven.lifecycle.internal.MojoExecutor.execute(MojoExecutor.java:209)
[ERROR] at org.apache.maven.lifecycle.internal.MojoExecutor.execute(MojoExecutor.java:153)
[ERROR] at org.apache.maven.lifecycle.internal.MojoExecutor.execute(MojoExecutor.java:145)
[ERROR] at org.apache.maven.lifecycle.internal.LifecycleModuleBuilder.buildProject(LifecycleModuleBuilder.java:84)
[ERROR] at org.apache.maven.lifecycle.internal.LifecycleModuleBuilder.buildProject(LifecycleModuleBuilder.java:59)
[ERROR] at org.apache.maven.lifecycle.internal.LifecycleStarter.singleThreadedBuild(LifecycleStarter.java:183)
[ERROR] at org.apache.maven.lifecycle.internal.LifecycleStarter.execute(LifecycleStarter.java:161)
[ERROR] at org.apache.maven.DefaultMaven.doExecute(DefaultMaven.java:319)
[ERROR] at org.apache.maven.DefaultMaven.execute(DefaultMaven.java:156)
[ERROR] at org.apache.maven.cli.MavenCli.execute(MavenCli.java:537)
[ERROR] at org.apache.maven.cli.MavenCli.doMain(MavenCli.java:196)
[ERROR] at org.apache.maven.cli.MavenCli.main(MavenCli.java:141)
[ERROR] at sun.reflect.NativeMethodAccessorImpl.invoke0(Native Method)
[ERROR] at sun.reflect.NativeMethodAccessorImpl.invoke(NativeMethodAccessorImpl.java:39)
[ERROR] at sun.reflect.DelegatingMethodAccessorImpl.invoke(DelegatingMethodAccessorImpl.java:25)
[ERROR] at java.lang.reflect.Method.invoke(Method.java:597)
[ERROR] at org.codehaus.plexus.classworlds.launcher.Launcher.launchEnhanced(Launcher.java:290)
[ERROR] at org.codehaus.plexus.classworlds.launcher.Launcher.launch(Launcher.java:230)
[ERROR] at org.codehaus.plexus.classworlds.launcher.Launcher.mainWithExitCode(Launcher.java:409)
[ERROR] at org.codehaus.plexus.classworlds.launcher.Launcher.main(Launcher.java:352)
[ERROR] -> [Help 1]
[ERROR] 
[ERROR] To see the full stack trace of the errors, re-run Maven with the -e switch.
[ERROR] Re-run Maven using the -X switch to enable full debug logging.
[ERROR] 
[ERROR] For more information about the errors and possible solutions, please read the following
articles:
[ERROR] [Help 1] http://cwiki.apache.org/confluence/display/MAVEN/MojoExecutionException
+ /home/jenkins/tools/maven/latest/bin/mvn test -Pclover -DcloverLicenseLocation=/home/jenkins/tools/clover/latest/lib/clover.license
[WARNINGS] Parsing warnings in console log with parsers [Java Compiler, JavaDoc]
[WARNINGS] Java Compiler : Found 25 warnings.
[WARNINGS] Java Compiler : Found 0 warnings.
[WARNINGS] JavaDoc : Found 0 warnings.
Archiving artifacts
Publishing Clover coverage report...
Publishing Clover HTML report...
Publishing Clover XML report...
Publishing Clover coverage results...
Recording test results
Publishing Javadoc
ERROR: Publisher hudson.tasks.JavadocArchiver aborted due to exception
<https://builds.apache.org/job/Hadoop-Common-0.23-Build/ws/trunk/hadoop-common-project/hadoop-common/target/site/api>
does not exist.
	at org.apache.tools.ant.types.AbstractFileSet.getDirectoryScanner(AbstractFileSet.java:474)
	at hudson.FilePath$34.hasMatch(FilePath.java:1801)
	at hudson.FilePath$34.invoke(FilePath.java:1710)
	at hudson.FilePath$34.invoke(FilePath.java:1701)
	at hudson.FilePath$FileCallableWrapper.call(FilePath.java:1995)
	at hudson.remoting.UserRequest.perform(UserRequest.java:118)
	at hudson.remoting.UserRequest.perform(UserRequest.java:48)
	at hudson.remoting.Request$2.run(Request.java:287)
	at java.util.concurrent.Executors$RunnableAdapter.call(Executors.java:441)
	at java.util.concurrent.FutureTask$Sync.innerRun(FutureTask.java:303)
	at java.util.concurrent.FutureTask.run(FutureTask.java:138)
	at java.util.concurrent.ThreadPoolExecutor$Worker.runTask(ThreadPoolExecutor.java:886)
	at java.util.concurrent.ThreadPoolExecutor$Worker.run(ThreadPoolExecutor.java:908)
	at java.lang.Thread.run(Thread.java:662)
Recording fingerprints


Mime
View raw message