hadoop-common-dev mailing list archives

Site index · List index
Message view « Date » · « Thread »
Top « Date » · « Thread »
From Apache Jenkins Server <jenk...@builds.apache.org>
Subject Build failed in Jenkins: Hadoop-Common-trunk #208
Date Tue, 25 Oct 2011 18:37:53 GMT
See <https://builds.apache.org/job/Hadoop-Common-trunk/208/changes>

Changes:

[acmurthy] MAPREDUCE-3253. Fixed ContextFactory to clone JobContext correctly.

------------------------------------------
[...truncated 9116 lines...]
[DEBUG]   (s) tempRoot = <https://builds.apache.org/job/Hadoop-Common-trunk/ws/trunk/hadoop-common-project/hadoop-annotations/target/archive-tmp>
[DEBUG]   (s) workDirectory = <https://builds.apache.org/job/Hadoop-Common-trunk/ws/trunk/hadoop-common-project/hadoop-annotations/target/assembly/work>
[DEBUG] -- end configuration --
[INFO] Reading assembly descriptor: hadoop-assemblies/src/main/resources/assemblies/hadoop-src.xml
[INFO] ------------------------------------------------------------------------
[INFO] Reactor Summary:
[INFO] 
[INFO] Apache Hadoop Annotations ......................... FAILURE [1.992s]
[INFO] Apache Hadoop Auth ................................ SKIPPED
[INFO] Apache Hadoop Auth Examples ....................... SKIPPED
[INFO] Apache Hadoop Common .............................. SKIPPED
[INFO] Apache Hadoop Common Project ...................... SKIPPED
[INFO] ------------------------------------------------------------------------
[INFO] BUILD FAILURE
[INFO] ------------------------------------------------------------------------
[INFO] Total time: 2.848s
[INFO] Finished at: Tue Oct 25 18:29:37 UTC 2011
[INFO] Final Memory: 15M/179M
[INFO] ------------------------------------------------------------------------
[ERROR] Failed to execute goal org.apache.maven.plugins:maven-assembly-plugin:2.2-beta-3:single
(src-dist) on project hadoop-annotations: Error reading assemblies: Error locating assembly
descriptor: hadoop-assemblies/src/main/resources/assemblies/hadoop-src.xml
[ERROR] 
[ERROR] [1] [INFO] Searching for file location: <https://builds.apache.org/job/Hadoop-Common-trunk/ws/trunk/hadoop-common-project/hadoop-annotations/hadoop-assemblies/src/main/resources/assemblies/hadoop-src.xml>
[ERROR] 
[ERROR] [2] [INFO] File: <https://builds.apache.org/job/Hadoop-Common-trunk/ws/trunk/hadoop-common-project/hadoop-annotations/hadoop-assemblies/src/main/resources/assemblies/hadoop-src.xml>
does not exist.
[ERROR] 
[ERROR] [3] [INFO] Invalid artifact specification: 'hadoop-assemblies/src/main/resources/assemblies/hadoop-src.xml'.
Must contain at least three fields, separated by ':'.
[ERROR] 
[ERROR] [4] [INFO] Failed to resolve classpath resource: /assemblies/hadoop-assemblies/src/main/resources/assemblies/hadoop-src.xml
from classloader: ClassRealm[plugin>org.apache.maven.plugins:maven-assembly-plugin:2.2-beta-3,
parent: sun.misc.Launcher$AppClassLoader@6b97fd]
[ERROR] 
[ERROR] [5] [INFO] Failed to resolve classpath resource: hadoop-assemblies/src/main/resources/assemblies/hadoop-src.xml
from classloader: ClassRealm[plugin>org.apache.maven.plugins:maven-assembly-plugin:2.2-beta-3,
parent: sun.misc.Launcher$AppClassLoader@6b97fd]
[ERROR] 
[ERROR] [6] [INFO] File: <https://builds.apache.org/job/Hadoop-Common-trunk/ws/trunk/hadoop-common-project/hadoop-assemblies/src/main/resources/assemblies/hadoop-src.xml>
does not exist.
[ERROR] 
[ERROR] [7] [INFO] Building URL from location: hadoop-assemblies/src/main/resources/assemblies/hadoop-src.xml
[ERROR] Error:
[ERROR] java.net.MalformedURLException: no protocol: hadoop-assemblies/src/main/resources/assemblies/hadoop-src.xml
[ERROR] at java.net.URL.<init>(URL.java:567)
[ERROR] at java.net.URL.<init>(URL.java:464)
[ERROR] at java.net.URL.<init>(URL.java:413)
[ERROR] at org.apache.maven.shared.io.location.URLLocatorStrategy.resolve(URLLocatorStrategy.java:54)
[ERROR] at org.apache.maven.shared.io.location.Locator.resolve(Locator.java:81)
[ERROR] at org.apache.maven.plugin.assembly.io.DefaultAssemblyReader.addAssemblyFromDescriptor(DefaultAssemblyReader.java:309)
[ERROR] at org.apache.maven.plugin.assembly.io.DefaultAssemblyReader.readAssemblies(DefaultAssemblyReader.java:140)
[ERROR] at org.apache.maven.plugin.assembly.mojos.AbstractAssemblyMojo.execute(AbstractAssemblyMojo.java:328)
[ERROR] at org.apache.maven.plugin.DefaultBuildPluginManager.executeMojo(DefaultBuildPluginManager.java:101)
[ERROR] at org.apache.maven.lifecycle.internal.MojoExecutor.execute(MojoExecutor.java:209)
[ERROR] at org.apache.maven.lifecycle.internal.MojoExecutor.execute(MojoExecutor.java:153)
[ERROR] at org.apache.maven.lifecycle.internal.MojoExecutor.execute(MojoExecutor.java:145)
[ERROR] at org.apache.maven.lifecycle.internal.LifecycleModuleBuilder.buildProject(LifecycleModuleBuilder.java:84)
[ERROR] at org.apache.maven.lifecycle.internal.LifecycleModuleBuilder.buildProject(LifecycleModuleBuilder.java:59)
[ERROR] at org.apache.maven.lifecycle.internal.LifecycleStarter.singleThreadedBuild(LifecycleStarter.java:183)
[ERROR] at org.apache.maven.lifecycle.internal.LifecycleStarter.execute(LifecycleStarter.java:161)
[ERROR] at org.apache.maven.DefaultMaven.doExecute(DefaultMaven.java:319)
[ERROR] at org.apache.maven.DefaultMaven.execute(DefaultMaven.java:156)
[ERROR] at org.apache.maven.cli.MavenCli.execute(MavenCli.java:537)
[ERROR] at org.apache.maven.cli.MavenCli.doMain(MavenCli.java:196)
[ERROR] at org.apache.maven.cli.MavenCli.main(MavenCli.java:141)
[ERROR] at sun.reflect.NativeMethodAccessorImpl.invoke0(Native Method)
[ERROR] at sun.reflect.NativeMethodAccessorImpl.invoke(NativeMethodAccessorImpl.java:39)
[ERROR] at sun.reflect.DelegatingMethodAccessorImpl.invoke(DelegatingMethodAccessorImpl.java:25)
[ERROR] at java.lang.reflect.Method.invoke(Method.java:597)
[ERROR] at org.codehaus.plexus.classworlds.launcher.Launcher.launchEnhanced(Launcher.java:290)
[ERROR] at org.codehaus.plexus.classworlds.launcher.Launcher.launch(Launcher.java:230)
[ERROR] at org.codehaus.plexus.classworlds.launcher.Launcher.mainWithExitCode(Launcher.java:409)
[ERROR] at org.codehaus.plexus.classworlds.launcher.Launcher.main(Launcher.java:352)
[ERROR] -> [Help 1]
org.apache.maven.lifecycle.LifecycleExecutionException: Failed to execute goal org.apache.maven.plugins:maven-assembly-plugin:2.2-beta-3:single
(src-dist) on project hadoop-annotations: Error reading assemblies: Error locating assembly
descriptor: hadoop-assemblies/src/main/resources/assemblies/hadoop-src.xml

[1] [INFO] Searching for file location: <https://builds.apache.org/job/Hadoop-Common-trunk/ws/trunk/hadoop-common-project/hadoop-annotations/hadoop-assemblies/src/main/resources/assemblies/hadoop-src.xml>

[2] [INFO] File: <https://builds.apache.org/job/Hadoop-Common-trunk/ws/trunk/hadoop-common-project/hadoop-annotations/hadoop-assemblies/src/main/resources/assemblies/hadoop-src.xml>
does not exist.

[3] [INFO] Invalid artifact specification: 'hadoop-assemblies/src/main/resources/assemblies/hadoop-src.xml'.
Must contain at least three fields, separated by ':'.

[4] [INFO] Failed to resolve classpath resource: /assemblies/hadoop-assemblies/src/main/resources/assemblies/hadoop-src.xml
from classloader: ClassRealm[plugin>org.apache.maven.plugins:maven-assembly-plugin:2.2-beta-3,
parent: sun.misc.Launcher$AppClassLoader@6b97fd]

[5] [INFO] Failed to resolve classpath resource: hadoop-assemblies/src/main/resources/assemblies/hadoop-src.xml
from classloader: ClassRealm[plugin>org.apache.maven.plugins:maven-assembly-plugin:2.2-beta-3,
parent: sun.misc.Launcher$AppClassLoader@6b97fd]

[6] [INFO] File: <https://builds.apache.org/job/Hadoop-Common-trunk/ws/trunk/hadoop-common-project/hadoop-assemblies/src/main/resources/assemblies/hadoop-src.xml>
does not exist.

[7] [INFO] Building URL from location: hadoop-assemblies/src/main/resources/assemblies/hadoop-src.xml
Error:
java.net.MalformedURLException: no protocol: hadoop-assemblies/src/main/resources/assemblies/hadoop-src.xml
	at java.net.URL.<init>(URL.java:567)
	at java.net.URL.<init>(URL.java:464)
	at java.net.URL.<init>(URL.java:413)
	at org.apache.maven.shared.io.location.URLLocatorStrategy.resolve(URLLocatorStrategy.java:54)
	at org.apache.maven.shared.io.location.Locator.resolve(Locator.java:81)
	at org.apache.maven.plugin.assembly.io.DefaultAssemblyReader.addAssemblyFromDescriptor(DefaultAssemblyReader.java:309)
	at org.apache.maven.plugin.assembly.io.DefaultAssemblyReader.readAssemblies(DefaultAssemblyReader.java:140)
	at org.apache.maven.plugin.assembly.mojos.AbstractAssemblyMojo.execute(AbstractAssemblyMojo.java:328)
	at org.apache.maven.plugin.DefaultBuildPluginManager.executeMojo(DefaultBuildPluginManager.java:101)
	at org.apache.maven.lifecycle.internal.MojoExecutor.execute(MojoExecutor.java:209)
	at org.apache.maven.lifecycle.internal.MojoExecutor.execute(MojoExecutor.java:153)
	at org.apache.maven.lifecycle.internal.MojoExecutor.execute(MojoExecutor.java:145)
	at org.apache.maven.lifecycle.internal.LifecycleModuleBuilder.buildProject(LifecycleModuleBuilder.java:84)
	at org.apache.maven.lifecycle.internal.LifecycleModuleBuilder.buildProject(LifecycleModuleBuilder.java:59)
	at org.apache.maven.lifecycle.internal.LifecycleStarter.singleThreadedBuild(LifecycleStarter.java:183)
	at org.apache.maven.lifecycle.internal.LifecycleStarter.execute(LifecycleStarter.java:161)
	at org.apache.maven.DefaultMaven.doExecute(DefaultMaven.java:319)
	at org.apache.maven.DefaultMaven.execute(DefaultMaven.java:156)
	at org.apache.maven.cli.MavenCli.execute(MavenCli.java:537)
	at org.apache.maven.cli.MavenCli.doMain(MavenCli.java:196)
	at org.apache.maven.cli.MavenCli.main(MavenCli.java:141)
	at sun.reflect.NativeMethodAccessorImpl.invoke0(Native Method)
	at sun.reflect.NativeMethodAccessorImpl.invoke(NativeMethodAccessorImpl.java:39)
	at sun.reflect.DelegatingMethodAccessorImpl.invoke(DelegatingMethodAccessorImpl.java:25)
	at java.lang.reflect.Method.invoke(Method.java:597)
	at org.codehaus.plexus.classworlds.launcher.Launcher.launchEnhanced(Launcher.java:290)
	at org.codehaus.plexus.classworlds.launcher.Launcher.launch(Launcher.java:230)
	at org.codehaus.plexus.classworlds.launcher.Launcher.mainWithExitCode(Launcher.java:409)
	at org.codehaus.plexus.classworlds.launcher.Launcher.main(Launcher.java:352)

	at org.apache.maven.lifecycle.internal.MojoExecutor.execute(MojoExecutor.java:217)
	at org.apache.maven.lifecycle.internal.MojoExecutor.execute(MojoExecutor.java:153)
	at org.apache.maven.lifecycle.internal.MojoExecutor.execute(MojoExecutor.java:145)
	at org.apache.maven.lifecycle.internal.LifecycleModuleBuilder.buildProject(LifecycleModuleBuilder.java:84)
	at org.apache.maven.lifecycle.internal.LifecycleModuleBuilder.buildProject(LifecycleModuleBuilder.java:59)
	at org.apache.maven.lifecycle.internal.LifecycleStarter.singleThreadedBuild(LifecycleStarter.java:183)
	at org.apache.maven.lifecycle.internal.LifecycleStarter.execute(LifecycleStarter.java:161)
	at org.apache.maven.DefaultMaven.doExecute(DefaultMaven.java:319)
	at org.apache.maven.DefaultMaven.execute(DefaultMaven.java:156)
	at org.apache.maven.cli.MavenCli.execute(MavenCli.java:537)
	at org.apache.maven.cli.MavenCli.doMain(MavenCli.java:196)
	at org.apache.maven.cli.MavenCli.main(MavenCli.java:141)
	at sun.reflect.NativeMethodAccessorImpl.invoke0(Native Method)
	at sun.reflect.NativeMethodAccessorImpl.invoke(NativeMethodAccessorImpl.java:39)
	at sun.reflect.DelegatingMethodAccessorImpl.invoke(DelegatingMethodAccessorImpl.java:25)
	at java.lang.reflect.Method.invoke(Method.java:597)
	at org.codehaus.plexus.classworlds.launcher.Launcher.launchEnhanced(Launcher.java:290)
	at org.codehaus.plexus.classworlds.launcher.Launcher.launch(Launcher.java:230)
	at org.codehaus.plexus.classworlds.launcher.Launcher.mainWithExitCode(Launcher.java:409)
	at org.codehaus.plexus.classworlds.launcher.Launcher.main(Launcher.java:352)
Caused by: org.apache.maven.plugin.MojoExecutionException: Error reading assemblies: Error
locating assembly descriptor: hadoop-assemblies/src/main/resources/assemblies/hadoop-src.xml

[1] [INFO] Searching for file location: <https://builds.apache.org/job/Hadoop-Common-trunk/ws/trunk/hadoop-common-project/hadoop-annotations/hadoop-assemblies/src/main/resources/assemblies/hadoop-src.xml>

[2] [INFO] File: <https://builds.apache.org/job/Hadoop-Common-trunk/ws/trunk/hadoop-common-project/hadoop-annotations/hadoop-assemblies/src/main/resources/assemblies/hadoop-src.xml>
does not exist.

[3] [INFO] Invalid artifact specification: 'hadoop-assemblies/src/main/resources/assemblies/hadoop-src.xml'.
Must contain at least three fields, separated by ':'.

[4] [INFO] Failed to resolve classpath resource: /assemblies/hadoop-assemblies/src/main/resources/assemblies/hadoop-src.xml
from classloader: ClassRealm[plugin>org.apache.maven.plugins:maven-assembly-plugin:2.2-beta-3,
parent: sun.misc.Launcher$AppClassLoader@6b97fd]

[5] [INFO] Failed to resolve classpath resource: hadoop-assemblies/src/main/resources/assemblies/hadoop-src.xml
from classloader: ClassRealm[plugin>org.apache.maven.plugins:maven-assembly-plugin:2.2-beta-3,
parent: sun.misc.Launcher$AppClassLoader@6b97fd]

[6] [INFO] File: <https://builds.apache.org/job/Hadoop-Common-trunk/ws/trunk/hadoop-common-project/hadoop-assemblies/src/main/resources/assemblies/hadoop-src.xml>
does not exist.

[7] [INFO] Building URL from location: hadoop-assemblies/src/main/resources/assemblies/hadoop-src.xml
Error:
java.net.MalformedURLException: no protocol: hadoop-assemblies/src/main/resources/assemblies/hadoop-src.xml
	at java.net.URL.<init>(URL.java:567)
	at java.net.URL.<init>(URL.java:464)
	at java.net.URL.<init>(URL.java:413)
	at org.apache.maven.shared.io.location.URLLocatorStrategy.resolve(URLLocatorStrategy.java:54)
	at org.apache.maven.shared.io.location.Locator.resolve(Locator.java:81)
	at org.apache.maven.plugin.assembly.io.DefaultAssemblyReader.addAssemblyFromDescriptor(DefaultAssemblyReader.java:309)
	at org.apache.maven.plugin.assembly.io.DefaultAssemblyReader.readAssemblies(DefaultAssemblyReader.java:140)
	at org.apache.maven.plugin.assembly.mojos.AbstractAssemblyMojo.execute(AbstractAssemblyMojo.java:328)
	at org.apache.maven.plugin.DefaultBuildPluginManager.executeMojo(DefaultBuildPluginManager.java:101)
	at org.apache.maven.lifecycle.internal.MojoExecutor.execute(MojoExecutor.java:209)
	at org.apache.maven.lifecycle.internal.MojoExecutor.execute(MojoExecutor.java:153)
	at org.apache.maven.lifecycle.internal.MojoExecutor.execute(MojoExecutor.java:145)
	at org.apache.maven.lifecycle.internal.LifecycleModuleBuilder.buildProject(LifecycleModuleBuilder.java:84)
	at org.apache.maven.lifecycle.internal.LifecycleModuleBuilder.buildProject(LifecycleModuleBuilder.java:59)
	at org.apache.maven.lifecycle.internal.LifecycleStarter.singleThreadedBuild(LifecycleStarter.java:183)
	at org.apache.maven.lifecycle.internal.LifecycleStarter.execute(LifecycleStarter.java:161)
	at org.apache.maven.DefaultMaven.doExecute(DefaultMaven.java:319)
	at org.apache.maven.DefaultMaven.execute(DefaultMaven.java:156)
	at org.apache.maven.cli.MavenCli.execute(MavenCli.java:537)
	at org.apache.maven.cli.MavenCli.doMain(MavenCli.java:196)
	at org.apache.maven.cli.MavenCli.main(MavenCli.java:141)
	at sun.reflect.NativeMethodAccessorImpl.invoke0(Native Method)
	at sun.reflect.NativeMethodAccessorImpl.invoke(NativeMethodAccessorImpl.java:39)
	at sun.reflect.DelegatingMethodAccessorImpl.invoke(DelegatingMethodAccessorImpl.java:25)
	at java.lang.reflect.Method.invoke(Method.java:597)
	at org.codehaus.plexus.classworlds.launcher.Launcher.launchEnhanced(Launcher.java:290)
	at org.codehaus.plexus.classworlds.launcher.Launcher.launch(Launcher.java:230)
	at org.codehaus.plexus.classworlds.launcher.Launcher.mainWithExitCode(Launcher.java:409)
	at org.codehaus.plexus.classworlds.launcher.Launcher.main(Launcher.java:352)

	at org.apache.maven.plugin.assembly.mojos.AbstractAssemblyMojo.execute(AbstractAssemblyMojo.java:332)
	at org.apache.maven.plugin.DefaultBuildPluginManager.executeMojo(DefaultBuildPluginManager.java:101)
	at org.apache.maven.lifecycle.internal.MojoExecutor.execute(MojoExecutor.java:209)
	... 19 more
Caused by: org.apache.maven.plugin.assembly.io.AssemblyReadException: Error locating assembly
descriptor: hadoop-assemblies/src/main/resources/assemblies/hadoop-src.xml

[1] [INFO] Searching for file location: <https://builds.apache.org/job/Hadoop-Common-trunk/ws/trunk/hadoop-common-project/hadoop-annotations/hadoop-assemblies/src/main/resources/assemblies/hadoop-src.xml>

[2] [INFO] File: <https://builds.apache.org/job/Hadoop-Common-trunk/ws/trunk/hadoop-common-project/hadoop-annotations/hadoop-assemblies/src/main/resources/assemblies/hadoop-src.xml>
does not exist.

[3] [INFO] Invalid artifact specification: 'hadoop-assemblies/src/main/resources/assemblies/hadoop-src.xml'.
Must contain at least three fields, separated by ':'.

[4] [INFO] Failed to resolve classpath resource: /assemblies/hadoop-assemblies/src/main/resources/assemblies/hadoop-src.xml
from classloader: ClassRealm[plugin>org.apache.maven.plugins:maven-assembly-plugin:2.2-beta-3,
parent: sun.misc.Launcher$AppClassLoader@6b97fd]

[5] [INFO] Failed to resolve classpath resource: hadoop-assemblies/src/main/resources/assemblies/hadoop-src.xml
from classloader: ClassRealm[plugin>org.apache.maven.plugins:maven-assembly-plugin:2.2-beta-3,
parent: sun.misc.Launcher$AppClassLoader@6b97fd]

[6] [INFO] File: <https://builds.apache.org/job/Hadoop-Common-trunk/ws/trunk/hadoop-common-project/hadoop-assemblies/src/main/resources/assemblies/hadoop-src.xml>
does not exist.

[7] [INFO] Building URL from location: hadoop-assemblies/src/main/resources/assemblies/hadoop-src.xml
Error:
java.net.MalformedURLException: no protocol: hadoop-assemblies/src/main/resources/assemblies/hadoop-src.xml
	at java.net.URL.<init>(URL.java:567)
	at java.net.URL.<init>(URL.java:464)
	at java.net.URL.<init>(URL.java:413)
	at org.apache.maven.shared.io.location.URLLocatorStrategy.resolve(URLLocatorStrategy.java:54)
	at org.apache.maven.shared.io.location.Locator.resolve(Locator.java:81)
	at org.apache.maven.plugin.assembly.io.DefaultAssemblyReader.addAssemblyFromDescriptor(DefaultAssemblyReader.java:309)
	at org.apache.maven.plugin.assembly.io.DefaultAssemblyReader.readAssemblies(DefaultAssemblyReader.java:140)
	at org.apache.maven.plugin.assembly.mojos.AbstractAssemblyMojo.execute(AbstractAssemblyMojo.java:328)
	at org.apache.maven.plugin.DefaultBuildPluginManager.executeMojo(DefaultBuildPluginManager.java:101)
	at org.apache.maven.lifecycle.internal.MojoExecutor.execute(MojoExecutor.java:209)
	at org.apache.maven.lifecycle.internal.MojoExecutor.execute(MojoExecutor.java:153)
	at org.apache.maven.lifecycle.internal.MojoExecutor.execute(MojoExecutor.java:145)
	at org.apache.maven.lifecycle.internal.LifecycleModuleBuilder.buildProject(LifecycleModuleBuilder.java:84)
	at org.apache.maven.lifecycle.internal.LifecycleModuleBuilder.buildProject(LifecycleModuleBuilder.java:59)
	at org.apache.maven.lifecycle.internal.LifecycleStarter.singleThreadedBuild(LifecycleStarter.java:183)
	at org.apache.maven.lifecycle.internal.LifecycleStarter.execute(LifecycleStarter.java:161)
	at org.apache.maven.DefaultMaven.doExecute(DefaultMaven.java:319)
	at org.apache.maven.DefaultMaven.execute(DefaultMaven.java:156)
	at org.apache.maven.cli.MavenCli.execute(MavenCli.java:537)
	at org.apache.maven.cli.MavenCli.doMain(MavenCli.java:196)
	at org.apache.maven.cli.MavenCli.main(MavenCli.java:141)
	at sun.reflect.NativeMethodAccessorImpl.invoke0(Native Method)
	at sun.reflect.NativeMethodAccessorImpl.invoke(NativeMethodAccessorImpl.java:39)
	at sun.reflect.DelegatingMethodAccessorImpl.invoke(DelegatingMethodAccessorImpl.java:25)
	at java.lang.reflect.Method.invoke(Method.java:597)
	at org.codehaus.plexus.classworlds.launcher.Launcher.launchEnhanced(Launcher.java:290)
	at org.codehaus.plexus.classworlds.launcher.Launcher.launch(Launcher.java:230)
	at org.codehaus.plexus.classworlds.launcher.Launcher.mainWithExitCode(Launcher.java:409)
	at org.codehaus.plexus.classworlds.launcher.Launcher.main(Launcher.java:352)

	at org.apache.maven.plugin.assembly.io.DefaultAssemblyReader.addAssemblyFromDescriptor(DefaultAssemblyReader.java:322)
	at org.apache.maven.plugin.assembly.io.DefaultAssemblyReader.readAssemblies(DefaultAssemblyReader.java:140)
	at org.apache.maven.plugin.assembly.mojos.AbstractAssemblyMojo.execute(AbstractAssemblyMojo.java:328)
	... 21 more
[ERROR] 
[ERROR] 
[ERROR] For more information about the errors and possible solutions, please read the following
articles:
[ERROR] [Help 1] http://cwiki.apache.org/confluence/display/MAVEN/MojoExecutionException
+ /home/jenkins/tools/maven/latest/bin/mvn test -Pclover -DcloverLicenseLocation=/home/jenkins/tools/clover/latest/lib/clover.license
Build step 'Execute shell' marked build as failure
[WARNINGS] Skipping publisher since build result is FAILURE
Archiving artifacts
Publishing Clover coverage report...
Clover xml file does not exist in: <https://builds.apache.org/job/Hadoop-Common-trunk/ws/trunk/hadoop-common-project/hadoop-common/target/clover>
called: clover.xml and will not be copied to: /home/hudson/hudson/jobs/Hadoop-Common-trunk/builds/2011-10-25_18-27-04/clover.xml
Could not find 'trunk/hadoop-common-project/hadoop-common/target/clover//clover.xml'.  Did
you generate the XML report for Clover?
Recording test results
Publishing Javadoc
Recording fingerprints


Mime
View raw message