hadoop-common-dev mailing list archives

Site index · List index
Message view « Date » · « Thread »
Top « Date » · « Thread »
From Apache Jenkins Server <jenk...@builds.apache.org>
Subject Hadoop-Common-22-branch - Build # 75 - Failure
Date Sat, 24 Sep 2011 16:48:14 GMT
See https://builds.apache.org/job/Hadoop-Common-22-branch/75/

###################################################################################
########################## LAST 60 LINES OF THE CONSOLE ###########################
[...truncated 1460 lines...]
  [javadoc] Constructing Javadoc information...
  [javadoc] /home/jenkins/jenkins-slave/workspace/Hadoop-Common-22-branch/trunk/src/java/org/apache/hadoop/security/KerberosName.java:31:
warning: sun.security.krb5.Config is Sun proprietary API and may be removed in a future release
  [javadoc] import sun.security.krb5.Config;
  [javadoc]                         ^
  [javadoc] /home/jenkins/jenkins-slave/workspace/Hadoop-Common-22-branch/trunk/src/java/org/apache/hadoop/security/KerberosName.java:32:
warning: sun.security.krb5.KrbException is Sun proprietary API and may be removed in a future
release
  [javadoc] import sun.security.krb5.KrbException;
  [javadoc]                         ^
  [javadoc] /home/jenkins/jenkins-slave/workspace/Hadoop-Common-22-branch/trunk/src/java/org/apache/hadoop/security/KerberosName.java:81:
warning: sun.security.krb5.Config is Sun proprietary API and may be removed in a future release
  [javadoc]   private static Config kerbConf;
  [javadoc]                  ^
  [javadoc] /home/jenkins/jenkins-slave/workspace/Hadoop-Common-22-branch/trunk/src/java/org/apache/hadoop/security/SecurityUtil.java:39:
warning: sun.security.jgss.krb5.Krb5Util is Sun proprietary API and may be removed in a future
release
  [javadoc] import sun.security.jgss.krb5.Krb5Util;
  [javadoc]                              ^
  [javadoc] /home/jenkins/jenkins-slave/workspace/Hadoop-Common-22-branch/trunk/src/java/org/apache/hadoop/security/SecurityUtil.java:40:
warning: sun.security.krb5.Credentials is Sun proprietary API and may be removed in a future
release
  [javadoc] import sun.security.krb5.Credentials;
  [javadoc]                         ^
  [javadoc] /home/jenkins/jenkins-slave/workspace/Hadoop-Common-22-branch/trunk/src/java/org/apache/hadoop/security/SecurityUtil.java:41:
warning: sun.security.krb5.PrincipalName is Sun proprietary API and may be removed in a future
release
  [javadoc] import sun.security.krb5.PrincipalName;
  [javadoc]                         ^
  [javadoc] ExcludePrivateAnnotationsStandardDoclet
  [javadoc] Standard Doclet version 1.6.0_26
  [javadoc] Building tree for all the packages and classes...
  [javadoc] Building index for all the packages and classes...
  [javadoc] Building index for all classes...
  [javadoc] Generating /home/jenkins/jenkins-slave/workspace/Hadoop-Common-22-branch/trunk/build/docs/api/stylesheet.css...
  [javadoc] 6 warnings

forrest.check:

docs:

BUILD FAILED
/home/jenkins/jenkins-slave/workspace/Hadoop-Common-22-branch/trunk/build.xml:879: Execute
failed: java.io.IOException: Cannot run program "/home/jenkins/tools/forrest/latest/bin/forrest.bat"
(in directory "/home/jenkins/jenkins-slave/workspace/Hadoop-Common-22-branch/trunk/src/docs"):
java.io.IOException: error=13, Permission denied

Total time: 49 seconds


======================================================================
======================================================================
STORE: saving artifacts
======================================================================
======================================================================


mv: cannot stat `build/*.tar.gz': No such file or directory
mv: cannot stat `build/test/findbugs': No such file or directory
Build Failed
Build step 'Execute shell' marked build as failure
[FINDBUGS] Skipping publisher since build result is FAILURE
[WARNINGS] Skipping publisher since build result is FAILURE
Archiving artifacts
Publishing Clover coverage report...
No Clover report will be published due to a Build Failure
Recording test results
Publishing Javadoc
Recording fingerprints
Updating HADOOP-7457
Email was triggered for: Failure
Sending email for trigger: Failure



###################################################################################
############################## FAILED TESTS (if any) ##############################
No tests ran.

Mime
View raw message