hadoop-common-dev mailing list archives

Site index · List index
Message view « Date » · « Thread »
Top « Date » · « Thread »
From Apache Jenkins Server <jenk...@builds.apache.org>
Subject Hadoop-Common-22-branch - Build # 77 - Still Failing
Date Sun, 25 Sep 2011 16:16:04 GMT
See https://builds.apache.org/job/Hadoop-Common-22-branch/77/

###################################################################################
########################## LAST 60 LINES OF THE CONSOLE ###########################
[...truncated 2984 lines...]
   [delete] Deleting directory /home/jenkins/jenkins-slave/workspace/Hadoop-Common-22-branch/trunk/build
   [delete] Deleting: /home/jenkins/jenkins-slave/workspace/Hadoop-Common-22-branch/trunk/ivy/hadoop-common.xml
   [delete] Deleting: /home/jenkins/jenkins-slave/workspace/Hadoop-Common-22-branch/trunk/ivy/hadoop-common-test.xml
   [delete] Deleting: /home/jenkins/jenkins-slave/workspace/Hadoop-Common-22-branch/trunk/ivy/hadoop-common-instrumented.xml
   [delete] Deleting directory /home/jenkins/jenkins-slave/workspace/Hadoop-Common-22-branch/trunk/src/docs/build

BUILD SUCCESSFUL
Total time: 1 second


======================================================================
======================================================================
ANALYSIS: ant -Drun.clover=true clover checkstyle test generate-clover-reports -Dtest.junit.output.format=xml
-Dcompile.c++=true -Dcompile.native=true -Dfindbugs.home=$FINDBUGS_HOME -Dforrest.home=$FORREST_HOME
-Dclover.home=$CLOVER_HOME -Declipse.home=$ECLIPSE_HOME
======================================================================
======================================================================


Buildfile: build.xml

clover.setup:
    [mkdir] Created dir: /home/jenkins/jenkins-slave/workspace/Hadoop-Common-22-branch/trunk/build/test/clover/db
Fontconfig error: Cannot load default config file
[clover-setup] Clover Version 3.1.0, built on May 31 2011 (build-821)
[clover-setup] Loaded from: /home/jenkins/tools/clover/latest/lib/clover.jar

BUILD FAILED
java.lang.RuntimeException: Clover upgrades for your license ended December 14 2010, and this
version of Clover was built May 31 2011. Please visit http://www.atlassian.com/clover/renew
for information on upgrading your license.
	at com.cenqua.clover.CloverStartup.loadLicense(CloverStartup.java:103)
	at com.cenqua.clover.CloverStartup.loadLicense(CloverStartup.java:25)
	at com.cenqua.clover.tasks.AbstractCloverTask.execute(AbstractCloverTask.java:52)
	at org.apache.tools.ant.UnknownElement.execute(UnknownElement.java:288)
	at sun.reflect.GeneratedMethodAccessor1.invoke(Unknown Source)
	at sun.reflect.DelegatingMethodAccessorImpl.invoke(DelegatingMethodAccessorImpl.java:25)
	at java.lang.reflect.Method.invoke(Method.java:597)
	at org.apache.tools.ant.dispatch.DispatchUtils.execute(DispatchUtils.java:106)
	at org.apache.tools.ant.Task.perform(Task.java:348)
	at org.apache.tools.ant.Target.execute(Target.java:357)
	at org.apache.tools.ant.Target.performTasks(Target.java:385)
	at org.apache.tools.ant.Project.executeSortedTargets(Project.java:1337)
	at org.apache.tools.ant.Project.executeTarget(Project.java:1306)
	at org.apache.tools.ant.helper.DefaultExecutor.executeTargets(DefaultExecutor.java:41)
	at org.apache.tools.ant.Project.executeTargets(Project.java:1189)
	at org.apache.tools.ant.Main.runBuild(Main.java:758)
	at org.apache.tools.ant.Main.startAnt(Main.java:217)
	at org.apache.tools.ant.launch.Launcher.run(Launcher.java:257)
	at org.apache.tools.ant.launch.Launcher.main(Launcher.java:104)

Total time: 0 seconds
Build step 'Execute shell' marked build as failure
[FINDBUGS] Skipping publisher since build result is FAILURE
[WARNINGS] Skipping publisher since build result is FAILURE
Archiving artifacts
Publishing Clover coverage report...
No Clover report will be published due to a Build Failure
Recording test results
Publishing Javadoc
Recording fingerprints
Email was triggered for: Failure
Sending email for trigger: Failure



###################################################################################
############################## FAILED TESTS (if any) ##############################
No tests ran.

Mime
View raw message