hadoop-common-dev mailing list archives

Site index · List index
Message view « Date » · « Thread »
Top « Date » · « Thread »
From Apache Jenkins Server <jenk...@builds.apache.org>
Subject Hadoop-Common-22-branch - Build # 67 - Failure
Date Wed, 10 Aug 2011 01:22:06 GMT
See https://builds.apache.org/job/Hadoop-Common-22-branch/67/

###################################################################################
########################## LAST 60 LINES OF THE CONSOLE ###########################
[...truncated 1157 lines...]
AU        hudsonBuildHadoopRelease.sh
AU        processHadoopPatchEmailRemote.sh
AU        hudsonPatchQueueAdmin.sh
AU        processHadoopPatchEmail.sh
A         README.txt
A         test-patch
A         test-patch/test-patch.sh
At revision 1155988
No emails were triggered.
[Hadoop-Common-22-branch] $ /bin/bash /tmp/hudson69897908972157639.sh
1024


======================================================================
======================================================================
CLEAN: cleaning workspace
======================================================================
======================================================================


Error: JAVA_HOME is not defined correctly.
  We cannot execute /home/hudson/tools/java/latest1.6/bin/java


======================================================================
======================================================================
BUILD: ant clean tar mvn-deploy findbugs -Dtest.junit.output.format=xml -Dcompile.c++=true
-Dcompile.native=true -Dfindbugs.home=$FINDBUGS_HOME -Dforrest.home=$FORREST_HOME -Dclover.home=$CLOVER_HOME
-Declipse.home=$ECLIPSE_HOME
======================================================================
======================================================================


Error: JAVA_HOME is not defined correctly.
  We cannot execute /home/hudson/tools/java/latest1.6/bin/java


======================================================================
======================================================================
STORE: saving artifacts
======================================================================
======================================================================


mv: cannot stat `build/*.tar.gz': No such file or directory
mv: cannot stat `build/*.jar': No such file or directory
mv: cannot stat `build/test/findbugs': No such file or directory
mv: cannot stat `build/docs/api': No such file or directory
Build Failed
[FINDBUGS] Skipping publisher since build result is FAILURE
[WARNINGS] Skipping publisher since build result is FAILURE
Archiving artifacts
Publishing Clover coverage report...
No Clover report will be published due to a Build Failure
Recording test results
Publishing Javadoc
Recording fingerprints
Updating HADOOP-7513
Updating HADOOP-7514
Email was triggered for: Failure
Sending email for trigger: Failure



###################################################################################
############################## FAILED TESTS (if any) ##############################
No tests ran.

Mime
View raw message