hadoop-common-dev mailing list archives

Site index · List index
Message view « Date » · « Thread »
Top « Date » · « Thread »
From Apache Jenkins Server <jenk...@builds.apache.org>
Subject Hadoop-Common-trunk - Build # 747 - Still Failing
Date Fri, 15 Jul 2011 11:13:12 GMT
See https://builds.apache.org/job/Hadoop-Common-trunk/747/

###################################################################################
########################## LAST 60 LINES OF THE CONSOLE ###########################
[...truncated 24922 lines...]
      [tar] Nothing to do: /grid/0/hudson/hudson-slave/workspace/Hadoop-Common-trunk/trunk/build-fi/classes/bin.tgz
is up to date.
      [jar] Building jar: /grid/0/hudson/hudson-slave/workspace/Hadoop-Common-trunk/trunk/build-fi/hadoop-common-0.23.0-SNAPSHOT.jar
      [jar] Building jar: /grid/0/hudson/hudson-slave/workspace/Hadoop-Common-trunk/trunk/build-fi/hadoop-common-0.23.0-SNAPSHOT-sources.jar

ivy-resolve-test:

ivy-retrieve-test:

generate-test-records:

generate-avro-records:
Trying to override old definition of task schema

generate-avro-protocols:
Trying to override old definition of task schema

compile-core-test:
    [javac] Compiling 9 source files to /grid/0/hudson/hudson-slave/workspace/Hadoop-Common-trunk/trunk/build-fi/test/core/classes
   [clover] Clover Version 3.0.2, built on April 13 2010 (build-790)
   [clover] Loaded from: /homes/hudson/tools/clover/latest/lib/clover.jar
   [clover] Clover: Open Source License registered to Apache.
   [clover] Updating existing database at '/grid/0/hudson/hudson-slave/workspace/Hadoop-Common-trunk/trunk/build-fi/test/clover/db/hadoop_coverage.db'.
   [clover] Processing files at 1.6 source level.
   [clover] Clover all over. Instrumented 0 files (0 packages).
   [clover] Elapsed time = 0.001 secs. (0 files/sec, 0 srclines/sec)
    [javac] Note: Some input files use or override a deprecated API.
    [javac] Note: Recompile with -Xlint:deprecation for details.
    [javac] Note: Some input files use unchecked or unsafe operations.
    [javac] Note: Recompile with -Xlint:unchecked for details.
Trying to override old definition of task paranamer
[paranamer] Generating parameter names from /grid/0/hudson/hudson-slave/workspace/Hadoop-Common-trunk/trunk/src/test/core
to /grid/0/hudson/hudson-slave/workspace/Hadoop-Common-trunk/trunk/build-fi/test/core/classes
   [delete] Deleting directory /grid/0/hudson/hudson-slave/workspace/Hadoop-Common-trunk/trunk/build-fi/test/cache
    [mkdir] Created dir: /grid/0/hudson/hudson-slave/workspace/Hadoop-Common-trunk/trunk/build-fi/test/cache
     [copy] Copying 1 file to /grid/0/hudson/hudson-slave/workspace/Hadoop-Common-trunk/trunk/build-fi/test/cache

run-test-core:
    [mkdir] Created dir: /grid/0/hudson/hudson-slave/workspace/Hadoop-Common-trunk/trunk/build-fi/test/data
     [copy] Copying 3 files to /grid/0/hudson/hudson-slave/workspace/Hadoop-Common-trunk/trunk/build-fi/test/webapps
    [mkdir] Created dir: /grid/0/hudson/hudson-slave/workspace/Hadoop-Common-trunk/trunk/build-fi/test/logs
     [copy] Copying 1 file to /grid/0/hudson/hudson-slave/workspace/Hadoop-Common-trunk/trunk/build-fi/test/extraconf
     [copy] Copying 1 file to /grid/0/hudson/hudson-slave/workspace/Hadoop-Common-trunk/trunk/build-fi/test/extraconf

checkfailure:

BUILD FAILED
/grid/0/hudson/hudson-slave/workspace/Hadoop-Common-trunk/trunk/build.xml:854: Tests failed!

Total time: 9 minutes 29 seconds
[FINDBUGS] Skipping publisher since build result is FAILURE
[WARNINGS] Skipping publisher since build result is FAILURE
Archiving artifacts
Publishing Clover coverage report...
No Clover report will be published due to a Build Failure
Recording test results
Publishing Javadoc
Recording fingerprints
Updating HADOOP-7305
Email was triggered for: Failure
Sending email for trigger: Failure



###################################################################################
############################## FAILED TESTS (if any) ##############################
6 tests failed.
FAILED:  org.apache.hadoop.io.file.tfile.TestTFileByteArrays.testOneBlockPlusOneEntry

Error Message:
expected:<1> but was:<0>

Stack Trace:
junit.framework.AssertionFailedError: expected:<1> but was:<0>
	at org.apache.hadoop.io.file.tfile.TestTFileByteArrays.checkBlockIndex(TestTFileByteArrays.java:665)
	at org.apache.hadoop.io.file.tfile.TestTFileByteArrays.__CLR3_0_2qcmd5m13i7(TestTFileByteArrays.java:157)
	at org.apache.hadoop.io.file.tfile.TestTFileByteArrays.testOneBlockPlusOneEntry(TestTFileByteArrays.java:151)


FAILED:  org.apache.hadoop.io.file.tfile.TestTFileByteArrays.testTwoBlocks

Error Message:
expected:<1> but was:<0>

Stack Trace:
junit.framework.AssertionFailedError: expected:<1> but was:<0>
	at org.apache.hadoop.io.file.tfile.TestTFileByteArrays.checkBlockIndex(TestTFileByteArrays.java:665)
	at org.apache.hadoop.io.file.tfile.TestTFileByteArrays.__CLR3_0_2sehq6f13ig(TestTFileByteArrays.java:165)
	at org.apache.hadoop.io.file.tfile.TestTFileByteArrays.testTwoBlocks(TestTFileByteArrays.java:160)


FAILED:  org.apache.hadoop.io.file.tfile.TestTFileByteArrays.testThreeBlocks

Error Message:
expected:<2> but was:<1>

Stack Trace:
junit.framework.AssertionFailedError: expected:<2> but was:<1>
	at org.apache.hadoop.io.file.tfile.TestTFileByteArrays.checkBlockIndex(TestTFileByteArrays.java:665)
	at org.apache.hadoop.io.file.tfile.TestTFileByteArrays.__CLR3_0_29rsp4713io(TestTFileByteArrays.java:174)
	at org.apache.hadoop.io.file.tfile.TestTFileByteArrays.testThreeBlocks(TestTFileByteArrays.java:168)


FAILED:  org.apache.hadoop.io.file.tfile.TestTFileJClassComparatorByteArrays.testOneBlockPlusOneEntry

Error Message:
expected:<1> but was:<0>

Stack Trace:
junit.framework.AssertionFailedError: expected:<1> but was:<0>
	at org.apache.hadoop.io.file.tfile.TestTFileByteArrays.checkBlockIndex(TestTFileByteArrays.java:665)
	at org.apache.hadoop.io.file.tfile.TestTFileByteArrays.__CLR3_0_2qcmd5m13i7(TestTFileByteArrays.java:157)
	at org.apache.hadoop.io.file.tfile.TestTFileByteArrays.testOneBlockPlusOneEntry(TestTFileByteArrays.java:151)


FAILED:  org.apache.hadoop.io.file.tfile.TestTFileJClassComparatorByteArrays.testTwoBlocks

Error Message:
expected:<1> but was:<0>

Stack Trace:
junit.framework.AssertionFailedError: expected:<1> but was:<0>
	at org.apache.hadoop.io.file.tfile.TestTFileByteArrays.checkBlockIndex(TestTFileByteArrays.java:665)
	at org.apache.hadoop.io.file.tfile.TestTFileByteArrays.__CLR3_0_2sehq6f13ig(TestTFileByteArrays.java:165)
	at org.apache.hadoop.io.file.tfile.TestTFileByteArrays.testTwoBlocks(TestTFileByteArrays.java:160)


FAILED:  org.apache.hadoop.io.file.tfile.TestTFileJClassComparatorByteArrays.testThreeBlocks

Error Message:
expected:<2> but was:<1>

Stack Trace:
junit.framework.AssertionFailedError: expected:<2> but was:<1>
	at org.apache.hadoop.io.file.tfile.TestTFileByteArrays.checkBlockIndex(TestTFileByteArrays.java:665)
	at org.apache.hadoop.io.file.tfile.TestTFileByteArrays.__CLR3_0_29rsp4713io(TestTFileByteArrays.java:174)
	at org.apache.hadoop.io.file.tfile.TestTFileByteArrays.testThreeBlocks(TestTFileByteArrays.java:168)




Mime
View raw message