hadoop-common-dev mailing list archives

Site index · List index
Message view « Date » · « Thread »
Top « Date » · « Thread »
From Apache Jenkins Server <hud...@hudson.apache.org>
Subject Hadoop-Common-trunk-Commit - Build # 614 - Failure
Date Mon, 23 May 2011 01:35:16 GMT
See https://builds.apache.org/hudson/job/Hadoop-Common-trunk-Commit/614/

###################################################################################
########################## LAST 60 LINES OF THE CONSOLE ###########################
[...truncated 2097 lines...]
     [exec] libtool: install: chmod 644 /grid/0/hudson/hudson-slave/workspace/Hadoop-Common-trunk-Commit/trunk/build-fi/system/native/Linux-i386-32/lib/libhadoop.a
     [exec] libtool: install: ranlib /grid/0/hudson/hudson-slave/workspace/Hadoop-Common-trunk-Commit/trunk/build-fi/system/native/Linux-i386-32/lib/libhadoop.a
     [exec] libtool: install: warning: remember to run `libtool --finish /usr/local/lib'

compile-core:

jar:
      [tar] Building tar: /grid/0/hudson/hudson-slave/workspace/Hadoop-Common-trunk-Commit/trunk/build-fi/system/classes/bin.tgz
      [jar] Building jar: /grid/0/hudson/hudson-slave/workspace/Hadoop-Common-trunk-Commit/trunk/build-fi/system/hadoop-common-instrumented-0.23.0-SNAPSHOT.jar
      [jar] Building jar: /grid/0/hudson/hudson-slave/workspace/Hadoop-Common-trunk-Commit/trunk/build-fi/system/hadoop-common-instrumented-0.23.0-SNAPSHOT-sources.jar
      [jar] Updating jar: /grid/0/hudson/hudson-slave/workspace/Hadoop-Common-trunk-Commit/trunk/build-fi/system/hadoop-common-instrumented-0.23.0-SNAPSHOT-sources.jar

set-version:
     [copy] Copying 1 file to /grid/0/hudson/hudson-slave/workspace/Hadoop-Common-trunk-Commit/trunk/ivy
     [copy] Copying 1 file to /grid/0/hudson/hudson-slave/workspace/Hadoop-Common-trunk-Commit/trunk/ivy
     [copy] Copying 1 file to /grid/0/hudson/hudson-slave/workspace/Hadoop-Common-trunk-Commit/trunk/ivy

clean-sign:

sign:

signanddeploy:

simpledeploy:
[artifact:install-provider] Installing provider: org.apache.maven.wagon:wagon-http:jar:1.0-beta-2:runtime
[artifact:deploy] Deploying to https://repository.apache.org/content/repositories/snapshots
[artifact:deploy] [INFO] Retrieving previous build number from apache.snapshots.https
[artifact:deploy] An error has occurred while processing the Maven artifact tasks.
[artifact:deploy]  Diagnosis:
[artifact:deploy] 
[artifact:deploy] Error deploying artifact 'org.apache.hadoop:hadoop-common:jar': Error retrieving
previous build number for artifact 'org.apache.hadoop:hadoop-common:jar': repository metadata
for: 'snapshot org.apache.hadoop:hadoop-common:0.23.0-SNAPSHOT' could not be retrieved from
repository: apache.snapshots.https due to an error: Error transferring file
[artifact:deploy] Connection timed out

BUILD FAILED
/grid/0/hudson/hudson-slave/workspace/Hadoop-Common-trunk-Commit/trunk/build.xml:1354: Error
deploying artifact 'org.apache.hadoop:hadoop-common:jar': Error retrieving previous build
number for artifact 'org.apache.hadoop:hadoop-common:jar': repository metadata for: 'snapshot
org.apache.hadoop:hadoop-common:0.23.0-SNAPSHOT' could not be retrieved from repository: apache.snapshots.https
due to an error: Error transferring file

Total time: 4 minutes 15 seconds


======================================================================
======================================================================
STORE: saving artifacts
======================================================================
======================================================================


mv: cannot stat `build/*.tar.gz': No such file or directory
mv: cannot stat `build/test/findbugs': No such file or directory
mv: cannot stat `build/docs/api': No such file or directory
Build Failed
[FINDBUGS] Skipping publisher since build result is FAILURE
Recording fingerprints
Archiving artifacts
Recording test results
Publishing Javadoc
Publishing Clover coverage report...
No Clover report will be published due to a Build Failure
Email was triggered for: Failure
Sending email for trigger: Failure



###################################################################################
############################## FAILED TESTS (if any) ##############################
No tests ran.

Mime
View raw message