hadoop-common-dev mailing list archives

Site index · List index
Message view « Date » · « Thread »
Top « Date » · « Thread »
From Apache Hudson Server <hud...@hudson.apache.org>
Subject Hadoop-Common-trunk-Commit - Build # 556 - Failure
Date Sat, 16 Apr 2011 00:31:28 GMT
See https://hudson.apache.org/hudson/job/Hadoop-Common-trunk-Commit/556/

###################################################################################
########################## LAST 60 LINES OF THE CONSOLE ###########################
[...truncated 1750 lines...]
    [javac] symbol  : class CLICommand
    [javac] location: class org.apache.hadoop.cli.CLITestHelper.TestConfigFileParser
    [javac]         cleanupCommands = new ArrayList<CLICommand>();
    [javac]                                         ^
    [javac] /grid/0/hudson/hudson-slave/workspace/Hadoop-Common-trunk-Commit/trunk/src/test/core/org/apache/hadoop/cli/CLITestHelper.java:410:
cannot find symbol
    [javac] symbol  : class CLITestCmd
    [javac] location: class org.apache.hadoop.cli.CLITestHelper.TestConfigFileParser
    [javac]           testCommands.add(new CLITestCmd(charString, new CLICommandFS()));
    [javac]                                ^
    [javac] /grid/0/hudson/hudson-slave/workspace/Hadoop-Common-trunk-Commit/trunk/src/test/core/org/apache/hadoop/cli/CLITestHelper.java:410:
cannot find symbol
    [javac] symbol  : class CLICommandFS
    [javac] location: class org.apache.hadoop.cli.CLITestHelper.TestConfigFileParser
    [javac]           testCommands.add(new CLITestCmd(charString, new CLICommandFS()));
    [javac]                                                           ^
    [javac] /grid/0/hudson/hudson-slave/workspace/Hadoop-Common-trunk-Commit/trunk/src/test/core/org/apache/hadoop/cli/CLITestHelper.java:412:
cannot find symbol
    [javac] symbol  : class CLITestCmd
    [javac] location: class org.apache.hadoop.cli.CLITestHelper.TestConfigFileParser
    [javac]           cleanupCommands.add(new CLITestCmd(charString, new CLICommandFS()));
    [javac]                                   ^
    [javac] /grid/0/hudson/hudson-slave/workspace/Hadoop-Common-trunk-Commit/trunk/src/test/core/org/apache/hadoop/cli/CLITestHelper.java:412:
cannot find symbol
    [javac] symbol  : class CLICommandFS
    [javac] location: class org.apache.hadoop.cli.CLITestHelper.TestConfigFileParser
    [javac]           cleanupCommands.add(new CLITestCmd(charString, new CLICommandFS()));
    [javac]                                                              ^
    [javac] /grid/0/hudson/hudson-slave/workspace/Hadoop-Common-trunk-Commit/trunk/src/test/core/org/apache/hadoop/cli/util/CmdFactory.java:28:
cannot find symbol
    [javac] symbol  : variable FS
    [javac] location: class org.apache.hadoop.cli.util.CmdFactory
    [javac]       case FS:
    [javac]            ^
    [javac] Note: Some input files use or override a deprecated API.
    [javac] Note: Recompile with -Xlint:deprecation for details.
    [javac] 29 errors

BUILD FAILED
/grid/0/hudson/hudson-slave/workspace/Hadoop-Common-trunk-Commit/trunk/build.xml:582: Compile
failed; see the compiler error output for details.

Total time: 33 seconds


======================================================================
======================================================================
STORE: saving artifacts
======================================================================
======================================================================


mv: cannot stat `build/*.tar.gz': No such file or directory
mv: cannot stat `build/test/findbugs': No such file or directory
mv: cannot stat `build/docs/api': No such file or directory
Build Failed
[FINDBUGS] Skipping publisher since build result is FAILURE
Recording fingerprints
Archiving artifacts
Recording test results
Publishing Javadoc
Publishing Clover coverage report...
No Clover report will be published due to a Build Failure
Email was triggered for: Failure
Sending email for trigger: Failure



###################################################################################
############################## FAILED TESTS (if any) ##############################
No tests ran.

Mime
View raw message