hadoop-common-dev mailing list archives

Site index · List index
Message view « Date » · « Thread »
Top « Date » · « Thread »
From Apache Hudson Server <hud...@hudson.apache.org>
Subject Hadoop-Common-trunk-Commit - Build # 521 - Still Failing
Date Tue, 08 Mar 2011 01:42:31 GMT
See https://hudson.apache.org/hudson/job/Hadoop-Common-trunk-Commit/521/

###################################################################################
########################## LAST 60 LINES OF THE CONSOLE ###########################
[...truncated 2022 lines...]
     [exec] libtool: install: ranlib /grid/0/hudson/hudson-slave/workspace/Hadoop-Common-trunk-Commit/trunk/build-fi/system/native/Linux-i386-32/lib/libhadoop.a
     [exec] libtool: install: warning: remember to run `libtool --finish /usr/local/lib'

compile-core:

jar:
      [tar] Building tar: /grid/0/hudson/hudson-slave/workspace/Hadoop-Common-trunk-Commit/trunk/build-fi/system/classes/bin.tgz
      [jar] Building jar: /grid/0/hudson/hudson-slave/workspace/Hadoop-Common-trunk-Commit/trunk/build-fi/system/hadoop-common-instrumented-0.23.0-SNAPSHOT.jar
      [jar] Building jar: /grid/0/hudson/hudson-slave/workspace/Hadoop-Common-trunk-Commit/trunk/build-fi/system/hadoop-common-instrumented-0.23.0-SNAPSHOT-sources.jar
      [jar] Updating jar: /grid/0/hudson/hudson-slave/workspace/Hadoop-Common-trunk-Commit/trunk/build-fi/system/hadoop-common-instrumented-0.23.0-SNAPSHOT-sources.jar

set-version:
     [copy] Copying 1 file to /grid/0/hudson/hudson-slave/workspace/Hadoop-Common-trunk-Commit/trunk/ivy
     [copy] Copying 1 file to /grid/0/hudson/hudson-slave/workspace/Hadoop-Common-trunk-Commit/trunk/ivy
     [copy] Copying 1 file to /grid/0/hudson/hudson-slave/workspace/Hadoop-Common-trunk-Commit/trunk/ivy

clean-sign:

sign:

signanddeploy:

simpledeploy:
[artifact:install-provider] Installing provider: org.apache.maven.wagon:wagon-http:jar:1.0-beta-2:runtime
[artifact:deploy] Deploying to https://repository.apache.org/content/repositories/snapshots
[artifact:deploy] [INFO] Retrieving previous build number from apache.snapshots.https
[artifact:deploy] Uploading: org/apache/hadoop/hadoop-common/0.23.0-SNAPSHOT/hadoop-common-0.23.0-20110308.014228-50.jar
to apache.snapshots.https
[artifact:deploy] Uploaded 1375K
[artifact:deploy] An error has occurred while processing the Maven artifact tasks.
[artifact:deploy]  Diagnosis:
[artifact:deploy] 
[artifact:deploy] Error deploying artifact 'org.apache.hadoop:hadoop-common:jar': Error deploying
artifact: Failed to transfer file: https://repository.apache.org/content/repositories/snapshots/org/apache/hadoop/hadoop-common/0.23.0-SNAPSHOT/hadoop-common-0.23.0-20110308.014228-50.jar.
Return code is: 401

BUILD FAILED
/grid/0/hudson/hudson-slave/workspace/Hadoop-Common-trunk-Commit/trunk/build.xml:1399: Error
deploying artifact 'org.apache.hadoop:hadoop-common:jar': Error deploying artifact: Failed
to transfer file: https://repository.apache.org/content/repositories/snapshots/org/apache/hadoop/hadoop-common/0.23.0-SNAPSHOT/hadoop-common-0.23.0-20110308.014228-50.jar.
Return code is: 401

Total time: 1 minute 4 seconds


======================================================================
======================================================================
STORE: saving artifacts
======================================================================
======================================================================


mv: cannot stat `build/*.tar.gz': No such file or directory
mv: cannot stat `build/test/findbugs': No such file or directory
mv: cannot stat `build/docs/api': No such file or directory
Build Failed
[FINDBUGS] Skipping publisher since build result is FAILURE
Recording fingerprints
Archiving artifacts
Recording test results
Publishing Javadoc
Publishing Clover coverage report...
No Clover report will be published due to a Build Failure
Email was triggered for: Failure
Sending email for trigger: Failure



###################################################################################
############################## FAILED TESTS (if any) ##############################
No tests ran.

Mime
View raw message