hadoop-common-dev mailing list archives

Site index · List index
Message view « Date » · « Thread »
Top « Date » · « Thread »
From Apache Hudson Server <hud...@hudson.apache.org>
Subject Hadoop-Common-trunk-Commit - Build # 509 - Failure
Date Thu, 24 Feb 2011 06:48:47 GMT
See https://hudson.apache.org/hudson/job/Hadoop-Common-trunk-Commit/509/

###################################################################################
########################## LAST 60 LINES OF THE CONSOLE ###########################
[...truncated 1857 lines...]
     [exec] checking whether we are using the GNU C compiler... (cached) yes
     [exec] checking whether gcc accepts -g... (cached) yes
     [exec] checking for gcc option to accept ISO C89... (cached) none needed
     [exec] checking build system type... x86_64-unknown-linux-gnu
     [exec] checking host system type... x86_64-unknown-linux-gnu
     [exec] checking for a sed that does not truncate output... /bin/sed
     [exec] checking for grep that handles long lines and -e... /bin/grep
     [exec] checking for egrep... /bin/grep -E
     [exec] checking for fgrep... /bin/grep -F
     [exec] checking for ld used by gcc... /usr/bin/ld
     [exec] checking if the linker (/usr/bin/ld) is GNU ld... yes
     [exec] checking for BSD- or MS-compatible name lister (nm)... /usr/bin/nm -B
     [exec] checking the name lister (/usr/bin/nm -B) interface... BSD nm
     [exec] checking whether ln -s works... yes
     [exec] checking the maximum length of command line arguments... 1572864
     [exec] checking whether the shell understands some XSI constructs... yes
     [exec] checking whether the shell understands "+="... yes
     [exec] checking for /usr/bin/ld option to reload object files... -r
     [exec] checking for objdump... objdump
     [exec] checking how to recognize dependent libraries... pass_all
     [exec] checking for ar... ar
     [exec] checking for strip... strip
     [exec] checking for ranlib... ranlib
     [exec] checking command to parse /usr/bin/nm -B output from gcc object... ok
     [exec] checking how to run the C preprocessor... gcc -E
     [exec] Terminated
     [exec] checking for ANSI C header files... no
     [exec] Terminated
     [exec] checking for sys/types.h... no
     [exec] checking for sys/stat.h... 

BUILD FAILED
/grid/0/hudson/hudson-slave/workspace/Hadoop-Common-trunk-Commit/trunk/src/test/aop/build/aop.xml:133:
The following error occurred while executing this line:
/grid/0/hudson/hudson-slave/workspace/Hadoop-Common-trunk-Commit/trunk/src/test/aop/build/aop.xml:187:
The following error occurred while executing this line:
/grid/0/hudson/hudson-slave/workspace/Hadoop-Common-trunk-Commit/trunk/build.xml:396: exec
returned: 137

Total time: 334 minutes 25 seconds


======================================================================
======================================================================
STORE: saving artifacts
======================================================================
======================================================================


mv: cannot stat `build/*.tar.gz': No such file or directory
mv: cannot stat `build/test/findbugs': No such file or directory
mv: cannot stat `build/docs/api': No such file or directory
Build Failed
[FINDBUGS] Skipping publisher since build result is FAILURE
Recording fingerprints
Archiving artifacts
Recording test results
Publishing Javadoc
Publishing Clover coverage report...
No Clover report will be published due to a Build Failure
Email was triggered for: Failure
Sending email for trigger: Failure



###################################################################################
############################## FAILED TESTS (if any) ##############################
No tests ran.

Mime
View raw message