hadoop-common-dev mailing list archives

Site index · List index
Message view « Date » · « Thread »
Top « Date » · « Thread »
From Apache Hudson Server <hud...@hudson.apache.org>
Subject Hadoop-Common-trunk-Commit - Build # 504 - Failure
Date Tue, 15 Feb 2011 19:31:45 GMT
See https://hudson.apache.org/hudson/job/Hadoop-Common-trunk-Commit/504/

###################################################################################
########################## LAST 60 LINES OF THE CONSOLE ###########################
[...truncated 1271 lines...]
      [get] To: /grid/0/hudson/hudson-slave/workspace/Hadoop-Common-trunk-Commit/trunk/ivy/ivy-2.1.0.jar

ivy-init-dirs:
    [mkdir] Created dir: /grid/0/hudson/hudson-slave/workspace/Hadoop-Common-trunk-Commit/trunk/build/ivy
    [mkdir] Created dir: /grid/0/hudson/hudson-slave/workspace/Hadoop-Common-trunk-Commit/trunk/build/ivy/lib
    [mkdir] Created dir: /grid/0/hudson/hudson-slave/workspace/Hadoop-Common-trunk-Commit/trunk/build/ivy/report
    [mkdir] Created dir: /grid/0/hudson/hudson-slave/workspace/Hadoop-Common-trunk-Commit/trunk/build/ivy/maven

ivy-probe-antlib:

ivy-init-antlib:

ivy-init:
[ivy:configure] :: Ivy 2.1.0 - 20090925235825 :: http://ant.apache.org/ivy/ ::
[ivy:configure] :: loading settings :: file = /grid/0/hudson/hudson-slave/workspace/Hadoop-Common-trunk-Commit/trunk/ivy/ivysettings.xml

ivy-resolve-common:

ivy-retrieve-common:
[ivy:cachepath] DEPRECATED: 'ivy.conf.file' is deprecated, use 'ivy.settings.file' instead
[ivy:cachepath] :: loading settings :: file = /grid/0/hudson/hudson-slave/workspace/Hadoop-Common-trunk-Commit/trunk/ivy/ivysettings.xml

init:
    [mkdir] Created dir: /grid/0/hudson/hudson-slave/workspace/Hadoop-Common-trunk-Commit/trunk/build/classes
    [mkdir] Created dir: /grid/0/hudson/hudson-slave/workspace/Hadoop-Common-trunk-Commit/trunk/build/src
    [mkdir] Created dir: /grid/0/hudson/hudson-slave/workspace/Hadoop-Common-trunk-Commit/trunk/build/webapps
    [mkdir] Created dir: /grid/0/hudson/hudson-slave/workspace/Hadoop-Common-trunk-Commit/trunk/build/test
    [mkdir] Created dir: /grid/0/hudson/hudson-slave/workspace/Hadoop-Common-trunk-Commit/trunk/build/test/classes
    [mkdir] Created dir: /grid/0/hudson/hudson-slave/workspace/Hadoop-Common-trunk-Commit/trunk/build/test/extraconf
    [touch] Creating /tmp/null58770876
   [delete] Deleting: /tmp/null58770876

BUILD FAILED
/grid/0/hudson/hudson-slave/workspace/Hadoop-Common-trunk-Commit/trunk/build.xml:278: /grid/0/hudson/hudson-slave/workspace/Hadoop-Common-trunk-Commit/trunk/src/webapps
not found.

Total time: 4 seconds


======================================================================
======================================================================
STORE: saving artifacts
======================================================================
======================================================================


mv: cannot stat `build/*.tar.gz': No such file or directory
mv: cannot stat `build/*.jar': No such file or directory
mv: cannot stat `build/test/findbugs': No such file or directory
mv: cannot stat `build/docs/api': No such file or directory
Build Failed
[FINDBUGS] Skipping publisher since build result is FAILURE
Recording fingerprints
Archiving artifacts
Recording test results
Publishing Javadoc
Publishing Clover coverage report...
No Clover report will be published due to a Build Failure
Email was triggered for: Failure
Sending email for trigger: Failure



###################################################################################
############################## FAILED TESTS (if any) ##############################
No tests ran.

Mime
View raw message