hadoop-common-dev mailing list archives

Site index · List index
Message view « Date » · « Thread »
Top « Date » · « Thread »
From Apache Hudson Server <hud...@hudson.apache.org>
Subject Hadoop-Common-trunk-Commit - Build # 496 - Failure
Date Wed, 09 Feb 2011 01:43:02 GMT
See https://hudson.apache.org/hudson/job/Hadoop-Common-trunk-Commit/496/

###################################################################################
########################## LAST 60 LINES OF THE CONSOLE ###########################
[...truncated 2075 lines...]

clean-sign:

sign:

signanddeploy:

simpledeploy:
[artifact:install-provider] Installing provider: org.apache.maven.wagon:wagon-http:jar:1.0-beta-2:runtime
[artifact:deploy] Deploying to https://repository.apache.org/content/repositories/snapshots
[artifact:deploy] [INFO] Retrieving previous build number from apache.snapshots.https
[artifact:deploy] Uploading: org/apache/hadoop/hadoop-common/0.23.0-SNAPSHOT/hadoop-common-0.23.0-20110209.014240-34.jar
to apache.snapshots.https
[artifact:deploy] Uploaded 1373K
[artifact:deploy] [INFO] Retrieving previous metadata from apache.snapshots.https
[artifact:deploy] [INFO] Uploading repository metadata for: 'artifact org.apache.hadoop:hadoop-common'
[artifact:deploy] [INFO] Uploading project information for hadoop-common 0.23.0-20110209.014240-34
[artifact:deploy] [INFO] Retrieving previous metadata from apache.snapshots.https
[artifact:deploy] [INFO] Uploading repository metadata for: 'snapshot org.apache.hadoop:hadoop-common:0.23.0-SNAPSHOT'
[artifact:deploy] [INFO] Retrieving previous build number from apache.snapshots.https
[artifact:deploy] Uploading: org/apache/hadoop/hadoop-common/0.23.0-SNAPSHOT/hadoop-common-0.23.0-20110209.014240-34-sources.jar
to apache.snapshots.https
[artifact:deploy] Uploaded 953K
Warning: Reference hadoop.core.test has not been set at runtime, but was found during
build file parsing, attempting to resolve. Future versions of Ant may support
 referencing ids defined in non-executed targets.
[artifact:deploy] Deploying to https://repository.apache.org/content/repositories/snapshots
[artifact:deploy] [INFO] Retrieving previous build number from apache.snapshots.https
[artifact:deploy] Uploading: org/apache/hadoop/hadoop-common-test/0.23.0-SNAPSHOT/hadoop-common-test-0.23.0-20110209.014240-34.jar
to apache.snapshots.https
[artifact:deploy] Uploaded 705K
[artifact:deploy] An error has occurred while processing the Maven artifact tasks.
[artifact:deploy]  Diagnosis:
[artifact:deploy] 
[artifact:deploy] Error deploying artifact 'org.apache.hadoop:hadoop-common-test:jar': Error
deploying artifact: Failed to transfer file: https://repository.apache.org/content/repositories/snapshots/org/apache/hadoop/hadoop-common-test/0.23.0-SNAPSHOT/hadoop-common-test-0.23.0-20110209.014240-34.jar.
Return code is: 502

BUILD FAILED
/grid/0/hudson/hudson-slave/workspace/Hadoop-Common-trunk-Commit/trunk/build.xml:1392: Error
deploying artifact 'org.apache.hadoop:hadoop-common-test:jar': Error deploying artifact: Failed
to transfer file: https://repository.apache.org/content/repositories/snapshots/org/apache/hadoop/hadoop-common-test/0.23.0-SNAPSHOT/hadoop-common-test-0.23.0-20110209.014240-34.jar.
Return code is: 502

Total time: 1 minute 18 seconds


======================================================================
======================================================================
STORE: saving artifacts
======================================================================
======================================================================


mv: cannot stat `build/*.tar.gz': No such file or directory
mv: cannot stat `build/test/findbugs': No such file or directory
mv: cannot stat `build/docs/api': No such file or directory
Build Failed
[FINDBUGS] Skipping publisher since build result is FAILURE
Recording fingerprints
Archiving artifacts
Recording test results
Publishing Javadoc
Publishing Clover coverage report...
No Clover report will be published due to a Build Failure
Email was triggered for: Failure
Sending email for trigger: Failure



###################################################################################
############################## FAILED TESTS (if any) ##############################
No tests ran.

Mime
View raw message