hadoop-common-dev mailing list archives

Site index · List index
Message view « Date » · « Thread »
Top « Date » · « Thread »
From Apache Hudson Server <hud...@hudson.apache.org>
Subject Hadoop-Common-22-branch - Build # 12 - Failure
Date Tue, 11 Jan 2011 21:33:42 GMT
See https://hudson.apache.org/hudson/job/Hadoop-Common-22-branch/12/

###################################################################################
########################## LAST 60 LINES OF THE CONSOLE ###########################
[...truncated 2620 lines...]
[ivy:cachepath] :: loading settings :: file = /grid/0/hudson/hudson-slave/workspace/Hadoop-Common-22-branch/trunk/ivy/ivysettings.xml

compile:
     [echo] contrib: failmon

jar:
     [echo] contrib: failmon
      [jar] Building jar: /grid/0/hudson/hudson-slave/workspace/Hadoop-Common-22-branch/trunk/build/contrib/failmon/failmon.jar

compile-examples:

jar-examples:

package:
    [mkdir] Created dir: /grid/0/hudson/hudson-slave/workspace/Hadoop-Common-22-branch/trunk/build/hadoop-common-0.22.0-SNAPSHOT/contrib/failmon

compile:

package:
    [mkdir] Created dir: /grid/0/hudson/hudson-slave/workspace/Hadoop-Common-22-branch/trunk/build/hadoop-common-0.22.0-SNAPSHOT/contrib/hod
     [copy] Copying 70 files to /grid/0/hudson/hudson-slave/workspace/Hadoop-Common-22-branch/trunk/build/hadoop-common-0.22.0-SNAPSHOT/contrib/hod
     [copy] Copying 2 files to /grid/0/hudson/hudson-slave/workspace/Hadoop-Common-22-branch/trunk/build/hadoop-common-0.22.0-SNAPSHOT
     [copy] Copying 8 files to /grid/0/hudson/hudson-slave/workspace/Hadoop-Common-22-branch/trunk/build/hadoop-common-0.22.0-SNAPSHOT/bin
     [copy] Copying 10 files to /grid/0/hudson/hudson-slave/workspace/Hadoop-Common-22-branch/trunk/build/hadoop-common-0.22.0-SNAPSHOT/conf
     [copy] Copying 1019 files to /grid/0/hudson/hudson-slave/workspace/Hadoop-Common-22-branch/trunk/build/hadoop-common-0.22.0-SNAPSHOT/docs
     [copy] Copied 97 empty directories to 6 empty directories under /grid/0/hudson/hudson-slave/workspace/Hadoop-Common-22-branch/trunk/build/hadoop-common-0.22.0-SNAPSHOT/docs
     [copy] Copying 1 file to /grid/0/hudson/hudson-slave/workspace/Hadoop-Common-22-branch/trunk/build/hadoop-common-0.22.0-SNAPSHOT
     [copy] Copying 6 files to /grid/0/hudson/hudson-slave/workspace/Hadoop-Common-22-branch/trunk/build/hadoop-common-0.22.0-SNAPSHOT/ivy
     [copy] Copying 4 files to /grid/0/hudson/hudson-slave/workspace/Hadoop-Common-22-branch/trunk/build/hadoop-common-0.22.0-SNAPSHOT
     [copy] Copying 1122 files to /grid/0/hudson/hudson-slave/workspace/Hadoop-Common-22-branch/trunk/build/hadoop-common-0.22.0-SNAPSHOT/src
     [copy] Copied 214 empty directories to 5 empty directories under /grid/0/hudson/hudson-slave/workspace/Hadoop-Common-22-branch/trunk/build/hadoop-common-0.22.0-SNAPSHOT/src
     [copy] Copying 1 file to /grid/0/hudson/hudson-slave/workspace/Hadoop-Common-22-branch/trunk/build/hadoop-common-0.22.0-SNAPSHOT

BUILD FAILED
/grid/0/hudson/hudson-slave/workspace/Hadoop-Common-22-branch/trunk/build.xml:1120: /grid/0/hudson/hudson-slave/workspace/Hadoop-Common-22-branch/trunk/build/hadoop-common-0.22.0-SNAPSHOT/src/contrib/ec2/bin/image
not found.

Total time: 1 minute 27 seconds


======================================================================
======================================================================
STORE: saving artifacts
======================================================================
======================================================================


mv: cannot stat `build/*.tar.gz': No such file or directory
mv: cannot stat `build/test/findbugs': No such file or directory
Build Failed
[FINDBUGS] Skipping publisher since build result is FAILURE
[WARNINGS] Skipping publisher since build result is FAILURE
Publishing Javadoc
Archiving artifacts
Recording test results
Recording fingerprints
Publishing Clover coverage report...
No Clover report will be published due to a Build Failure
Email was triggered for: Failure
Sending email for trigger: Failure



###################################################################################
############################## FAILED TESTS (if any) ##############################
No tests ran.

Mime
View raw message