hadoop-common-dev mailing list archives

Site index · List index
Message view « Date » · « Thread »
Top « Date » · « Thread »
From Apache Hudson Server <hud...@hudson.apache.org>
Subject Hadoop-Common-22-branch - Build # 6 - Still Failing
Date Fri, 10 Dec 2010 21:39:13 GMT
See https://hudson.apache.org/hudson/job/Hadoop-Common-22-branch/6/

###################################################################################
########################## LAST 60 LINES OF THE CONSOLE ###########################
[...truncated 1805 lines...]
     [exec] aclocal.m4:2751: _LT_AC_LANG_CXX_CONFIG is expanded from...
     [exec] aclocal.m4:2750: AC_LIBTOOL_LANG_CXX_CONFIG is expanded from...
     [exec] aclocal.m4:1810: _LT_AC_TAGCONFIG is expanded from...
     [exec] configure.ac:47: warning: AC_CACHE_VAL(lt_prog_compiler_static_works_CXX, ...):
suspicious cache-id, must contain _cv_ to be cached
     [exec] configure.ac:47: warning: AC_CACHE_VAL(lt_prog_compiler_pic_works_F77, ...): suspicious
cache-id, must contain _cv_ to be cached
     [exec] aclocal.m4:3914: _LT_AC_LANG_F77_CONFIG is expanded from...
     [exec] aclocal.m4:3913: AC_LIBTOOL_LANG_F77_CONFIG is expanded from...
     [exec] configure.ac:47: warning: AC_CACHE_VAL(lt_prog_compiler_static_works_F77, ...):
suspicious cache-id, must contain _cv_ to be cached
     [exec] configure.ac:47: warning: AC_CACHE_VAL(lt_prog_compiler_pic_works_GCJ, ...): suspicious
cache-id, must contain _cv_ to be cached
     [exec] aclocal.m4:4016: _LT_AC_LANG_GCJ_CONFIG is expanded from...
     [exec] aclocal.m4:4015: AC_LIBTOOL_LANG_GCJ_CONFIG is expanded from...
     [exec] configure.ac:47: warning: AC_CACHE_VAL(lt_prog_compiler_static_works_GCJ, ...):
suspicious cache-id, must contain _cv_ to be cached
     [exec] rm -f stamp-h1
     [exec] touch /grid/0/hudson/hudson-slave/workspace/Hadoop-Common-22-branch/trunk/src/native/config.h.in
     [exec] cd . && /bin/sh ./config.status config.h
     [exec] config.status: creating config.h
     [exec] config.status: config.h is unchanged
     [exec] make  all-am
     [exec] make[1]: Entering directory `/grid/0/hudson/hudson-slave/workspace/Hadoop-Common-22-branch/trunk/build/native/Linux-i386-32'
     [exec] if /bin/sh ./libtool --tag=CC --mode=compile gcc -DHAVE_CONFIG_H -I. -I/grid/0/hudson/hudson-slave/workspace/Hadoop-Common-22-branch/trunk/src/native
-I.  -I/homes/hudson/tools/java/latest1.6/include -I/homes/hudson/tools/java/latest1.6/include/linux
-I/grid/0/hudson/hudson-slave/workspace/Hadoop-Common-22-branch/trunk/src/native/src -Isrc/org/apache/hadoop/io/compress/zlib
-Isrc/org/apache/hadoop/security -Isrc/org/apache/hadoop/io/nativeio/  -g -Wall -fPIC -O2
-m32 -g -O2 -MT ZlibCompressor.lo -MD -MP -MF ".deps/ZlibCompressor.Tpo" -c -o ZlibCompressor.lo
`test -f 'src/org/apache/hadoop/io/compress/zlib/ZlibCompressor.c' || echo '/grid/0/hudson/hudson-slave/workspace/Hadoop-Common-22-branch/trunk/src/native/'`src/org/apache/hadoop/io/compress/zlib/ZlibCompressor.c;
\
     [exec] 	then mv -f ".deps/ZlibCompressor.Tpo" ".deps/ZlibCompressor.Plo"; else rm -f
".deps/ZlibCompressor.Tpo"; exit 1; fi
     [exec] mkdir .libs
     [exec]  gcc -DHAVE_CONFIG_H -I. -I/grid/0/hudson/hudson-slave/workspace/Hadoop-Common-22-branch/trunk/src/native
-I. -I/homes/hudson/tools/java/latest1.6/include -I/homes/hudson/tools/java/latest1.6/include/linux
-I/grid/0/hudson/hudson-slave/workspace/Hadoop-Common-22-branch/trunk/src/native/src -Isrc/org/apache/hadoop/io/compress/zlib
-Isrc/org/apache/hadoop/security -Isrc/org/apache/hadoop/io/nativeio/ -g -Wall -fPIC -O2 -m32
-g -O2 -MT ZlibCompressor.lo -MD -MP -MF .deps/ZlibCompressor.Tpo -c /grid/0/hudson/hudson-slave/workspace/Hadoop-Common-22-branch/trunk/src/native/src/org/apache/hadoop/io/compress/zlib/ZlibCompressor.c
 -fPIC -DPIC -o .libs/ZlibCompressor.o
     [exec] In file included from /usr/include/features.h:354,
     [exec]                  from /usr/include/stdio.h:28,
     [exec]                  from /grid/0/hudson/hudson-slave/workspace/Hadoop-Common-22-branch/trunk/src/native/src/org/apache/hadoop/io/compress/zlib/ZlibCompressor.c:24:
     [exec] /usr/include/gnu/stubs.h:7:27: gnu/stubs-32.h: No such file or directory
     [exec] make[1]: Leaving directory `/grid/0/hudson/hudson-slave/workspace/Hadoop-Common-22-branch/trunk/build/native/Linux-i386-32'
     [exec] make[1]: *** [ZlibCompressor.lo] Error 1
     [exec] make: *** [all] Error 2

BUILD FAILED
/grid/0/hudson/hudson-slave/workspace/Hadoop-Common-22-branch/trunk/build.xml:407: exec returned:
2

Total time: 34 seconds


======================================================================
======================================================================
STORE: saving artifacts
======================================================================
======================================================================


mv: cannot stat `build/*.tar.gz': No such file or directory
mv: cannot stat `build/*.jar': No such file or directory
mv: cannot stat `build/test/findbugs': No such file or directory
mv: cannot stat `build/docs/api': No such file or directory
Build Failed
[FINDBUGS] Skipping publisher since build result is FAILURE
[WARNINGS] Skipping publisher since build result is FAILURE
Publishing Javadoc
Archiving artifacts
Recording test results
Recording fingerprints
Publishing Clover coverage report...
No Clover report will be published due to a Build Failure
Email was triggered for: Failure
Sending email for trigger: Failure



###################################################################################
############################## FAILED TESTS (if any) ##############################
No tests ran.

Mime
View raw message