hadoop-common-dev mailing list archives

Site index · List index
Message view « Date » · « Thread »
Top « Date » · « Thread »
From Apache Hudson Server <hud...@hudson.apache.org>
Subject Hadoop-Common-trunk-Commit - Build # 453 - Failure
Date Thu, 09 Dec 2010 22:34:50 GMT
See https://hudson.apache.org/hudson/job/Hadoop-Common-trunk-Commit/453/

###################################################################################
########################## LAST 60 LINES OF THE CONSOLE ###########################
[...truncated 21708 lines...]
init:
    [touch] Creating /tmp/null488077790
   [delete] Deleting: /tmp/null488077790

record-parser:

compile-rcc-compiler:
Trying to override old definition of task recordcc

compile-core-classes:
    [javac] Compiling 1 source file to /grid/0/hudson/hudson-slave/workspace/Hadoop-Common-trunk-Commit/trunk/build-fi/classes

ivy-resolve-test:

ivy-retrieve-test:

generate-test-records:

generate-avro-records:
Trying to override old definition of task schema

generate-avro-protocols:
Trying to override old definition of task schema

compile-core-test:
    [javac] Compiling 9 source files to /grid/0/hudson/hudson-slave/workspace/Hadoop-Common-trunk-Commit/trunk/build-fi/test/core/classes
    [javac] Note: Some input files use or override a deprecated API.
    [javac] Note: Recompile with -Xlint:deprecation for details.
    [javac] Note: Some input files use unchecked or unsafe operations.
    [javac] Note: Recompile with -Xlint:unchecked for details.
    [javac] Compiling 1 source file to /grid/0/hudson/hudson-slave/workspace/Hadoop-Common-trunk-Commit/trunk/build-fi/test/core/classes
Trying to override old definition of task paranamer
[paranamer] Generating parameter names from /grid/0/hudson/hudson-slave/workspace/Hadoop-Common-trunk-Commit/trunk/src/test/core
to /grid/0/hudson/hudson-slave/workspace/Hadoop-Common-trunk-Commit/trunk/build-fi/test/core/classes
   [delete] Deleting directory /grid/0/hudson/hudson-slave/workspace/Hadoop-Common-trunk-Commit/trunk/build-fi/test/cache
    [mkdir] Created dir: /grid/0/hudson/hudson-slave/workspace/Hadoop-Common-trunk-Commit/trunk/build-fi/test/cache
     [copy] Copying 1 file to /grid/0/hudson/hudson-slave/workspace/Hadoop-Common-trunk-Commit/trunk/build-fi/test/cache

run-test-core:
    [mkdir] Created dir: /grid/0/hudson/hudson-slave/workspace/Hadoop-Common-trunk-Commit/trunk/build-fi/test/data
     [copy] Copying 2 files to /grid/0/hudson/hudson-slave/workspace/Hadoop-Common-trunk-Commit/trunk/build-fi/test/webapps
    [mkdir] Created dir: /grid/0/hudson/hudson-slave/workspace/Hadoop-Common-trunk-Commit/trunk/build-fi/test/logs
     [copy] Copying 1 file to /grid/0/hudson/hudson-slave/workspace/Hadoop-Common-trunk-Commit/trunk/build-fi/test/extraconf
     [copy] Copying 1 file to /grid/0/hudson/hudson-slave/workspace/Hadoop-Common-trunk-Commit/trunk/build-fi/test/extraconf

checkfailure:

BUILD FAILED
/grid/0/hudson/hudson-slave/workspace/Hadoop-Common-trunk-Commit/trunk/build.xml:780: Tests
failed!

Total time: 8 minutes 25 seconds
[FINDBUGS] Skipping publisher since build result is FAILURE
Publishing Javadoc
Archiving artifacts
Recording test results
Recording fingerprints
Publishing Clover coverage report...
No Clover report will be published due to a Build Failure
Email was triggered for: Failure
Sending email for trigger: Failure



###################################################################################
############################## FAILED TESTS (if any) ##############################
1 tests failed.
FAILED:  <init>.org.apache.hadoop.fs.TestCorruptFileBlocks

Error Message:
org.apache.hadoop.fs.TestCorruptFileBlocks

Stack Trace:
java.lang.ClassNotFoundException: org.apache.hadoop.fs.TestCorruptFileBlocks
	at java.net.URLClassLoader$1.run(URLClassLoader.java:200)
	at java.security.AccessController.doPrivileged(Native Method)
	at java.net.URLClassLoader.findClass(URLClassLoader.java:188)
	at java.lang.ClassLoader.loadClass(ClassLoader.java:307)
	at sun.misc.Launcher$AppClassLoader.loadClass(Launcher.java:301)
	at java.lang.ClassLoader.loadClass(ClassLoader.java:252)
	at java.lang.ClassLoader.loadClassInternal(ClassLoader.java:320)
	at java.lang.Class.forName0(Native Method)
	at java.lang.Class.forName(Class.java:169)




Mime
View raw message