hadoop-common-dev mailing list archives

Site index · List index
Message view « Date » · « Thread »
Top « Date » · « Thread »
From Apache Hudson Server <hud...@hudson.apache.org>
Subject Hadoop-Common-22-branch - Build # 5 - Failure
Date Wed, 01 Dec 2010 09:53:05 GMT
See https://hudson.apache.org/hudson/job/Hadoop-Common-22-branch/5/

###################################################################################
########################## LAST 60 LINES OF THE CONSOLE ###########################
[...truncated 1590 lines...]
     [exec] checking for zconf.h... yes
     [exec] checking Checking for the 'actual' dynamic-library for '-lz'... (cached) "libz.so.1"
     [exec] checking fcntl.h usability... yes
     [exec] checking fcntl.h presence... yes
     [exec] checking for fcntl.h... yes
     [exec] checking for stdlib.h... (cached) yes
     [exec] checking for string.h... (cached) yes
     [exec] checking for unistd.h... (cached) yes
     [exec] checking for an ANSI C-conforming const... yes
     [exec] checking for memset... yes
     [exec] checking whether strerror_r is declared... yes
     [exec] checking for strerror_r... yes
     [exec] checking whether strerror_r returns char *... no
     [exec] configure: creating ./config.status
     [exec] config.status: creating Makefile
     [exec] config.status: creating config.h
     [exec] config.status: executing depfiles commands
     [exec] make  all-am
     [exec] make[1]: Entering directory `/grid/0/hudson/hudson-slave/workspace/Hadoop-Common-22-branch/trunk/build/native/Linux-i386-32'
     [exec] if /bin/bash ./libtool --tag=CC --mode=compile gcc -DHAVE_CONFIG_H -I. -I/grid/0/hudson/hudson-slave/workspace/Hadoop-Common-22-branch/trunk/src/native
-I.  -I/homes/hudson/tools/java/latest1.6/include -I/homes/hudson/tools/java/latest1.6/include/linux
-I/grid/0/hudson/hudson-slave/workspace/Hadoop-Common-22-branch/trunk/src/native/src -Isrc/org/apache/hadoop/io/compress/zlib
-Isrc/org/apache/hadoop/security -Isrc/org/apache/hadoop/io/nativeio/  -g -Wall -fPIC -O2
-m32 -g -O2 -MT ZlibCompressor.lo -MD -MP -MF ".deps/ZlibCompressor.Tpo" -c -o ZlibCompressor.lo
`test -f 'src/org/apache/hadoop/io/compress/zlib/ZlibCompressor.c' || echo '/grid/0/hudson/hudson-slave/workspace/Hadoop-Common-22-branch/trunk/src/native/'`src/org/apache/hadoop/io/compress/zlib/ZlibCompressor.c;
\
     [exec] 	then mv -f ".deps/ZlibCompressor.Tpo" ".deps/ZlibCompressor.Plo"; else rm -f
".deps/ZlibCompressor.Tpo"; exit 1; fi
     [exec] mkdir .libs
     [exec]  gcc -DHAVE_CONFIG_H -I. -I/grid/0/hudson/hudson-slave/workspace/Hadoop-Common-22-branch/trunk/src/native
-I. -I/homes/hudson/tools/java/latest1.6/include -I/homes/hudson/tools/java/latest1.6/include/linux
-I/grid/0/hudson/hudson-slave/workspace/Hadoop-Common-22-branch/trunk/src/native/src -Isrc/org/apache/hadoop/io/compress/zlib
-Isrc/org/apache/hadoop/security -Isrc/org/apache/hadoop/io/nativeio/ -g -Wall -fPIC -O2 -m32
-g -O2 -MT ZlibCompressor.lo -MD -MP -MF .deps/ZlibCompressor.Tpo -c /grid/0/hudson/hudson-slave/workspace/Hadoop-Common-22-branch/trunk/src/native/src/org/apache/hadoop/io/compress/zlib/ZlibCompressor.c
 -fPIC -DPIC -o .libs/ZlibCompressor.o
     [exec] In file included from /usr/include/features.h:354,
     [exec]                  from /usr/include/stdio.h:28,
     [exec]                  from /grid/0/hudson/hudson-slave/workspace/Hadoop-Common-22-branch/trunk/src/native/src/org/apache/hadoop/io/compress/zlib/ZlibCompressor.c:24:
     [exec] /usr/include/gnu/stubs.h:7:27: gnu/stubs-32.h: No such file or directory
     [exec] make[1]: Leaving directory `/grid/0/hudson/hudson-slave/workspace/Hadoop-Common-22-branch/trunk/build/native/Linux-i386-32'
     [exec] make[1]: *** [ZlibCompressor.lo] Error 1
     [exec] make: *** [all] Error 2

BUILD FAILED
/grid/0/hudson/hudson-slave/workspace/Hadoop-Common-22-branch/trunk/build.xml:407: exec returned:
2

Total time: 21 minutes 39 seconds


======================================================================
======================================================================
STORE: saving artifacts
======================================================================
======================================================================


mv: cannot stat `build/*.tar.gz': No such file or directory
mv: cannot stat `build/*.jar': No such file or directory
mv: cannot stat `build/test/findbugs': No such file or directory
mv: cannot stat `build/docs/api': No such file or directory
Build Failed
[FINDBUGS] Skipping publisher since build result is FAILURE
[WARNINGS] Skipping publisher since build result is FAILURE
Publishing Javadoc
Archiving artifacts
Recording test results
Recording fingerprints
Publishing Clover coverage report...
No Clover report will be published due to a Build Failure
Email was triggered for: Failure
Sending email for trigger: Failure



###################################################################################
############################## FAILED TESTS (if any) ##############################
No tests ran.

Mime
View raw message