hadoop-common-dev mailing list archives

Site index · List index
Message view « Date » · « Thread »
Top « Date » · « Thread »
From Apache Hudson Server <hud...@hudson.apache.org>
Subject Hadoop-Common-22-branch - Build # 1 - Failure
Date Wed, 24 Nov 2010 07:34:41 GMT
See https://hudson.apache.org/hudson/job/Hadoop-Common-22-branch/1/

###################################################################################
########################## LAST 60 LINES OF THE CONSOLE ###########################
[...truncated 1285 lines...]
clean:

BUILD SUCCESSFUL
Total time: 0 seconds


======================================================================
======================================================================
BUILD: ant clean clean-cache tar mvn-deploy findbugs -Dtest.junit.output.format=xml -Dcompile.c++=true
-Dcompile.native=true -Dfindbugs.home=$FINDBUGS_HOME -Djava5.home=$JAVA5_HOME -Dforrest.home=$FORREST_HOME
-Dclover.home=$CLOVER_HOME -Declipse.home=$ECLIPSE_HOME
======================================================================
======================================================================


Buildfile: build.xml

clean-contrib:

clean:

clean:
     [echo] contrib: failmon

clean:
     [echo] contrib: hod

clean-sign:

clean-fi:

clean:

BUILD FAILED
Target "clean-cache" does not exist in the project "Hadoop-Common". 

Total time: 0 seconds


======================================================================
======================================================================
STORE: saving artifacts
======================================================================
======================================================================


mv: cannot stat `build/*.tar.gz': No such file or directory
mv: cannot stat `build/*.jar': No such file or directory
mv: cannot stat `build/test/findbugs': No such file or directory
mv: cannot stat `build/docs/api': No such file or directory
Build Failed
[FINDBUGS] Skipping publisher since build result is FAILURE
[WARNINGS] Skipping publisher since build result is FAILURE
Publishing Javadoc
Archiving artifacts
Recording test results
Recording fingerprints
Publishing Clover coverage report...
No Clover report will be published due to a Build Failure
Email was triggered for: Failure
Sending email for trigger: Failure



###################################################################################
############################## FAILED TESTS (if any) ##############################
No tests ran.

Mime
View raw message