hadoop-common-dev mailing list archives

Site index · List index
Message view « Date » · « Thread »
Top « Date » · « Thread »
From Apache Hudson Server <hud...@hudson.apache.org>
Subject Hadoop-Common-22-branch - Build # 3 - Failure
Date Sun, 28 Nov 2010 22:22:59 GMT
See https://hudson.apache.org/hudson/job/Hadoop-Common-22-branch/3/

###################################################################################
########################## LAST 60 LINES OF THE CONSOLE ###########################
[...truncated 1425 lines...]
    [javac]              ^
    [javac] Note: Some input files use or override a deprecated API.
    [javac] Note: Recompile with -Xlint:deprecation for details.
    [javac] 15 warnings
     [copy] Copying 1 file to /grid/0/hudson/hudson-slave/workspace/Hadoop-Common-22-branch/trunk/build/classes

compile-core-native:
    [mkdir] Created dir: /grid/0/hudson/hudson-slave/workspace/Hadoop-Common-22-branch/trunk/build/native/Linux-i386-32/lib
    [mkdir] Created dir: /grid/0/hudson/hudson-slave/workspace/Hadoop-Common-22-branch/trunk/build/native/Linux-i386-32/src/org/apache/hadoop/io/compress/zlib
    [mkdir] Created dir: /grid/0/hudson/hudson-slave/workspace/Hadoop-Common-22-branch/trunk/build/native/Linux-i386-32/src/org/apache/hadoop/security
    [javah] [Search path = /homes/hudson/tools/java/jdk1.6.0_11-32/jre/lib/resources.jar:/homes/hudson/tools/java/jdk1.6.0_11-32/jre/lib/rt.jar:/homes/hudson/tools/java/jdk1.6.0_11-32/jre/lib/sunrsasign.jar:/homes/hudson/tools/java/jdk1.6.0_11-32/jre/lib/jsse.jar:/homes/hudson/tools/java/jdk1.6.0_11-32/jre/lib/jce.jar:/homes/hudson/tools/java/jdk1.6.0_11-32/jre/lib/charsets.jar:/homes/hudson/tools/java/jdk1.6.0_11-32/jre/classes:/grid/0/hudson/hudson-slave/workspace/Hadoop-Common-22-branch/trunk/build/classes]
    [javah] [Loaded /grid/0/hudson/hudson-slave/workspace/Hadoop-Common-22-branch/trunk/build/classes/org/apache/hadoop/io/compress/zlib/ZlibCompressor.class]
    [javah] [Loaded /homes/hudson/tools/java/jdk1.6.0_11-32/jre/lib/rt.jar(java/lang/Object.class)]
    [javah] [Forcefully writing file /grid/0/hudson/hudson-slave/workspace/Hadoop-Common-22-branch/trunk/build/native/Linux-i386-32/src/org/apache/hadoop/io/compress/zlib/org_apache_hadoop_io_compress_zlib_ZlibCompressor.h]
    [javah] [Loaded /grid/0/hudson/hudson-slave/workspace/Hadoop-Common-22-branch/trunk/build/classes/org/apache/hadoop/io/compress/zlib/ZlibDecompressor.class]
    [javah] [Forcefully writing file /grid/0/hudson/hudson-slave/workspace/Hadoop-Common-22-branch/trunk/build/native/Linux-i386-32/src/org/apache/hadoop/io/compress/zlib/org_apache_hadoop_io_compress_zlib_ZlibDecompressor.h]
    [javah] [Search path = /homes/hudson/tools/java/jdk1.6.0_11-32/jre/lib/resources.jar:/homes/hudson/tools/java/jdk1.6.0_11-32/jre/lib/rt.jar:/homes/hudson/tools/java/jdk1.6.0_11-32/jre/lib/sunrsasign.jar:/homes/hudson/tools/java/jdk1.6.0_11-32/jre/lib/jsse.jar:/homes/hudson/tools/java/jdk1.6.0_11-32/jre/lib/jce.jar:/homes/hudson/tools/java/jdk1.6.0_11-32/jre/lib/charsets.jar:/homes/hudson/tools/java/jdk1.6.0_11-32/jre/classes:/grid/0/hudson/hudson-slave/workspace/Hadoop-Common-22-branch/trunk/build/classes]
    [javah] [Loaded /grid/0/hudson/hudson-slave/workspace/Hadoop-Common-22-branch/trunk/build/classes/org/apache/hadoop/security/JniBasedUnixGroupsMapping.class]
    [javah] [Loaded /homes/hudson/tools/java/jdk1.6.0_11-32/jre/lib/rt.jar(java/lang/Object.class)]
    [javah] [Forcefully writing file /grid/0/hudson/hudson-slave/workspace/Hadoop-Common-22-branch/trunk/build/native/Linux-i386-32/src/org/apache/hadoop/security/org_apache_hadoop_security_JniBasedUnixGroupsMapping.h]
     [exec] checking for a BSD-compatible install... /usr/bin/install -c
     [exec] checking whether build environment is sane... yes
     [exec] checking for gawk... no
     [exec] checking for mawk... mawk
     [exec] checking whether make sets $(MAKE)... yes
     [exec] checking for gcc... gcc
     [exec] checking for C compiler default output file name... a.out
     [exec] checking whether the C compiler works... yes
     [exec] checking whether we are cross compiling... no
     [exec] checking for suffix of executables... 
     [exec] checking for suffix of object files... o
     [exec] checking whether we are using the GNU C compiler... yes
     [exec] checking whether gcc accepts -g... yes
     [exec] checking for gcc option to accept ANSI C... none needed
     [exec] checking for style of include used by make... GNU
     [exec] checking dependency style of gcc... gcc3
     [exec] checking build system type... x86_64-unknown-linux-gnu
     [exec] checking host system type... x86_64-unknown-linux-gnu
     [exec] checking for a sed that does not truncate output... /bin/sed
     [exec] checking for egrep... grep -E
     [exec] checking for ld used by gcc... /usr/bin/ld
     [exec] checking if the linker (/usr/bin/ld) is GNU ld... yes
     [exec] checking for /usr/bin/ld option to reload object files... -r
     [exec] checking for BSD-compatible nm... /usr/bin/nm -B
     [exec] checking whether ln -s works... yes
     [exec] checking how to recognise dependent libraries... pass_all
     [exec] checking how to run the C preprocessor... gcc -E
Build timed out. Aborting
     [exec] Terminated
[FINDBUGS] Skipping publisher since build result is FAILURE
[WARNINGS] Skipping publisher since build result is FAILURE
Publishing Javadoc
Archiving artifacts
Recording test results
Recording fingerprints
Publishing Clover coverage report...
No Clover report will be published due to a Build Failure
Email was triggered for: Failure
Sending email for trigger: Failure



###################################################################################
############################## FAILED TESTS (if any) ##############################
No tests ran.

Mime
View raw message