hadoop-common-dev mailing list archives

Site index · List index
Message view « Date » · « Thread »
Top « Date » · « Thread »
From Apache Hudson Server <hud...@hudson.apache.org>
Subject Build failed in Hudson: Hadoop-Common-trunk #518
Date Sat, 20 Nov 2010 07:04:01 GMT
See <https://hudson.apache.org/hudson/job/Hadoop-Common-trunk/518/changes>

Changes:

[nigel] Add some comments to commitBuild.sh and put artifacts in a single directory that can
be cleaned up.

------------------------------------------
[...truncated 3447 lines...]
    [junit] Tests run: 1, Failures: 0, Errors: 0, Time elapsed: 0.163 sec
    [junit] Running org.apache.hadoop.io.compress.TestCodec
    [junit] Tests run: 16, Failures: 0, Errors: 0, Time elapsed: 63.575 sec
    [junit] Running org.apache.hadoop.io.compress.TestCodecFactory
    [junit] Tests run: 1, Failures: 0, Errors: 0, Time elapsed: 0.387 sec
    [junit] Running org.apache.hadoop.io.file.tfile.TestTFile
    [junit] Tests run: 3, Failures: 0, Errors: 0, Time elapsed: 1.459 sec
    [junit] Running org.apache.hadoop.io.file.tfile.TestTFileByteArrays
    [junit] Tests run: 25, Failures: 0, Errors: 0, Time elapsed: 3.396 sec
    [junit] Running org.apache.hadoop.io.file.tfile.TestTFileComparator2
    [junit] Tests run: 1, Failures: 0, Errors: 0, Time elapsed: 1.436 sec
    [junit] Running org.apache.hadoop.io.file.tfile.TestTFileComparators
    [junit] Tests run: 3, Failures: 0, Errors: 0, Time elapsed: 0.362 sec
    [junit] Running org.apache.hadoop.io.file.tfile.TestTFileJClassComparatorByteArrays
    [junit] Tests run: 25, Failures: 0, Errors: 0, Time elapsed: 3.477 sec
    [junit] Running org.apache.hadoop.io.file.tfile.TestTFileLzoCodecsByteArrays
    [junit] Tests run: 25, Failures: 0, Errors: 0, Time elapsed: 0.176 sec
    [junit] Running org.apache.hadoop.io.file.tfile.TestTFileLzoCodecsStreams
    [junit] Tests run: 19, Failures: 0, Errors: 0, Time elapsed: 0.157 sec
    [junit] Running org.apache.hadoop.io.file.tfile.TestTFileNoneCodecsByteArrays
    [junit] Tests run: 25, Failures: 0, Errors: 0, Time elapsed: 1.519 sec
    [junit] Running org.apache.hadoop.io.file.tfile.TestTFileNoneCodecsJClassComparatorByteArrays
    [junit] Tests run: 25, Failures: 0, Errors: 0, Time elapsed: 1.584 sec
    [junit] Running org.apache.hadoop.io.file.tfile.TestTFileNoneCodecsStreams
    [junit] Tests run: 19, Failures: 0, Errors: 0, Time elapsed: 1.821 sec
    [junit] Running org.apache.hadoop.io.file.tfile.TestTFileSeek
    [junit] Tests run: 1, Failures: 0, Errors: 0, Time elapsed: 5.478 sec
    [junit] Running org.apache.hadoop.io.file.tfile.TestTFileSeqFileComparison
    [junit] Tests run: 1, Failures: 0, Errors: 0, Time elapsed: 12.708 sec
    [junit] Running org.apache.hadoop.io.file.tfile.TestTFileSplit
    [junit] Tests run: 1, Failures: 0, Errors: 0, Time elapsed: 12.687 sec
    [junit] Running org.apache.hadoop.io.file.tfile.TestTFileStreams
    [junit] Tests run: 19, Failures: 0, Errors: 0, Time elapsed: 1.903 sec
    [junit] Running org.apache.hadoop.io.file.tfile.TestTFileUnsortedByteArrays
    [junit] Tests run: 4, Failures: 0, Errors: 0, Time elapsed: 0.522 sec
    [junit] Running org.apache.hadoop.io.file.tfile.TestVLong
    [junit] Tests run: 9, Failures: 0, Errors: 0, Time elapsed: 2.981 sec
    [junit] Running org.apache.hadoop.io.retry.TestRetryProxy
    [junit] Tests run: 9, Failures: 0, Errors: 0, Time elapsed: 0.316 sec
    [junit] Running org.apache.hadoop.io.serializer.TestWritableSerialization
    [junit] Tests run: 2, Failures: 0, Errors: 0, Time elapsed: 0.179 sec
    [junit] Running org.apache.hadoop.io.serializer.avro.TestAvroSerialization
    [junit] Tests run: 4, Failures: 0, Errors: 0, Time elapsed: 0.404 sec
    [junit] Running org.apache.hadoop.ipc.TestAvroRpc
    [junit] Tests run: 2, Failures: 0, Errors: 0, Time elapsed: 0.741 sec
    [junit] Running org.apache.hadoop.ipc.TestIPC
    [junit] Tests run: 7, Failures: 0, Errors: 0, Time elapsed: 51.835 sec
    [junit] Running org.apache.hadoop.ipc.TestIPCServerResponder
    [junit] Tests run: 2, Failures: 0, Errors: 0, Time elapsed: 5.447 sec
    [junit] Running org.apache.hadoop.ipc.TestMiniRPCBenchmark
    [junit] Tests run: 1, Failures: 0, Errors: 0, Time elapsed: 1.984 sec
    [junit] Running org.apache.hadoop.ipc.TestRPC
    [junit] Tests run: 6, Failures: 0, Errors: 0, Time elapsed: 55.642 sec
    [junit] Running org.apache.hadoop.ipc.TestSaslRPC
    [junit] Tests run: 7, Failures: 0, Errors: 0, Time elapsed: 0.881 sec
    [junit] Running org.apache.hadoop.log.TestLogLevel
    [junit] Tests run: 1, Failures: 0, Errors: 0, Time elapsed: 34.854 sec
    [junit] Running org.apache.hadoop.metrics.TestMetricsServlet
    [junit] Tests run: 3, Failures: 0, Errors: 0, Time elapsed: 0.199 sec
    [junit] Running org.apache.hadoop.metrics.spi.TestOutputRecord
    [junit] Tests run: 1, Failures: 0, Errors: 0, Time elapsed: 0.165 sec
    [junit] Running org.apache.hadoop.net.TestDNS
    [junit] Tests run: 7, Failures: 0, Errors: 0, Time elapsed: 0.108 sec
    [junit] Running org.apache.hadoop.net.TestNetUtils
    [junit] Tests run: 1, Failures: 0, Errors: 0, Time elapsed: 0.303 sec
    [junit] Running org.apache.hadoop.net.TestScriptBasedMapping
    [junit] Tests run: 1, Failures: 0, Errors: 0, Time elapsed: 0.327 sec
    [junit] Running org.apache.hadoop.net.TestSocketIOWithTimeout
    [junit] Tests run: 1, Failures: 0, Errors: 0, Time elapsed: 3.16 sec
    [junit] Running org.apache.hadoop.record.TestBuffer
    [junit] Tests run: 6, Failures: 0, Errors: 0, Time elapsed: 0.082 sec
    [junit] Running org.apache.hadoop.record.TestRecordIO
    [junit] Tests run: 5, Failures: 0, Errors: 0, Time elapsed: 0.159 sec
    [junit] Running org.apache.hadoop.record.TestRecordVersioning
    [junit] Tests run: 2, Failures: 0, Errors: 0, Time elapsed: 0.166 sec
    [junit] Running org.apache.hadoop.security.TestCredentials
    [junit] Tests run: 1, Failures: 0, Errors: 0, Time elapsed: 0.501 sec
    [junit] Running org.apache.hadoop.security.TestDoAsEffectiveUser
    [junit] Tests run: 9, Failures: 0, Errors: 0, Time elapsed: 0.968 sec
    [junit] Running org.apache.hadoop.security.TestJNIGroupsMapping
    [junit] Tests run: 1, Failures: 0, Errors: 0, Time elapsed: 0.212 sec
    [junit] Running org.apache.hadoop.security.TestKerberosName
    [junit] Tests run: 2, Failures: 0, Errors: 0, Time elapsed: 0.311 sec
    [junit] Running org.apache.hadoop.security.TestSecurityUtil
    [junit] Tests run: 3, Failures: 0, Errors: 0, Time elapsed: 0.325 sec
    [junit] Running org.apache.hadoop.security.TestUserGroupInformation
    [junit] Tests run: 12, Failures: 0, Errors: 0, Time elapsed: 0.349 sec
    [junit] Running org.apache.hadoop.security.authorize.TestAccessControlList
    [junit] Tests run: 7, Failures: 0, Errors: 0, Time elapsed: 0.371 sec
    [junit] Running org.apache.hadoop.security.token.TestToken
    [junit] Tests run: 2, Failures: 0, Errors: 0, Time elapsed: 0.287 sec
    [junit] Running org.apache.hadoop.security.token.delegation.TestDelegationToken
    [junit] Tests run: 7, Failures: 0, Errors: 0, Time elapsed: 29.722 sec
    [junit] Running org.apache.hadoop.util.TestAsyncDiskService
    [junit] Tests run: 1, Failures: 0, Errors: 0, Time elapsed: 0.134 sec
    [junit] Running org.apache.hadoop.util.TestCyclicIteration
    [junit] Tests run: 1, Failures: 0, Errors: 0, Time elapsed: 0.155 sec
    [junit] Running org.apache.hadoop.util.TestDiskChecker
    [junit] Tests run: 9, Failures: 0, Errors: 0, Time elapsed: 0.553 sec
    [junit] Running org.apache.hadoop.util.TestGenericOptionsParser
    [junit] Tests run: 4, Failures: 0, Errors: 0, Time elapsed: 0.681 sec
    [junit] Running org.apache.hadoop.util.TestGenericsUtil
    [junit] Tests run: 6, Failures: 0, Errors: 0, Time elapsed: 0.322 sec
    [junit] Running org.apache.hadoop.util.TestHostsFileReader
    [junit] Tests run: 5, Failures: 0, Errors: 0, Time elapsed: 0.245 sec
    [junit] Running org.apache.hadoop.util.TestIndexedSort
    [junit] Tests run: 2, Failures: 0, Errors: 0, Time elapsed: 1.574 sec
    [junit] Running org.apache.hadoop.util.TestOptions
    [junit] Tests run: 2, Failures: 0, Errors: 0, Time elapsed: 0.156 sec
    [junit] Running org.apache.hadoop.util.TestPureJavaCrc32
    [junit] Tests run: 1, Failures: 0, Errors: 0, Time elapsed: 1.576 sec
    [junit] Running org.apache.hadoop.util.TestReflectionUtils
    [junit] Tests run: 4, Failures: 0, Errors: 0, Time elapsed: 0.652 sec
    [junit] Running org.apache.hadoop.util.TestRunJar
    [junit] Tests run: 2, Failures: 0, Errors: 0, Time elapsed: 0.24 sec
    [junit] Running org.apache.hadoop.util.TestShell
    [junit] Tests run: 3, Failures: 0, Errors: 0, Time elapsed: 4.256 sec
    [junit] Running org.apache.hadoop.util.TestStringUtils
    [junit] Tests run: 8, Failures: 0, Errors: 0, Time elapsed: 0.193 sec

checkfailure:

injectfaults:
    [mkdir] Created dir: <https://hudson.apache.org/hudson/job/Hadoop-Common-trunk/ws/trunk/build-fi>

ivy-download:
      [get] Getting: http://repo2.maven.org/maven2/org/apache/ivy/ivy/2.1.0/ivy-2.1.0.jar
      [get] To: <https://hudson.apache.org/hudson/job/Hadoop-Common-trunk/ws/trunk/ivy/ivy-2.1.0.jar>
      [get] Not modified - so not downloaded

ivy-init-dirs:
    [mkdir] Created dir: <https://hudson.apache.org/hudson/job/Hadoop-Common-trunk/ws/trunk/build-fi/ivy>
    [mkdir] Created dir: <https://hudson.apache.org/hudson/job/Hadoop-Common-trunk/ws/trunk/build-fi/ivy/lib>
    [mkdir] Created dir: <https://hudson.apache.org/hudson/job/Hadoop-Common-trunk/ws/trunk/build-fi/ivy/report>
    [mkdir] Created dir: <https://hudson.apache.org/hudson/job/Hadoop-Common-trunk/ws/trunk/build-fi/ivy/maven>

ivy-probe-antlib:

ivy-init-antlib:

ivy-init:
[ivy:configure] :: loading settings :: file = <https://hudson.apache.org/hudson/job/Hadoop-Common-trunk/ws/trunk/ivy/ivysettings.xml>

ivy-resolve-common:

ivy-retrieve-common:
[ivy:cachepath] DEPRECATED: 'ivy.conf.file' is deprecated, use 'ivy.settings.file' instead
[ivy:cachepath] :: loading settings :: file = <https://hudson.apache.org/hudson/job/Hadoop-Common-trunk/ws/trunk/ivy/ivysettings.xml>

init:
    [mkdir] Created dir: <https://hudson.apache.org/hudson/job/Hadoop-Common-trunk/ws/trunk/build-fi/classes>
    [mkdir] Created dir: <https://hudson.apache.org/hudson/job/Hadoop-Common-trunk/ws/trunk/build-fi/src>
    [mkdir] Created dir: <https://hudson.apache.org/hudson/job/Hadoop-Common-trunk/ws/trunk/build-fi/webapps>
    [mkdir] Created dir: <https://hudson.apache.org/hudson/job/Hadoop-Common-trunk/ws/trunk/build-fi/test>
    [mkdir] Created dir: <https://hudson.apache.org/hudson/job/Hadoop-Common-trunk/ws/trunk/build-fi/test/classes>
    [mkdir] Created dir: <https://hudson.apache.org/hudson/job/Hadoop-Common-trunk/ws/trunk/build-fi/test/extraconf>
    [touch] Creating /tmp/null805681371
   [delete] Deleting: /tmp/null805681371
    [mkdir] Created dir: <https://hudson.apache.org/hudson/job/Hadoop-Common-trunk/ws/trunk/build-fi/test/conf>
     [copy] Copying 5 files to <https://hudson.apache.org/hudson/job/Hadoop-Common-trunk/ws/trunk/build-fi/test/conf>
     [copy] Copying <https://hudson.apache.org/hudson/job/Hadoop-Common-trunk/ws/trunk/conf/hadoop-policy.xml.template>
to <https://hudson.apache.org/hudson/job/Hadoop-Common-trunk/ws/trunk/build-fi/test/conf/hadoop-policy.xml>
     [copy] Copying <https://hudson.apache.org/hudson/job/Hadoop-Common-trunk/ws/trunk/conf/core-site.xml.template>
to <https://hudson.apache.org/hudson/job/Hadoop-Common-trunk/ws/trunk/build-fi/test/conf/core-site.xml>
     [copy] Copying <https://hudson.apache.org/hudson/job/Hadoop-Common-trunk/ws/trunk/conf/hadoop-env.sh.template>
to <https://hudson.apache.org/hudson/job/Hadoop-Common-trunk/ws/trunk/build-fi/test/conf/hadoop-env.sh>
     [copy] Copying <https://hudson.apache.org/hudson/job/Hadoop-Common-trunk/ws/trunk/conf/slaves.template>
to <https://hudson.apache.org/hudson/job/Hadoop-Common-trunk/ws/trunk/build-fi/test/conf/slaves>
     [copy] Copying <https://hudson.apache.org/hudson/job/Hadoop-Common-trunk/ws/trunk/conf/masters.template>
to <https://hudson.apache.org/hudson/job/Hadoop-Common-trunk/ws/trunk/build-fi/test/conf/masters>

record-parser:

compile-rcc-compiler:
    [javac] Compiling 29 source files to <https://hudson.apache.org/hudson/job/Hadoop-Common-trunk/ws/trunk/build-fi/classes>
    [javac] Note: Some input files use or override a deprecated API.
    [javac] Note: Recompile with -Xlint:deprecation for details.
Trying to override old definition of task recordcc

compile-core-classes:
    [javac] Compiling 393 source files to <https://hudson.apache.org/hudson/job/Hadoop-Common-trunk/ws/trunk/build-fi/classes>
    [javac] <https://hudson.apache.org/hudson/job/Hadoop-Common-trunk/ws/trunk/src/java/org/apache/hadoop/security/KerberosName.java>:31:
warning: sun.security.krb5.Config is Sun proprietary API and may be removed in a future release
    [javac] import sun.security.krb5.Config;
    [javac]                         ^
    [javac] <https://hudson.apache.org/hudson/job/Hadoop-Common-trunk/ws/trunk/src/java/org/apache/hadoop/security/KerberosName.java>:32:
warning: sun.security.krb5.KrbException is Sun proprietary API and may be removed in a future
release
    [javac] import sun.security.krb5.KrbException;
    [javac]                         ^
    [javac] <https://hudson.apache.org/hudson/job/Hadoop-Common-trunk/ws/trunk/src/java/org/apache/hadoop/security/KerberosName.java>:81:
warning: sun.security.krb5.Config is Sun proprietary API and may be removed in a future release
    [javac]   private static Config kerbConf;
    [javac]                  ^
    [javac] <https://hudson.apache.org/hudson/job/Hadoop-Common-trunk/ws/trunk/src/java/org/apache/hadoop/security/SecurityUtil.java>:39:
warning: sun.security.jgss.krb5.Krb5Util is Sun proprietary API and may be removed in a future
release
    [javac] import sun.security.jgss.krb5.Krb5Util;
    [javac]                              ^
    [javac] <https://hudson.apache.org/hudson/job/Hadoop-Common-trunk/ws/trunk/src/java/org/apache/hadoop/security/SecurityUtil.java>:40:
warning: sun.security.krb5.Credentials is Sun proprietary API and may be removed in a future
release
    [javac] import sun.security.krb5.Credentials;
    [javac]                         ^
    [javac] <https://hudson.apache.org/hudson/job/Hadoop-Common-trunk/ws/trunk/src/java/org/apache/hadoop/security/SecurityUtil.java>:41:
warning: sun.security.krb5.PrincipalName is Sun proprietary API and may be removed in a future
release
    [javac] import sun.security.krb5.PrincipalName;
    [javac]                         ^
    [javac] <https://hudson.apache.org/hudson/job/Hadoop-Common-trunk/ws/trunk/src/java/org/apache/hadoop/security/KerberosName.java>:85:
warning: sun.security.krb5.Config is Sun proprietary API and may be removed in a future release
    [javac]       kerbConf = Config.getInstance();
    [javac]                  ^
    [javac] <https://hudson.apache.org/hudson/job/Hadoop-Common-trunk/ws/trunk/src/java/org/apache/hadoop/security/KerberosName.java>:87:
warning: sun.security.krb5.KrbException is Sun proprietary API and may be removed in a future
release
    [javac]     } catch (KrbException ke) {
    [javac]              ^
    [javac] <https://hudson.apache.org/hudson/job/Hadoop-Common-trunk/ws/trunk/src/java/org/apache/hadoop/security/SecurityUtil.java>:120:
warning: sun.security.krb5.Credentials is Sun proprietary API and may be removed in a future
release
    [javac]     Credentials serviceCred = null;
    [javac]     ^
    [javac] <https://hudson.apache.org/hudson/job/Hadoop-Common-trunk/ws/trunk/src/java/org/apache/hadoop/security/SecurityUtil.java>:122:
warning: sun.security.krb5.PrincipalName is Sun proprietary API and may be removed in a future
release
    [javac]       PrincipalName principal = new PrincipalName(serviceName,
    [javac]       ^
    [javac] <https://hudson.apache.org/hudson/job/Hadoop-Common-trunk/ws/trunk/src/java/org/apache/hadoop/security/SecurityUtil.java>:122:
warning: sun.security.krb5.PrincipalName is Sun proprietary API and may be removed in a future
release
    [javac]       PrincipalName principal = new PrincipalName(serviceName,
    [javac]                                     ^
    [javac] <https://hudson.apache.org/hudson/job/Hadoop-Common-trunk/ws/trunk/src/java/org/apache/hadoop/security/SecurityUtil.java>:123:
warning: sun.security.krb5.PrincipalName is Sun proprietary API and may be removed in a future
release
    [javac]           PrincipalName.KRB_NT_SRV_HST);
    [javac]           ^
    [javac] <https://hudson.apache.org/hudson/job/Hadoop-Common-trunk/ws/trunk/src/java/org/apache/hadoop/security/SecurityUtil.java>:125:
warning: sun.security.jgss.krb5.Krb5Util is Sun proprietary API and may be removed in a future
release
    [javac]           .toString(), Krb5Util.ticketToCreds(getTgtFromSubject()));
    [javac]                        ^
    [javac] <https://hudson.apache.org/hudson/job/Hadoop-Common-trunk/ws/trunk/src/java/org/apache/hadoop/security/SecurityUtil.java>:124:
warning: sun.security.krb5.Credentials is Sun proprietary API and may be removed in a future
release
    [javac]       serviceCred = Credentials.acquireServiceCreds(principal
    [javac]                     ^
    [javac] <https://hudson.apache.org/hudson/job/Hadoop-Common-trunk/ws/trunk/src/java/org/apache/hadoop/security/SecurityUtil.java>:134:
warning: sun.security.jgss.krb5.Krb5Util is Sun proprietary API and may be removed in a future
release
    [javac]         .add(Krb5Util.credsToTicket(serviceCred));
    [javac]              ^
    [javac] Note: Some input files use or override a deprecated API.
    [javac] Note: Recompile with -Xlint:deprecation for details.
    [javac] 15 warnings
     [copy] Copying 1 file to <https://hudson.apache.org/hudson/job/Hadoop-Common-trunk/ws/trunk/build-fi/classes>

ivy-resolve-test:

ivy-retrieve-test:

generate-test-records:

generate-avro-records:

BUILD FAILED
<https://hudson.apache.org/hudson/job/Hadoop-Common-trunk/ws/trunk/build.xml>:769: The
following error occurred while executing this line:
<https://hudson.apache.org/hudson/job/Hadoop-Common-trunk/ws/trunk/src/test/aop/build/aop.xml>:119:
The following error occurred while executing this line:
<https://hudson.apache.org/hudson/job/Hadoop-Common-trunk/ws/trunk/src/test/aop/build/aop.xml>:147:
The following error occurred while executing this line:
<https://hudson.apache.org/hudson/job/Hadoop-Common-trunk/ws/trunk/build.xml>:477: taskdef
class org.apache.avro.specific.SchemaTask cannot be found

Total time: 15 minutes 5 seconds
[FINDBUGS] Skipping publisher since build result is FAILURE
[WARNINGS] Skipping publisher since build result is FAILURE
Publishing Javadoc
Archiving artifacts
Recording test results
Recording fingerprints
Publishing Clover coverage report...
No Clover report will be published due to a Build Failure


Mime
View raw message