hadoop-common-dev mailing list archives

Site index · List index
Message view « Date » · « Thread »
Top « Date » · « Thread »
From Apache Hudson Server <hud...@hudson.zones.apache.org>
Subject Build failed in Hudson: Hadoop-Patch-vesta.apache.org #502
Date Tue, 16 Jun 2009 08:21:08 GMT
See http://hudson.zones.apache.org/hudson/job/Hadoop-Patch-vesta.apache.org/502/changes

Changes:

[ddas] HADOOP-2141. Improves the speculative execution heuristic. The heuristic is currently
based on the progress-rates of tasks and the expected time to complete. Also, statistics about
trackers are collected, and speculative tasks are not given to the ones deduced to be slow.
Contributed by Andy Konwinski and Devaraj Das.

[rangadi] HADOOP-6017. Lease Manager in NameNode does not handle certain characters
in filenames. This results in fatal errors in Secondary NameNode and while
restrating NameNode. (Tsz Wo (Nicholas), SZE via rangadi)

[tomwhite] HADOOP-4041. IsolationRunner does not work as documented. Contributed by Philip
Zeyliger.

------------------------------------------
[...truncated 551530 lines...]
     [exec] 
     [exec] ivy-init-antlib:
     [exec] 
     [exec] ivy-init:
     [exec] :: loading settings :: file = http://hudson.zones.apache.org/hudson/job/Hadoop-Patch-vesta.apache.org/ws/trunk/ivy/ivysettings.xml

     [exec] 
     [exec] ivy-resolve-common:
     [exec] [ivy:resolve] :: resolving dependencies :: org.apache.hadoop#vaidya;working@vesta.apache.org
     [exec] [ivy:resolve] 	confs: [common]
     [exec] [ivy:resolve] 	found commons-logging#commons-logging;1.0.4 in maven2
     [exec] [ivy:resolve] 	found log4j#log4j;1.2.15 in maven2
     [exec] [ivy:resolve] :: resolution report :: resolve 17ms :: artifacts dl 1ms
     [exec] 	---------------------------------------------------------------------
     [exec] 	|                  |            modules            ||   artifacts   |
     [exec] 	|       conf       | number| search|dwnlded|evicted|| number|dwnlded|
     [exec] 	---------------------------------------------------------------------
     [exec] 	|      common      |   2   |   0   |   0   |   0   ||   2   |   0   |
     [exec] 	---------------------------------------------------------------------
     [exec] 
     [exec] ivy-retrieve-common:
     [exec] [ivy:retrieve] :: retrieving :: org.apache.hadoop#vaidya [sync]
     [exec] [ivy:retrieve] 	confs: [common]
     [exec] [ivy:retrieve] 	0 artifacts copied, 2 already retrieved (0kB/1ms)
     [exec] No ivy:settings found for the default reference 'ivy.instance'.  A default instance
will be used
     [exec] DEPRECATED: 'ivy.conf.file' is deprecated, use 'ivy.settings.file' instead
     [exec] :: loading settings :: file = http://hudson.zones.apache.org/hudson/job/Hadoop-Patch-vesta.apache.org/ws/trunk/ivy/ivysettings.xml

     [exec] 
     [exec] compile:
     [exec]      [echo] contrib: vaidya
     [exec] 
     [exec] compile-ant-tasks:
     [exec] 
     [exec] compile-tools:
     [exec] 
     [exec] compile:
     [exec] 
     [exec] create-c++-examples-pipes-makefile:
     [exec] 
     [exec] compile-c++-examples-pipes:
     [exec] 
     [exec] compile-c++-examples:
     [exec] 
     [exec] compile-examples:
     [exec] 
     [exec] generate-test-records:
     [exec] 
     [exec] compile-core-test:
     [exec]     [javac] Compiling 7 source files to http://hudson.zones.apache.org/hudson/job/Hadoop-Patch-vesta.apache.org/ws/trunk/build/test/core/classes

     [exec]     [javac] Note: Some input files use unchecked or unsafe operations.
     [exec]     [javac] Note: Recompile with -Xlint:unchecked for details.
     [exec]    [delete] Deleting directory http://hudson.zones.apache.org/hudson/job/Hadoop-Patch-vesta.apache.org/ws/trunk/build/test/cache

     [exec]     [mkdir] Created dir: http://hudson.zones.apache.org/hudson/job/Hadoop-Patch-vesta.apache.org/ws/trunk/build/test/cache

     [exec]      [copy] Copying 1 file to http://hudson.zones.apache.org/hudson/job/Hadoop-Patch-vesta.apache.org/ws/trunk/build/test/cache

     [exec] 
     [exec] compile-hdfs-test:
     [exec]    [delete] Deleting directory http://hudson.zones.apache.org/hudson/job/Hadoop-Patch-vesta.apache.org/ws/trunk/build/test/cache

     [exec]     [mkdir] Created dir: http://hudson.zones.apache.org/hudson/job/Hadoop-Patch-vesta.apache.org/ws/trunk/build/test/cache

     [exec]      [copy] Copying 1 file to http://hudson.zones.apache.org/hudson/job/Hadoop-Patch-vesta.apache.org/ws/trunk/build/test/cache

     [exec]      [copy] Copying 1 file to http://hudson.zones.apache.org/hudson/job/Hadoop-Patch-vesta.apache.org/ws/trunk/build/test/cache

     [exec]      [copy] Copying 1 file to http://hudson.zones.apache.org/hudson/job/Hadoop-Patch-vesta.apache.org/ws/trunk/build/test/cache

     [exec]      [copy] Copying 1 file to http://hudson.zones.apache.org/hudson/job/Hadoop-Patch-vesta.apache.org/ws/trunk/build/test/cache

     [exec]      [copy] Copying 1 file to http://hudson.zones.apache.org/hudson/job/Hadoop-Patch-vesta.apache.org/ws/trunk/build/test/cache

     [exec]      [copy] Copying 1 file to http://hudson.zones.apache.org/hudson/job/Hadoop-Patch-vesta.apache.org/ws/trunk/build/test/cache

     [exec]      [copy] Copying 1 file to http://hudson.zones.apache.org/hudson/job/Hadoop-Patch-vesta.apache.org/ws/trunk/build/test/cache

     [exec]      [copy] Copying 1 file to http://hudson.zones.apache.org/hudson/job/Hadoop-Patch-vesta.apache.org/ws/trunk/build/test/cache

     [exec]      [copy] Copying 1 file to http://hudson.zones.apache.org/hudson/job/Hadoop-Patch-vesta.apache.org/ws/trunk/build/test/cache

     [exec]      [copy] Copying 1 file to http://hudson.zones.apache.org/hudson/job/Hadoop-Patch-vesta.apache.org/ws/trunk/build/test/cache

     [exec] 
     [exec] compile-mapred-test:
     [exec]     [javac] Compiling 1 source file to http://hudson.zones.apache.org/hudson/job/Hadoop-Patch-vesta.apache.org/ws/trunk/build/test/mapred/classes

     [exec]     [javac] Compiling 5 source files to http://hudson.zones.apache.org/hudson/job/Hadoop-Patch-vesta.apache.org/ws/trunk/build/test/mapred/testjar

     [exec]     [javac] Note: Some input files use or override a deprecated API.
     [exec]     [javac] Note: Recompile with -Xlint:deprecation for details.
     [exec]    [delete] Deleting: http://hudson.zones.apache.org/hudson/job/Hadoop-Patch-vesta.apache.org/ws/trunk/build/test/mapred/testjar/testjob.jar

     [exec]       [jar] Building jar: http://hudson.zones.apache.org/hudson/job/Hadoop-Patch-vesta.apache.org/ws/trunk/build/test/mapred/testjar/testjob.jar

     [exec]     [javac] Compiling 1 source file to http://hudson.zones.apache.org/hudson/job/Hadoop-Patch-vesta.apache.org/ws/trunk/build/test/mapred/testshell

     [exec]     [javac] Note: http://hudson.zones.apache.org/hudson/job/Hadoop-Patch-vesta.apache.org/ws/trunk/src/test/mapred/testshell/ExternalMapReduce.java
 uses or overrides a deprecated API.
     [exec]     [javac] Note: Recompile with -Xlint:deprecation for details.
     [exec]    [delete] Deleting: http://hudson.zones.apache.org/hudson/job/Hadoop-Patch-vesta.apache.org/ws/trunk/build/test/mapred/testshell/testshell.jar

     [exec]       [jar] Building jar: http://hudson.zones.apache.org/hudson/job/Hadoop-Patch-vesta.apache.org/ws/trunk/build/test/mapred/testshell/testshell.jar

     [exec]    [delete] Deleting directory http://hudson.zones.apache.org/hudson/job/Hadoop-Patch-vesta.apache.org/ws/trunk/build/test/cache

     [exec]     [mkdir] Created dir: http://hudson.zones.apache.org/hudson/job/Hadoop-Patch-vesta.apache.org/ws/trunk/build/test/cache

     [exec]    [delete] Deleting directory http://hudson.zones.apache.org/hudson/job/Hadoop-Patch-vesta.apache.org/ws/trunk/build/test/debug

     [exec]     [mkdir] Created dir: http://hudson.zones.apache.org/hudson/job/Hadoop-Patch-vesta.apache.org/ws/trunk/build/test/debug

     [exec]      [copy] Copying 1 file to http://hudson.zones.apache.org/hudson/job/Hadoop-Patch-vesta.apache.org/ws/trunk/build/test/debug

     [exec]      [copy] Copying 1 file to http://hudson.zones.apache.org/hudson/job/Hadoop-Patch-vesta.apache.org/ws/trunk/build/test/cache

     [exec]      [copy] Copying 1 file to http://hudson.zones.apache.org/hudson/job/Hadoop-Patch-vesta.apache.org/ws/trunk/build/test/cache

     [exec]      [copy] Copying 1 file to http://hudson.zones.apache.org/hudson/job/Hadoop-Patch-vesta.apache.org/ws/trunk/build/test/cache

     [exec]      [copy] Copying 1 file to http://hudson.zones.apache.org/hudson/job/Hadoop-Patch-vesta.apache.org/ws/trunk/build/test/cache

     [exec]      [copy] Copying 1 file to http://hudson.zones.apache.org/hudson/job/Hadoop-Patch-vesta.apache.org/ws/trunk/build/test/cache

     [exec]      [copy] Copying 1 file to http://hudson.zones.apache.org/hudson/job/Hadoop-Patch-vesta.apache.org/ws/trunk/build/test/cache

     [exec]      [copy] Copying 1 file to http://hudson.zones.apache.org/hudson/job/Hadoop-Patch-vesta.apache.org/ws/trunk/build/test/cache

     [exec]      [copy] Copying 1 file to http://hudson.zones.apache.org/hudson/job/Hadoop-Patch-vesta.apache.org/ws/trunk/build/test/cache

     [exec] 
     [exec] compile-hdfs-with-mr-test:
     [exec] 
     [exec] test-contrib:
     [exec] 
     [exec] test:
     [exec] Trying to override old definition of task macro_tar
     [exec] 
     [exec] check-contrib:
     [exec] 
     [exec] init:
     [exec]      [echo] contrib: hdfsproxy
     [exec] 
     [exec] init-contrib:
     [exec] 
     [exec] ivy-download:
     [exec]       [get] Getting: http://repo2.maven.org/maven2/org/apache/ivy/ivy/2.0.0-rc2/ivy-2.0.0-rc2.jar
     [exec]       [get] To: http://hudson.zones.apache.org/hudson/job/Hadoop-Patch-vesta.apache.org/ws/trunk/ivy/ivy-2.0.0-rc2.jar

     [exec]       [get] Not modified - so not downloaded
     [exec] 
     [exec] ivy-probe-antlib:
     [exec] 
     [exec] ivy-init-antlib:
     [exec] 
     [exec] ivy-init:
     [exec] 
     [exec] ivy-resolve-common:
     [exec] :: loading settings :: file = http://hudson.zones.apache.org/hudson/job/Hadoop-Patch-vesta.apache.org/ws/trunk/ivy/ivysettings.xml

     [exec] [ivy:resolve] :: resolving dependencies :: org.apache.hadoop#hdfsproxy;working@vesta.apache.org
     [exec] [ivy:resolve] 	confs: [common]
     [exec] [ivy:resolve] 	found commons-cli#commons-cli;1.2 in maven2
     [exec] [ivy:resolve] 	found log4j#log4j;1.2.15 in maven2
     [exec] [ivy:resolve] 	found commons-logging#commons-logging;1.1 in maven2
     [exec] [ivy:resolve] 	found commons-logging#commons-logging-api;1.0.4 in maven2
     [exec] [ivy:resolve] 	found junit#junit;3.8.2 in maven2
     [exec] [ivy:resolve] 	found org.slf4j#slf4j-api;1.4.3 in maven2
     [exec] [ivy:resolve] 	found org.slf4j#slf4j-log4j12;1.4.3 in maven2
     [exec] [ivy:resolve] 	found xmlenc#xmlenc;0.52 in maven2
     [exec] [ivy:resolve] 	found org.mortbay.jetty#jetty;6.1.14 in maven2
     [exec] [ivy:resolve] 	found org.mortbay.jetty#jetty-util;6.1.14 in maven2
     [exec] [ivy:resolve] 	found org.mortbay.jetty#servlet-api-2.5;6.1.14 in maven2
     [exec] [ivy:resolve] 	found org.eclipse.jdt#core;3.1.1 in maven2
     [exec] [ivy:resolve] 	found org.apache.cactus#cactus.core.framework.uberjar.javaEE.14;1.8.0
in maven2
     [exec] [ivy:resolve] 	found org.apache.cactus#cactus.integration.ant;1.8.0 in maven2
     [exec] [ivy:resolve] 	found org.apache.cactus#cactus.integration.shared.api;1.8.0 in
maven2
     [exec] [ivy:resolve] 	found commons-httpclient#commons-httpclient;3.1 in maven2
     [exec] [ivy:resolve] 	found commons-io#commons-io;1.4 in maven2
     [exec] [ivy:resolve] 	found commons-lang#commons-lang;2.3 in maven2
     [exec] [ivy:resolve] 	found commons-codec#commons-codec;1.3 in maven2
     [exec] [ivy:resolve] 	found aspectj#aspectjrt;1.5.3 in maven2
     [exec] [ivy:resolve] 	found org.codehaus.cargo#cargo-core-uberjar;0.9 in maven2
     [exec] [ivy:resolve] 	found org.codehaus.cargo#cargo-ant;0.9 in maven2
     [exec] [ivy:resolve] 	found javax.servlet#jsp-api;2.0 in maven2
     [exec] [ivy:resolve] 	found javax.servlet#servlet-api;2.5 in maven2
     [exec] [ivy:resolve] 	found javax.servlet#jstl;1.1.2 in maven2
     [exec] [ivy:resolve] 	found taglibs#standard;1.1.2 in maven2
     [exec] [ivy:resolve] 	found junitperf#junitperf;1.8 in maven2
     [exec] [ivy:resolve] :: resolution report :: resolve 258ms :: artifacts dl 10ms
     [exec] 	---------------------------------------------------------------------
     [exec] 	|                  |            modules            ||   artifacts   |
     [exec] 	|       conf       | number| search|dwnlded|evicted|| number|dwnlded|
     [exec] 	---------------------------------------------------------------------
     [exec] 	|      common      |   27  |   0   |   0   |   0   ||   27  |   0   |
     [exec] 	---------------------------------------------------------------------
     [exec] 
     [exec] ivy-retrieve-common:
     [exec] [ivy:retrieve] :: retrieving :: org.apache.hadoop#hdfsproxy [sync]
     [exec] [ivy:retrieve] 	confs: [common]
     [exec] [ivy:retrieve] 	0 artifacts copied, 27 already retrieved (0kB/11ms)
     [exec] No ivy:settings found for the default reference 'ivy.instance'.  A default instance
will be used
     [exec] :: loading settings :: file = http://hudson.zones.apache.org/hudson/job/Hadoop-Patch-vesta.apache.org/ws/trunk/ivy/ivysettings.xml

     [exec] 
     [exec] compile:
     [exec]      [echo] contrib: hdfsproxy
     [exec] 
     [exec] compile-examples:
     [exec] 
     [exec] compile-test:
     [exec]      [echo] contrib: hdfsproxy
     [exec]     [javac] Compiling 7 source files to http://hudson.zones.apache.org/hudson/job/Hadoop-Patch-vesta.apache.org/ws/trunk/build/contrib/hdfsproxy/test

     [exec] 
     [exec] test-junit:
     [exec]     [junit] Running org.apache.hadoop.hdfsproxy.TestHdfsProxy
     [exec]     [junit] Tests run: 1, Failures: 0, Errors: 1, Time elapsed: 19.871 sec
     [exec]     [junit] Test org.apache.hadoop.hdfsproxy.TestHdfsProxy FAILED
     [exec]     [junit] Running org.apache.hadoop.hdfsproxy.TestProxyUgiManager
     [exec]     [junit] Tests run: 3, Failures: 0, Errors: 0, Time elapsed: 4.131 sec
     [exec] 
     [exec] BUILD FAILED
     [exec] http://hudson.zones.apache.org/hudson/job/Hadoop-Patch-vesta.apache.org/ws/trunk/build.xml
:1028: The following error occurred while executing this line:
     [exec] http://hudson.zones.apache.org/hudson/job/Hadoop-Patch-vesta.apache.org/ws/trunk/src/contrib/build.xml
:51: The following error occurred while executing this line:
     [exec] http://hudson.zones.apache.org/hudson/job/Hadoop-Patch-vesta.apache.org/ws/trunk/src/contrib/hdfsproxy/build.xml
:224: Tests failed!
     [exec] 
     [exec] Total time: 32 seconds
     [exec] 
     [exec] 
     [exec] 
     [exec] 
     [exec] -1 overall.  Here are the results of testing the latest attachment 
     [exec]   http://issues.apache.org/jira/secure/attachment/12410427/HADOOP-6013.patch
     [exec]   against trunk revision 785065.
     [exec] 
     [exec]     +1 @author.  The patch does not contain any @author tags.
     [exec] 
     [exec]     -1 tests included.  The patch doesn't appear to include any new or modified
tests.
     [exec]                         Please justify why no tests are needed for this patch.
     [exec] 
     [exec]     +1 javadoc.  The javadoc tool did not generate any warning messages.
     [exec] 
     [exec]     +1 javac.  The applied patch does not increase the total number of javac compiler
warnings.
     [exec] 
     [exec]     +1 findbugs.  The patch does not introduce any new Findbugs warnings.
     [exec] 
     [exec]     +1 Eclipse classpath. The patch retains Eclipse classpath integrity.
     [exec] 
     [exec]     +1 release audit.  The applied patch does not increase the total number of
release audit warnings.
     [exec] 
     [exec]     -1 core tests.  The patch failed core unit tests.
     [exec] 
     [exec]     -1 contrib tests.  The patch failed contrib unit tests.
     [exec] 
     [exec] Test results: http://hudson.zones.apache.org/hudson/job/Hadoop-Patch-vesta.apache.org/502/testReport/
     [exec] Findbugs warnings: http://hudson.zones.apache.org/hudson/job/Hadoop-Patch-vesta.apache.org/502/artifact/trunk/build/test/findbugs/newPatchFindbugsWarnings.html
     [exec] Checkstyle results: http://hudson.zones.apache.org/hudson/job/Hadoop-Patch-vesta.apache.org/502/artifact/trunk/build/test/checkstyle-errors.html
     [exec] Console output: http://hudson.zones.apache.org/hudson/job/Hadoop-Patch-vesta.apache.org/502/console
     [exec] 
     [exec] This message is automatically generated.
     [exec] 
     [exec] 
     [exec] ======================================================================
     [exec] ======================================================================
     [exec]     Adding comment to Jira.
     [exec] ======================================================================
     [exec] ======================================================================
     [exec] 
     [exec] 
     [exec]   % Total    % Received % Xferd  Average Speed   Time    Time     Time  Current
     [exec]                                  Dload  Upload   Total   Spent    Left  Speed
     [exec] 
     [exec]   0     0    0     0    0     0      0      0 --:--:-- --:--:-- --:--:--     0
 0     0    0     0    0     0      0      0 --:--:-- --:--:-- --:--:--     0
     [exec] 
     [exec] 
     [exec] ======================================================================
     [exec] ======================================================================
     [exec]     Finished build.
     [exec] ======================================================================
     [exec] ======================================================================
     [exec] 
     [exec] 

BUILD FAILED
http://hudson.zones.apache.org/hudson/job/Hadoop-Patch-vesta.apache.org/ws/trunk/build.xml
:1878: exec returned: 3

Total time: 230 minutes 29 seconds
Recording test results
Description found: HADOOP-6013


Mime
View raw message