hadoop-common-dev mailing list archives

Site index · List index
Message view « Date » · « Thread »
Top « Date » · « Thread »
From Apache Hudson Server <hud...@hudson.zones.apache.org>
Subject Build failed in Hudson: Hadoop-trunk #449
Date Wed, 02 Apr 2008 11:58:03 GMT
See http://hudson.zones.apache.org/hudson/job/Hadoop-trunk/449/changes

------------------------------------------
[...truncated 5429 lines...]
    [junit] 2008-04-02 11:56:08,246 INFO  mapred.MiniMRCluster (MiniMRCluster.java:<init>(353))
- Waiting for JobTracker to start...
    [junit] 2008-04-02 11:56:09,256 INFO  mapred.MiniMRCluster (MiniMRCluster.java:<init>(353))
- Waiting for JobTracker to start...
    [junit] 2008-04-02 11:56:10,266 INFO  mapred.MiniMRCluster (MiniMRCluster.java:<init>(353))
- Waiting for JobTracker to start...
    [junit] 2008-04-02 11:56:11,276 INFO  mapred.MiniMRCluster (MiniMRCluster.java:<init>(353))
- Waiting for JobTracker to start...
    [junit] 2008-04-02 11:56:12,286 INFO  mapred.MiniMRCluster (MiniMRCluster.java:<init>(353))
- Waiting for JobTracker to start...
    [junit] 2008-04-02 11:56:13,296 INFO  mapred.MiniMRCluster (MiniMRCluster.java:<init>(353))
- Waiting for JobTracker to start...
    [junit] 2008-04-02 11:56:14,306 INFO  mapred.MiniMRCluster (MiniMRCluster.java:<init>(353))
- Waiting for JobTracker to start...
    [junit] 2008-04-02 11:56:15,316 INFO  mapred.MiniMRCluster (MiniMRCluster.java:<init>(353))
- Waiting for JobTracker to start...
    [junit] 2008-04-02 11:56:16,326 INFO  mapred.MiniMRCluster (MiniMRCluster.java:<init>(353))
- Waiting for JobTracker to start...
    [junit] 2008-04-02 11:56:17,336 INFO  mapred.MiniMRCluster (MiniMRCluster.java:<init>(353))
- Waiting for JobTracker to start...
    [junit] 2008-04-02 11:56:18,346 INFO  mapred.MiniMRCluster (MiniMRCluster.java:<init>(353))
- Waiting for JobTracker to start...
    [junit] 2008-04-02 11:56:19,355 INFO  mapred.MiniMRCluster (MiniMRCluster.java:<init>(353))
- Waiting for JobTracker to start...
    [junit] 2008-04-02 11:56:20,365 INFO  mapred.MiniMRCluster (MiniMRCluster.java:<init>(353))
- Waiting for JobTracker to start...
    [junit] 2008-04-02 11:56:21,375 INFO  mapred.MiniMRCluster (MiniMRCluster.java:<init>(353))
- Waiting for JobTracker to start...
    [junit] 2008-04-02 11:56:22,385 INFO  mapred.MiniMRCluster (MiniMRCluster.java:<init>(353))
- Waiting for JobTracker to start...
    [junit] 2008-04-02 11:56:23,395 INFO  mapred.MiniMRCluster (MiniMRCluster.java:<init>(353))
- Waiting for JobTracker to start...
    [junit] 2008-04-02 11:56:24,405 INFO  mapred.MiniMRCluster (MiniMRCluster.java:<init>(353))
- Waiting for JobTracker to start...
    [junit] 2008-04-02 11:56:25,415 INFO  mapred.MiniMRCluster (MiniMRCluster.java:<init>(353))
- Waiting for JobTracker to start...
    [junit] 2008-04-02 11:56:26,425 INFO  mapred.MiniMRCluster (MiniMRCluster.java:<init>(353))
- Waiting for JobTracker to start...
    [junit] 2008-04-02 11:56:27,435 INFO  mapred.MiniMRCluster (MiniMRCluster.java:<init>(353))
- Waiting for JobTracker to start...
    [junit] 2008-04-02 11:56:28,445 INFO  mapred.MiniMRCluster (MiniMRCluster.java:<init>(353))
- Waiting for JobTracker to start...
    [junit] 2008-04-02 11:56:29,455 INFO  mapred.MiniMRCluster (MiniMRCluster.java:<init>(353))
- Waiting for JobTracker to start...
    [junit] 2008-04-02 11:56:30,465 INFO  mapred.MiniMRCluster (MiniMRCluster.java:<init>(353))
- Waiting for JobTracker to start...
    [junit] 2008-04-02 11:56:31,475 INFO  mapred.MiniMRCluster (MiniMRCluster.java:<init>(353))
- Waiting for JobTracker to start...
    [junit] 2008-04-02 11:56:32,485 INFO  mapred.MiniMRCluster (MiniMRCluster.java:<init>(353))
- Waiting for JobTracker to start...
    [junit] 2008-04-02 11:56:33,495 INFO  mapred.MiniMRCluster (MiniMRCluster.java:<init>(353))
- Waiting for JobTracker to start...
    [junit] 2008-04-02 11:56:34,505 INFO  mapred.MiniMRCluster (MiniMRCluster.java:<init>(353))
- Waiting for JobTracker to start...
    [junit] 2008-04-02 11:56:35,515 INFO  mapred.MiniMRCluster (MiniMRCluster.java:<init>(353))
- Waiting for JobTracker to start...
    [junit] 2008-04-02 11:56:36,525 INFO  mapred.MiniMRCluster (MiniMRCluster.java:<init>(353))
- Waiting for JobTracker to start...
    [junit] 2008-04-02 11:56:37,535 INFO  mapred.MiniMRCluster (MiniMRCluster.java:<init>(353))
- Waiting for JobTracker to start...
    [junit] 2008-04-02 11:56:38,545 INFO  mapred.MiniMRCluster (MiniMRCluster.java:<init>(353))
- Waiting for JobTracker to start...
    [junit] 2008-04-02 11:56:39,555 INFO  mapred.MiniMRCluster (MiniMRCluster.java:<init>(353))
- Waiting for JobTracker to start...
    [junit] 2008-04-02 11:56:40,565 INFO  mapred.MiniMRCluster (MiniMRCluster.java:<init>(353))
- Waiting for JobTracker to start...
    [junit] 2008-04-02 11:56:41,575 INFO  mapred.MiniMRCluster (MiniMRCluster.java:<init>(353))
- Waiting for JobTracker to start...
    [junit] 2008-04-02 11:56:42,585 INFO  mapred.MiniMRCluster (MiniMRCluster.java:<init>(353))
- Waiting for JobTracker to start...
    [junit] 2008-04-02 11:56:43,595 INFO  mapred.MiniMRCluster (MiniMRCluster.java:<init>(353))
- Waiting for JobTracker to start...
    [junit] 2008-04-02 11:56:44,605 INFO  mapred.MiniMRCluster (MiniMRCluster.java:<init>(353))
- Waiting for JobTracker to start...
    [junit] 2008-04-02 11:56:45,615 INFO  mapred.MiniMRCluster (MiniMRCluster.java:<init>(353))
- Waiting for JobTracker to start...
    [junit] 2008-04-02 11:56:46,625 INFO  mapred.MiniMRCluster (MiniMRCluster.java:<init>(353))
- Waiting for JobTracker to start...
    [junit] 2008-04-02 11:56:47,635 INFO  mapred.MiniMRCluster (MiniMRCluster.java:<init>(353))
- Waiting for JobTracker to start...
    [junit] 2008-04-02 11:56:48,645 INFO  mapred.MiniMRCluster (MiniMRCluster.java:<init>(353))
- Waiting for JobTracker to start...
    [junit] 2008-04-02 11:56:49,655 INFO  mapred.MiniMRCluster (MiniMRCluster.java:<init>(353))
- Waiting for JobTracker to start...
    [junit] 2008-04-02 11:56:50,665 INFO  mapred.MiniMRCluster (MiniMRCluster.java:<init>(353))
- Waiting for JobTracker to start...
    [junit] 2008-04-02 11:56:51,675 INFO  mapred.MiniMRCluster (MiniMRCluster.java:<init>(353))
- Waiting for JobTracker to start...
    [junit] 2008-04-02 11:56:52,685 INFO  mapred.MiniMRCluster (MiniMRCluster.java:<init>(353))
- Waiting for JobTracker to start...
    [junit] 2008-04-02 11:56:53,695 INFO  mapred.MiniMRCluster (MiniMRCluster.java:<init>(353))
- Waiting for JobTracker to start...
    [junit] 2008-04-02 11:56:54,705 INFO  mapred.MiniMRCluster (MiniMRCluster.java:<init>(353))
- Waiting for JobTracker to start...
    [junit] 2008-04-02 11:56:55,715 INFO  mapred.MiniMRCluster (MiniMRCluster.java:<init>(353))
- Waiting for JobTracker to start...
    [junit] 2008-04-02 11:56:56,725 INFO  mapred.MiniMRCluster (MiniMRCluster.java:<init>(353))
- Waiting for JobTracker to start...
    [junit] 2008-04-02 11:56:57,735 INFO  mapred.MiniMRCluster (MiniMRCluster.java:<init>(353))
- Waiting for JobTracker to start...
    [junit] 2008-04-02 11:56:58,745 INFO  mapred.MiniMRCluster (MiniMRCluster.java:<init>(353))
- Waiting for JobTracker to start...
    [junit] 2008-04-02 11:56:59,755 INFO  mapred.MiniMRCluster (MiniMRCluster.java:<init>(353))
- Waiting for JobTracker to start...
    [junit] 2008-04-02 11:57:00,765 INFO  mapred.MiniMRCluster (MiniMRCluster.java:<init>(353))
- Waiting for JobTracker to start...
    [junit] 2008-04-02 11:57:01,775 INFO  mapred.MiniMRCluster (MiniMRCluster.java:<init>(353))
- Waiting for JobTracker to start...
    [junit] 2008-04-02 11:57:02,784 INFO  mapred.MiniMRCluster (MiniMRCluster.java:<init>(353))
- Waiting for JobTracker to start...
    [junit] 2008-04-02 11:57:03,794 INFO  mapred.MiniMRCluster (MiniMRCluster.java:<init>(353))
- Waiting for JobTracker to start...
    [junit] 2008-04-02 11:57:04,804 INFO  mapred.MiniMRCluster (MiniMRCluster.java:<init>(353))
- Waiting for JobTracker to start...
    [junit] 2008-04-02 11:57:05,814 INFO  mapred.MiniMRCluster (MiniMRCluster.java:<init>(353))
- Waiting for JobTracker to start...
    [junit] 2008-04-02 11:57:06,824 INFO  mapred.MiniMRCluster (MiniMRCluster.java:<init>(353))
- Waiting for JobTracker to start...
    [junit] 2008-04-02 11:57:07,834 INFO  mapred.MiniMRCluster (MiniMRCluster.java:<init>(353))
- Waiting for JobTracker to start...
    [junit] 2008-04-02 11:57:08,844 INFO  mapred.MiniMRCluster (MiniMRCluster.java:<init>(353))
- Waiting for JobTracker to start...
    [junit] 2008-04-02 11:57:09,854 INFO  mapred.MiniMRCluster (MiniMRCluster.java:<init>(353))
- Waiting for JobTracker to start...
    [junit] 2008-04-02 11:57:10,864 INFO  mapred.MiniMRCluster (MiniMRCluster.java:<init>(353))
- Waiting for JobTracker to start...
    [junit] 2008-04-02 11:57:11,874 INFO  mapred.MiniMRCluster (MiniMRCluster.java:<init>(353))
- Waiting for JobTracker to start...
    [junit] 2008-04-02 11:57:12,884 INFO  mapred.MiniMRCluster (MiniMRCluster.java:<init>(353))
- Waiting for JobTracker to start...
    [junit] 2008-04-02 11:57:13,894 INFO  mapred.MiniMRCluster (MiniMRCluster.java:<init>(353))
- Waiting for JobTracker to start...
    [junit] 2008-04-02 11:57:14,904 INFO  mapred.MiniMRCluster (MiniMRCluster.java:<init>(353))
- Waiting for JobTracker to start...
    [junit] 2008-04-02 11:57:15,914 INFO  mapred.MiniMRCluster (MiniMRCluster.java:<init>(353))
- Waiting for JobTracker to start...
    [junit] 2008-04-02 11:57:16,924 INFO  mapred.MiniMRCluster (MiniMRCluster.java:<init>(353))
- Waiting for JobTracker to start...
    [junit] 2008-04-02 11:57:17,934 INFO  mapred.MiniMRCluster (MiniMRCluster.java:<init>(353))
- Waiting for JobTracker to start...
    [junit] 2008-04-02 11:57:18,944 INFO  mapred.MiniMRCluster (MiniMRCluster.java:<init>(353))
- Waiting for JobTracker to start...
    [junit] 2008-04-02 11:57:19,954 INFO  mapred.MiniMRCluster (MiniMRCluster.java:<init>(353))
- Waiting for JobTracker to start...
    [junit] 2008-04-02 11:57:20,964 INFO  mapred.MiniMRCluster (MiniMRCluster.java:<init>(353))
- Waiting for JobTracker to start...
    [junit] 2008-04-02 11:57:21,974 INFO  mapred.MiniMRCluster (MiniMRCluster.java:<init>(353))
- Waiting for JobTracker to start...
    [junit] 2008-04-02 11:57:22,984 INFO  mapred.MiniMRCluster (MiniMRCluster.java:<init>(353))
- Waiting for JobTracker to start...
    [junit] 2008-04-02 11:57:23,994 INFO  mapred.MiniMRCluster (MiniMRCluster.java:<init>(353))
- Waiting for JobTracker to start...
    [junit] 2008-04-02 11:57:25,004 INFO  mapred.MiniMRCluster (MiniMRCluster.java:<init>(353))
- Waiting for JobTracker to start...
    [junit] 2008-04-02 11:57:26,014 INFO  mapred.MiniMRCluster (MiniMRCluster.java:<init>(353))
- Waiting for JobTracker to start...
    [junit] Running org.apache.hadoop.mapred.TestMiniMRLocalFS
    [junit] Tests run: 1, Failures: 0, Errors: 1, Time elapsed: 0 sec
    [junit] Test org.apache.hadoop.mapred.TestMiniMRLocalFS FAILED (timeout)
    [junit] Running org.apache.hadoop.mapred.TestMiniMRMapRedDebugScript
    [junit] [CLOVER] FATAL ERROR: Clover could not be initialised. Are you sure you have Clover
in the runtime classpath? (class java.lang.NoClassDefFoundError:com_cenqua_clover/CloverVersionInfo)
    [junit] Tests run: 1, Failures: 0, Errors: 1, Time elapsed: 0.073 sec
    [junit] Test org.apache.hadoop.mapred.TestMiniMRMapRedDebugScript FAILED
    [junit] Running org.apache.hadoop.mapred.TestMiniMRTaskTempDir
    [junit] [CLOVER] FATAL ERROR: Clover could not be initialised. Are you sure you have Clover
in the runtime classpath? (class java.lang.NoClassDefFoundError:com_cenqua_clover/CloverVersionInfo)
    [junit] Tests run: 1, Failures: 0, Errors: 1, Time elapsed: 0.08 sec
    [junit] Test org.apache.hadoop.mapred.TestMiniMRTaskTempDir FAILED
    [junit] Running org.apache.hadoop.mapred.TestMiniMRWithDFS
    [junit] [CLOVER] FATAL ERROR: Clover could not be initialised. Are you sure you have Clover
in the runtime classpath? (class java.lang.NoClassDefFoundError:com_cenqua_clover/CloverVersionInfo)
    [junit] Tests run: 1, Failures: 0, Errors: 1, Time elapsed: 0.069 sec
    [junit] Test org.apache.hadoop.mapred.TestMiniMRWithDFS FAILED
    [junit] [CLOVER] FATAL ERROR: Clover could not be initialised. Are you sure you have Clover
in the runtime classpath? (class java.lang.NoClassDefFoundError:com_cenqua_clover/CloverVersionInfo)
    [junit] Running org.apache.hadoop.mapred.TestMiniMRWithDFSWithDistinctUsers
    [junit] Tests run: 1, Failures: 0, Errors: 1, Time elapsed: 0 sec
    [junit] Test org.apache.hadoop.mapred.TestMiniMRWithDFSWithDistinctUsers FAILED
    [junit] [CLOVER] FATAL ERROR: Clover could not be initialised. Are you sure you have Clover
in the runtime classpath? (class java.lang.NoClassDefFoundError:com_cenqua_clover/CloverVersionInfo)
    [junit] Running org.apache.hadoop.mapred.TestMultiFileInputFormat
    [junit] Tests run: 1, Failures: 0, Errors: 1, Time elapsed: 0 sec
    [junit] Test org.apache.hadoop.mapred.TestMultiFileInputFormat FAILED
    [junit] Running org.apache.hadoop.mapred.TestMultiFileSplit
    [junit] [CLOVER] FATAL ERROR: Clover could not be initialised. Are you sure you have Clover
in the runtime classpath? (class java.lang.NoClassDefFoundError:com_cenqua_clover/CloverVersionInfo)
    [junit] Tests run: 1, Failures: 0, Errors: 1, Time elapsed: 0.179 sec
    [junit] Test org.apache.hadoop.mapred.TestMultiFileSplit FAILED
    [junit] [CLOVER] FATAL ERROR: Clover could not be initialised. Are you sure you have Clover
in the runtime classpath? (class java.lang.NoClassDefFoundError:com_cenqua_clover/CloverVersionInfo)
    [junit] Running org.apache.hadoop.mapred.TestMultipleTextOutputFormat
    [junit] Tests run: 1, Failures: 0, Errors: 1, Time elapsed: 0 sec
    [junit] Test org.apache.hadoop.mapred.TestMultipleTextOutputFormat FAILED
    [junit] [CLOVER] FATAL ERROR: Clover could not be initialised. Are you sure you have Clover
in the runtime classpath? (class java.lang.NoClassDefFoundError:com_cenqua_clover/CloverVersionInfo)
    [junit] Running org.apache.hadoop.mapred.TestRackAwareTaskPlacement
    [junit] 	at org.apache.hadoop.fs.Path.<init>(Path.java:89)
    [junit] 	at org.apache.hadoop.mapred.TestRackAwareTaskPlacement.<init>(TestRackAwareTaskPlacement.java:55)
    [junit] 	at sun.reflect.NativeConstructorAccessorImpl.newInstance0(Native Method)
    [junit] 	at sun.reflect.NativeConstructorAccessorImpl.newInstance(NativeConstructorAccessorImpl.java:39)
    [junit] 	at sun.reflect.DelegatingConstructorAccessorImpl.newInstance(DelegatingConstructorAccessorImpl.java:27)
    [junit] 	at java.lang.reflect.Constructor.newInstance(Constructor.java:494)
    [junit] 	at junit.framework.TestSuite.createTest(TestSuite.java:131)
    [junit] 	at junit.framework.TestSuite.addTestMethod(TestSuite.java:114)
    [junit] 	at junit.framework.TestSuite.<init>(TestSuite.java:75)
    [junit] 	at org.apache.tools.ant.taskdefs.optional.junit.JUnitTestRunner.run(JUnitTestRunner.java:397)
    [junit] 	at org.apache.tools.ant.taskdefs.optional.junit.JUnitTestRunner.launch(JUnitTestRunner.java:912)
    [junit] 	at org.apache.tools.ant.taskdefs.optional.junit.JUnitTestRunner.main(JUnitTestRunner.java:766)
    [junit] ))
    [junit] Tests run: 1, Failures: 1, Errors: 0, Time elapsed: 0.081 sec
    [junit] Test org.apache.hadoop.mapred.TestRackAwareTaskPlacement FAILED
    [junit] Running org.apache.hadoop.mapred.TestReduceTask
    [junit] [CLOVER] FATAL ERROR: Clover could not be initialised. Are you sure you have Clover
in the runtime classpath? (class java.lang.NoClassDefFoundError:com_cenqua_clover/CloverVersionInfo)
    [junit] Tests run: 1, Failures: 0, Errors: 1, Time elapsed: 0.079 sec
    [junit] Test org.apache.hadoop.mapred.TestReduceTask FAILED
    [junit] Running org.apache.hadoop.mapred.TestSequenceFileAsBinaryInputFormat
    [junit] [CLOVER] FATAL ERROR: Clover could not be initialised. Are you sure you have Clover
in the runtime classpath? (class java.lang.NoClassDefFoundError:com_cenqua_clover/CloverVersionInfo)
    [junit] Tests run: 1, Failures: 0, Errors: 1, Time elapsed: 0.074 sec
    [junit] Test org.apache.hadoop.mapred.TestSequenceFileAsBinaryInputFormat FAILED
    [junit] [CLOVER] FATAL ERROR: Clover could not be initialised. Are you sure you have Clover
in the runtime classpath? (class java.lang.NoClassDefFoundError:com_cenqua_clover/CloverVersionInfo)
    [junit] Running org.apache.hadoop.mapred.TestSequenceFileAsTextInputFormat
    [junit] Tests run: 1, Failures: 0, Errors: 1, Time elapsed: 0 sec
    [junit] Test org.apache.hadoop.mapred.TestSequenceFileAsTextInputFormat FAILED
    [junit] [CLOVER] FATAL ERROR: Clover could not be initialised. Are you sure you have Clover
in the runtime classpath? (class java.lang.NoClassDefFoundError:com_cenqua_clover/CloverVersionInfo)
    [junit] Running org.apache.hadoop.mapred.TestSequenceFileInputFilter
    [junit] Tests run: 1, Failures: 0, Errors: 1, Time elapsed: 0 sec
    [junit] Test org.apache.hadoop.mapred.TestSequenceFileInputFilter FAILED
    [junit] [CLOVER] FATAL ERROR: Clover could not be initialised. Are you sure you have Clover
in the runtime classpath? (class java.lang.NoClassDefFoundError:com_cenqua_clover/CloverVersionInfo)
    [junit] Running org.apache.hadoop.mapred.TestSequenceFileInputFormat
    [junit] Tests run: 1, Failures: 0, Errors: 1, Time elapsed: 0 sec
    [junit] Test org.apache.hadoop.mapred.TestSequenceFileInputFormat FAILED
    [junit] Running org.apache.hadoop.mapred.TestSpecialCharactersInOutputPath
    [junit] [CLOVER] FATAL ERROR: Clover could not be initialised. Are you sure you have Clover
in the runtime classpath? (class java.lang.NoClassDefFoundError:com_cenqua_clover/CloverVersionInfo)
    [junit] Tests run: 1, Failures: 0, Errors: 1, Time elapsed: 0.075 sec
    [junit] Test org.apache.hadoop.mapred.TestSpecialCharactersInOutputPath FAILED
    [junit] [CLOVER] FATAL ERROR: Clover could not be initialised. Are you sure you have Clover
in the runtime classpath? (class java.lang.NoClassDefFoundError:com_cenqua_clover/CloverVersionInfo)
    [junit] Running org.apache.hadoop.mapred.TestTextInputFormat
    [junit] Tests run: 1, Failures: 0, Errors: 1, Time elapsed: 0 sec
    [junit] Test org.apache.hadoop.mapred.TestTextInputFormat FAILED
    [junit] [CLOVER] FATAL ERROR: Clover could not be initialised. Are you sure you have Clover
in the runtime classpath? (class java.lang.NoClassDefFoundError:com_cenqua_clover/CloverVersionInfo)
    [junit] Running org.apache.hadoop.mapred.TestTextOutputFormat
    [junit] Tests run: 1, Failures: 0, Errors: 1, Time elapsed: 0 sec
    [junit] Test org.apache.hadoop.mapred.TestTextOutputFormat FAILED
    [junit] Running org.apache.hadoop.mapred.jobcontrol.TestJobControl
    [junit] [CLOVER] FATAL ERROR: Clover could not be initialised. Are you sure you have Clover
in the runtime classpath? (class java.lang.NoClassDefFoundError:com_cenqua_clover/CloverVersionInfo)
    [junit] Tests run: 1, Failures: 0, Errors: 1, Time elapsed: 0.175 sec
    [junit] Test org.apache.hadoop.mapred.jobcontrol.TestJobControl FAILED
    [junit] Running org.apache.hadoop.mapred.jobcontrol.TestLocalJobControl
    [junit] [CLOVER] FATAL ERROR: Clover could not be initialised. Are you sure you have Clover
in the runtime classpath? (class java.lang.NoClassDefFoundError:com_cenqua_clover/CloverVersionInfo)
    [junit] Tests run: 1, Failures: 0, Errors: 1, Time elapsed: 0.072 sec
    [junit] Test org.apache.hadoop.mapred.jobcontrol.TestLocalJobControl FAILED
    [junit] Running org.apache.hadoop.mapred.join.TestDatamerge
    [junit] [CLOVER] FATAL ERROR: Clover could not be initialised. Are you sure you have Clover
in the runtime classpath? (class java.lang.NoClassDefFoundError:com_cenqua_clover/CloverVersionInfo)
    [junit] Tests run: 0, Failures: 0, Errors: 1, Time elapsed: 0.179 sec
    [junit] Test org.apache.hadoop.mapred.join.TestDatamerge FAILED
    [junit] Running org.apache.hadoop.mapred.join.TestTupleWritable
    [junit] [CLOVER] FATAL ERROR: Clover could not be initialised. Are you sure you have Clover
in the runtime classpath? (class java.lang.NoClassDefFoundError:com_cenqua_clover/CloverVersionInfo)
    [junit] Tests run: 3, Failures: 0, Errors: 3, Time elapsed: 0.091 sec
    [junit] Test org.apache.hadoop.mapred.join.TestTupleWritable FAILED
    [junit] Running org.apache.hadoop.mapred.lib.TestMultithreadedMapRunner
    [junit] [CLOVER] FATAL ERROR: Clover could not be initialised. Are you sure you have Clover
in the runtime classpath? (class java.lang.NoClassDefFoundError:com_cenqua_clover/CloverVersionInfo)
    [junit] Tests run: 3, Failures: 0, Errors: 3, Time elapsed: 0.171 sec
    [junit] Test org.apache.hadoop.mapred.lib.TestMultithreadedMapRunner FAILED
    [junit] Running org.apache.hadoop.mapred.lib.aggregate.TestAggregates
    [junit] [CLOVER] FATAL ERROR: Clover could not be initialised. Are you sure you have Clover
in the runtime classpath? (class java.lang.NoClassDefFoundError:com_cenqua_clover/CloverVersionInfo)
    [junit] Tests run: 1, Failures: 0, Errors: 1, Time elapsed: 0.174 sec
    [junit] Test org.apache.hadoop.mapred.lib.aggregate.TestAggregates FAILED
    [junit] Running org.apache.hadoop.mapred.pipes.TestPipes
    [junit] [CLOVER] FATAL ERROR: Clover could not be initialised. Are you sure you have Clover
in the runtime classpath? (class java.lang.NoClassDefFoundError:com_cenqua_clover/CloverVersionInfo)
    [junit] Tests run: 1, Failures: 0, Errors: 1, Time elapsed: 0.066 sec
    [junit] Test org.apache.hadoop.mapred.pipes.TestPipes FAILED
    [junit] [CLOVER] FATAL ERROR: Clover could not be initialised. Are you sure you have Clover
in the runtime classpath? (class java.lang.NoClassDefFoundError:com_cenqua_clover/CloverVersionInfo)
    [junit] Running org.apache.hadoop.net.TestNetworkTopology
    [junit] Tests run: 1, Failures: 0, Errors: 1, Time elapsed: 0 sec
    [junit] Test org.apache.hadoop.net.TestNetworkTopology FAILED
    [junit] Running org.apache.hadoop.net.TestSocketIOWithTimeout
    [junit] [CLOVER] FATAL ERROR: Clover could not be initialised. Are you sure you have Clover
in the runtime classpath? (class java.lang.NoClassDefFoundError:com_cenqua_clover/CloverVersionInfo)
    [junit] Tests run: 1, Failures: 0, Errors: 1, Time elapsed: 0.08 sec
    [junit] Test org.apache.hadoop.net.TestSocketIOWithTimeout FAILED
    [junit] Running org.apache.hadoop.record.TestBuffer
    [junit] Tests run: 6, Failures: 0, Errors: 0, Time elapsed: 0.078 sec
    [junit] Running org.apache.hadoop.record.TestRecordIO
    [junit] [CLOVER] FATAL ERROR: Clover could not be initialised. Are you sure you have Clover
in the runtime classpath? (class java.lang.NoClassDefFoundError:com_cenqua_clover/CloverVersionInfo)
    [junit] [CLOVER] FATAL ERROR: Clover could not be initialised. Are you sure you have Clover
in the runtime classpath? (class java.lang.NoClassDefFoundError:com_cenqua_clover/CloverVersionInfo)
    [junit] [CLOVER] FATAL ERROR: Clover could not be initialised. Are you sure you have Clover
in the runtime classpath? (class java.lang.NoClassDefFoundError:com_cenqua_clover/CloverVersionInfo)
    [junit] [CLOVER] FATAL ERROR: Clover could not be initialised. Are you sure you have Clover
in the runtime classpath? (class java.lang.NoClassDefFoundError:com_cenqua_clover/CloverVersionInfo)
    [junit] Tests run: 5, Failures: 1, Errors: 4, Time elapsed: 0.111 sec
    [junit] Test org.apache.hadoop.record.TestRecordIO FAILED
    [junit] [CLOVER] FATAL ERROR: Clover could not be initialised. Are you sure you have Clover
in the runtime classpath? (class java.lang.NoClassDefFoundError:com_cenqua_clover/CloverVersionInfo)
    [junit] Running org.apache.hadoop.record.TestRecordMR
    [junit] Tests run: 1, Failures: 0, Errors: 1, Time elapsed: 0 sec
    [junit] Test org.apache.hadoop.record.TestRecordMR FAILED
    [junit] Running org.apache.hadoop.record.TestRecordVersioning
    [junit] [CLOVER] FATAL ERROR: Clover could not be initialised. Are you sure you have Clover
in the runtime classpath? (class java.lang.NoClassDefFoundError:com_cenqua_clover/CloverVersionInfo)
    [junit] Tests run: 2, Failures: 0, Errors: 2, Time elapsed: 0.083 sec
    [junit] Test org.apache.hadoop.record.TestRecordVersioning FAILED
    [junit] [CLOVER] FATAL ERROR: Clover could not be initialised. Are you sure you have Clover
in the runtime classpath? (class java.lang.NoClassDefFoundError:com_cenqua_clover/CloverVersionInfo)
    [junit] Running org.apache.hadoop.record.TestRecordWritable
    [junit] Tests run: 1, Failures: 0, Errors: 1, Time elapsed: 0 sec
    [junit] Test org.apache.hadoop.record.TestRecordWritable FAILED
    [junit] [CLOVER] FATAL ERROR: Clover could not be initialised. Are you sure you have Clover
in the runtime classpath? (class java.lang.NoClassDefFoundError:com_cenqua_clover/CloverVersionInfo)
    [junit] Running org.apache.hadoop.security.TestPermission
    [junit] Tests run: 1, Failures: 0, Errors: 1, Time elapsed: 0 sec
    [junit] Test org.apache.hadoop.security.TestPermission FAILED
    [junit] Running org.apache.hadoop.security.TestUnixUserGroupInformation
    [junit] [CLOVER] FATAL ERROR: Clover could not be initialised. Are you sure you have Clover
in the runtime classpath? (class java.lang.NoClassDefFoundError:com_cenqua_clover/CloverVersionInfo)
    [junit] [CLOVER] FATAL ERROR: Clover could not be initialised. Are you sure you have Clover
in the runtime classpath? (class java.lang.NoClassDefFoundError:com_cenqua_clover/CloverVersionInfo)
    [junit] Tests run: 4, Failures: 0, Errors: 4, Time elapsed: 0.183 sec
    [junit] Test org.apache.hadoop.security.TestUnixUserGroupInformation FAILED
    [junit] Running org.apache.hadoop.util.TestIndexedSort
    [junit] [CLOVER] FATAL ERROR: Clover could not be initialised. Are you sure you have Clover
in the runtime classpath? (class java.lang.NoClassDefFoundError:com_cenqua_clover/CloverVersionInfo)
    [junit] [CLOVER] FATAL ERROR: Clover could not be initialised. Are you sure you have Clover
in the runtime classpath? (class java.lang.NoClassDefFoundError:com_cenqua_clover/CloverVersionInfo)
    [junit] Tests run: 5, Failures: 0, Errors: 5, Time elapsed: 0.22 sec
    [junit] Test org.apache.hadoop.util.TestIndexedSort FAILED
    [junit] Running org.apache.hadoop.util.TestReflectionUtils
    [junit] [CLOVER] FATAL ERROR: Clover could not be initialised. Are you sure you have Clover
in the runtime classpath? (class java.lang.NoClassDefFoundError:com_cenqua_clover/CloverVersionInfo)
    [junit] Tests run: 4, Failures: 0, Errors: 4, Time elapsed: 0.089 sec
    [junit] Test org.apache.hadoop.util.TestReflectionUtils FAILED
    [junit] Running org.apache.hadoop.util.TestShell
    [junit] [CLOVER] FATAL ERROR: Clover could not be initialised. Are you sure you have Clover
in the runtime classpath? (class java.lang.NoClassDefFoundError:com_cenqua_clover/CloverVersionInfo)
    [junit] Tests run: 1, Failures: 0, Errors: 1, Time elapsed: 0.166 sec
    [junit] Test org.apache.hadoop.util.TestShell FAILED
    [junit] Running org.apache.hadoop.util.TestStringUtils
    [junit] [CLOVER] FATAL ERROR: Clover could not be initialised. Are you sure you have Clover
in the runtime classpath? (class java.lang.NoClassDefFoundError:com_cenqua_clover/CloverVersionInfo)
    [junit] Tests run: 3, Failures: 0, Errors: 3, Time elapsed: 0.087 sec
    [junit] Test org.apache.hadoop.util.TestStringUtils FAILED

BUILD FAILED
/zonestorage/hudson/home/hudson/hudson/jobs/Hadoop-trunk/workspace/trunk/build.xml:588: Tests
failed!

Total time: 34 minutes 26 seconds
Recording fingerprints
Publishing Javadoc
Recording test results


Mime
View raw message