hadoop-common-dev mailing list archives

Site index · List index
Message view « Date » · « Thread »
Top « Date » · « Thread »
From Apache Hudson Server <hud...@hudson.zones.apache.org>
Subject Build failed in Hudson: Hadoop-trunk #450
Date Thu, 03 Apr 2008 12:56:17 GMT
See http://hudson.zones.apache.org/hudson/job/Hadoop-trunk/450/changes

Changes:

[dhruba] HADOOP-3118.  Fix Namenode NPE while loading fsimage after a cluster
upgrade from older disk format. (dhruba)

[cdouglas] HADOOP-2634. Deprecate ClientProtocol::exists.
Contributed by lohit vijayarenu.

[rangadi] HADOOP-2551. More environment variables like HADOOP_NAMENODE_OPTS
for better control of HADOOP_OPTS for each component. (rangadi)

[cdouglas] HADOOP-2839. Remove deprecated FileSystem::globPaths.
Contributed by lohit vijayarenu.

------------------------------------------
[...truncated 5432 lines...]
    [junit] 2008-04-03 12:54:19,811 INFO  mapred.MiniMRCluster (MiniMRCluster.java:<init>(353))
- Waiting for JobTracker to start...
    [junit] 2008-04-03 12:54:20,821 INFO  mapred.MiniMRCluster (MiniMRCluster.java:<init>(353))
- Waiting for JobTracker to start...
    [junit] 2008-04-03 12:54:21,831 INFO  mapred.MiniMRCluster (MiniMRCluster.java:<init>(353))
- Waiting for JobTracker to start...
    [junit] 2008-04-03 12:54:22,841 INFO  mapred.MiniMRCluster (MiniMRCluster.java:<init>(353))
- Waiting for JobTracker to start...
    [junit] 2008-04-03 12:54:23,851 INFO  mapred.MiniMRCluster (MiniMRCluster.java:<init>(353))
- Waiting for JobTracker to start...
    [junit] 2008-04-03 12:54:24,861 INFO  mapred.MiniMRCluster (MiniMRCluster.java:<init>(353))
- Waiting for JobTracker to start...
    [junit] 2008-04-03 12:54:25,871 INFO  mapred.MiniMRCluster (MiniMRCluster.java:<init>(353))
- Waiting for JobTracker to start...
    [junit] 2008-04-03 12:54:26,881 INFO  mapred.MiniMRCluster (MiniMRCluster.java:<init>(353))
- Waiting for JobTracker to start...
    [junit] 2008-04-03 12:54:27,891 INFO  mapred.MiniMRCluster (MiniMRCluster.java:<init>(353))
- Waiting for JobTracker to start...
    [junit] 2008-04-03 12:54:28,901 INFO  mapred.MiniMRCluster (MiniMRCluster.java:<init>(353))
- Waiting for JobTracker to start...
    [junit] 2008-04-03 12:54:29,911 INFO  mapred.MiniMRCluster (MiniMRCluster.java:<init>(353))
- Waiting for JobTracker to start...
    [junit] 2008-04-03 12:54:30,921 INFO  mapred.MiniMRCluster (MiniMRCluster.java:<init>(353))
- Waiting for JobTracker to start...
    [junit] 2008-04-03 12:54:31,931 INFO  mapred.MiniMRCluster (MiniMRCluster.java:<init>(353))
- Waiting for JobTracker to start...
    [junit] 2008-04-03 12:54:32,941 INFO  mapred.MiniMRCluster (MiniMRCluster.java:<init>(353))
- Waiting for JobTracker to start...
    [junit] 2008-04-03 12:54:33,951 INFO  mapred.MiniMRCluster (MiniMRCluster.java:<init>(353))
- Waiting for JobTracker to start...
    [junit] 2008-04-03 12:54:34,961 INFO  mapred.MiniMRCluster (MiniMRCluster.java:<init>(353))
- Waiting for JobTracker to start...
    [junit] 2008-04-03 12:54:35,971 INFO  mapred.MiniMRCluster (MiniMRCluster.java:<init>(353))
- Waiting for JobTracker to start...
    [junit] 2008-04-03 12:54:36,981 INFO  mapred.MiniMRCluster (MiniMRCluster.java:<init>(353))
- Waiting for JobTracker to start...
    [junit] 2008-04-03 12:54:37,991 INFO  mapred.MiniMRCluster (MiniMRCluster.java:<init>(353))
- Waiting for JobTracker to start...
    [junit] 2008-04-03 12:54:39,001 INFO  mapred.MiniMRCluster (MiniMRCluster.java:<init>(353))
- Waiting for JobTracker to start...
    [junit] 2008-04-03 12:54:40,011 INFO  mapred.MiniMRCluster (MiniMRCluster.java:<init>(353))
- Waiting for JobTracker to start...
    [junit] 2008-04-03 12:54:41,021 INFO  mapred.MiniMRCluster (MiniMRCluster.java:<init>(353))
- Waiting for JobTracker to start...
    [junit] 2008-04-03 12:54:42,031 INFO  mapred.MiniMRCluster (MiniMRCluster.java:<init>(353))
- Waiting for JobTracker to start...
    [junit] 2008-04-03 12:54:43,041 INFO  mapred.MiniMRCluster (MiniMRCluster.java:<init>(353))
- Waiting for JobTracker to start...
    [junit] 2008-04-03 12:54:44,051 INFO  mapred.MiniMRCluster (MiniMRCluster.java:<init>(353))
- Waiting for JobTracker to start...
    [junit] 2008-04-03 12:54:45,061 INFO  mapred.MiniMRCluster (MiniMRCluster.java:<init>(353))
- Waiting for JobTracker to start...
    [junit] 2008-04-03 12:54:46,071 INFO  mapred.MiniMRCluster (MiniMRCluster.java:<init>(353))
- Waiting for JobTracker to start...
    [junit] 2008-04-03 12:54:47,081 INFO  mapred.MiniMRCluster (MiniMRCluster.java:<init>(353))
- Waiting for JobTracker to start...
    [junit] 2008-04-03 12:54:48,091 INFO  mapred.MiniMRCluster (MiniMRCluster.java:<init>(353))
- Waiting for JobTracker to start...
    [junit] 2008-04-03 12:54:49,101 INFO  mapred.MiniMRCluster (MiniMRCluster.java:<init>(353))
- Waiting for JobTracker to start...
    [junit] 2008-04-03 12:54:50,111 INFO  mapred.MiniMRCluster (MiniMRCluster.java:<init>(353))
- Waiting for JobTracker to start...
    [junit] 2008-04-03 12:54:51,121 INFO  mapred.MiniMRCluster (MiniMRCluster.java:<init>(353))
- Waiting for JobTracker to start...
    [junit] 2008-04-03 12:54:52,131 INFO  mapred.MiniMRCluster (MiniMRCluster.java:<init>(353))
- Waiting for JobTracker to start...
    [junit] 2008-04-03 12:54:53,141 INFO  mapred.MiniMRCluster (MiniMRCluster.java:<init>(353))
- Waiting for JobTracker to start...
    [junit] 2008-04-03 12:54:54,151 INFO  mapred.MiniMRCluster (MiniMRCluster.java:<init>(353))
- Waiting for JobTracker to start...
    [junit] 2008-04-03 12:54:55,161 INFO  mapred.MiniMRCluster (MiniMRCluster.java:<init>(353))
- Waiting for JobTracker to start...
    [junit] 2008-04-03 12:54:56,171 INFO  mapred.MiniMRCluster (MiniMRCluster.java:<init>(353))
- Waiting for JobTracker to start...
    [junit] 2008-04-03 12:54:57,181 INFO  mapred.MiniMRCluster (MiniMRCluster.java:<init>(353))
- Waiting for JobTracker to start...
    [junit] 2008-04-03 12:54:58,191 INFO  mapred.MiniMRCluster (MiniMRCluster.java:<init>(353))
- Waiting for JobTracker to start...
    [junit] 2008-04-03 12:54:59,201 INFO  mapred.MiniMRCluster (MiniMRCluster.java:<init>(353))
- Waiting for JobTracker to start...
    [junit] 2008-04-03 12:55:00,211 INFO  mapred.MiniMRCluster (MiniMRCluster.java:<init>(353))
- Waiting for JobTracker to start...
    [junit] 2008-04-03 12:55:01,221 INFO  mapred.MiniMRCluster (MiniMRCluster.java:<init>(353))
- Waiting for JobTracker to start...
    [junit] 2008-04-03 12:55:02,230 INFO  mapred.MiniMRCluster (MiniMRCluster.java:<init>(353))
- Waiting for JobTracker to start...
    [junit] 2008-04-03 12:55:03,240 INFO  mapred.MiniMRCluster (MiniMRCluster.java:<init>(353))
- Waiting for JobTracker to start...
    [junit] 2008-04-03 12:55:04,250 INFO  mapred.MiniMRCluster (MiniMRCluster.java:<init>(353))
- Waiting for JobTracker to start...
    [junit] 2008-04-03 12:55:05,260 INFO  mapred.MiniMRCluster (MiniMRCluster.java:<init>(353))
- Waiting for JobTracker to start...
    [junit] 2008-04-03 12:55:06,270 INFO  mapred.MiniMRCluster (MiniMRCluster.java:<init>(353))
- Waiting for JobTracker to start...
    [junit] 2008-04-03 12:55:07,280 INFO  mapred.MiniMRCluster (MiniMRCluster.java:<init>(353))
- Waiting for JobTracker to start...
    [junit] 2008-04-03 12:55:08,290 INFO  mapred.MiniMRCluster (MiniMRCluster.java:<init>(353))
- Waiting for JobTracker to start...
    [junit] 2008-04-03 12:55:09,300 INFO  mapred.MiniMRCluster (MiniMRCluster.java:<init>(353))
- Waiting for JobTracker to start...
    [junit] 2008-04-03 12:55:10,310 INFO  mapred.MiniMRCluster (MiniMRCluster.java:<init>(353))
- Waiting for JobTracker to start...
    [junit] 2008-04-03 12:55:11,320 INFO  mapred.MiniMRCluster (MiniMRCluster.java:<init>(353))
- Waiting for JobTracker to start...
    [junit] 2008-04-03 12:55:12,330 INFO  mapred.MiniMRCluster (MiniMRCluster.java:<init>(353))
- Waiting for JobTracker to start...
    [junit] 2008-04-03 12:55:13,340 INFO  mapred.MiniMRCluster (MiniMRCluster.java:<init>(353))
- Waiting for JobTracker to start...
    [junit] 2008-04-03 12:55:14,350 INFO  mapred.MiniMRCluster (MiniMRCluster.java:<init>(353))
- Waiting for JobTracker to start...
    [junit] 2008-04-03 12:55:15,360 INFO  mapred.MiniMRCluster (MiniMRCluster.java:<init>(353))
- Waiting for JobTracker to start...
    [junit] 2008-04-03 12:55:16,370 INFO  mapred.MiniMRCluster (MiniMRCluster.java:<init>(353))
- Waiting for JobTracker to start...
    [junit] 2008-04-03 12:55:17,380 INFO  mapred.MiniMRCluster (MiniMRCluster.java:<init>(353))
- Waiting for JobTracker to start...
    [junit] 2008-04-03 12:55:18,390 INFO  mapred.MiniMRCluster (MiniMRCluster.java:<init>(353))
- Waiting for JobTracker to start...
    [junit] 2008-04-03 12:55:19,400 INFO  mapred.MiniMRCluster (MiniMRCluster.java:<init>(353))
- Waiting for JobTracker to start...
    [junit] 2008-04-03 12:55:20,410 INFO  mapred.MiniMRCluster (MiniMRCluster.java:<init>(353))
- Waiting for JobTracker to start...
    [junit] 2008-04-03 12:55:21,420 INFO  mapred.MiniMRCluster (MiniMRCluster.java:<init>(353))
- Waiting for JobTracker to start...
    [junit] 2008-04-03 12:55:22,430 INFO  mapred.MiniMRCluster (MiniMRCluster.java:<init>(353))
- Waiting for JobTracker to start...
    [junit] 2008-04-03 12:55:23,440 INFO  mapred.MiniMRCluster (MiniMRCluster.java:<init>(353))
- Waiting for JobTracker to start...
    [junit] 2008-04-03 12:55:24,450 INFO  mapred.MiniMRCluster (MiniMRCluster.java:<init>(353))
- Waiting for JobTracker to start...
    [junit] 2008-04-03 12:55:25,460 INFO  mapred.MiniMRCluster (MiniMRCluster.java:<init>(353))
- Waiting for JobTracker to start...
    [junit] 2008-04-03 12:55:26,470 INFO  mapred.MiniMRCluster (MiniMRCluster.java:<init>(353))
- Waiting for JobTracker to start...
    [junit] 2008-04-03 12:55:27,480 INFO  mapred.MiniMRCluster (MiniMRCluster.java:<init>(353))
- Waiting for JobTracker to start...
    [junit] 2008-04-03 12:55:28,490 INFO  mapred.MiniMRCluster (MiniMRCluster.java:<init>(353))
- Waiting for JobTracker to start...
    [junit] 2008-04-03 12:55:29,500 INFO  mapred.MiniMRCluster (MiniMRCluster.java:<init>(353))
- Waiting for JobTracker to start...
    [junit] 2008-04-03 12:55:30,510 INFO  mapred.MiniMRCluster (MiniMRCluster.java:<init>(353))
- Waiting for JobTracker to start...
    [junit] 2008-04-03 12:55:31,520 INFO  mapred.MiniMRCluster (MiniMRCluster.java:<init>(353))
- Waiting for JobTracker to start...
    [junit] 2008-04-03 12:55:32,530 INFO  mapred.MiniMRCluster (MiniMRCluster.java:<init>(353))
- Waiting for JobTracker to start...
    [junit] 2008-04-03 12:55:33,540 INFO  mapred.MiniMRCluster (MiniMRCluster.java:<init>(353))
- Waiting for JobTracker to start...
    [junit] Running org.apache.hadoop.mapred.TestMiniMRLocalFS
    [junit] Tests run: 1, Failures: 0, Errors: 1, Time elapsed: 0 sec
    [junit] Test org.apache.hadoop.mapred.TestMiniMRLocalFS FAILED (timeout)
    [junit] Running org.apache.hadoop.mapred.TestMiniMRMapRedDebugScript
    [junit] [CLOVER] FATAL ERROR: Clover could not be initialised. Are you sure you have Clover
in the runtime classpath? (class java.lang.NoClassDefFoundError:com_cenqua_clover/CloverVersionInfo)
    [junit] Tests run: 1, Failures: 0, Errors: 1, Time elapsed: 0.075 sec
    [junit] Test org.apache.hadoop.mapred.TestMiniMRMapRedDebugScript FAILED
    [junit] Running org.apache.hadoop.mapred.TestMiniMRTaskTempDir
    [junit] [CLOVER] FATAL ERROR: Clover could not be initialised. Are you sure you have Clover
in the runtime classpath? (class java.lang.NoClassDefFoundError:com_cenqua_clover/CloverVersionInfo)
    [junit] Tests run: 1, Failures: 0, Errors: 1, Time elapsed: 0.079 sec
    [junit] Test org.apache.hadoop.mapred.TestMiniMRTaskTempDir FAILED
    [junit] Running org.apache.hadoop.mapred.TestMiniMRWithDFS
    [junit] [CLOVER] FATAL ERROR: Clover could not be initialised. Are you sure you have Clover
in the runtime classpath? (class java.lang.NoClassDefFoundError:com_cenqua_clover/CloverVersionInfo)
    [junit] Tests run: 1, Failures: 0, Errors: 1, Time elapsed: 0.069 sec
    [junit] Test org.apache.hadoop.mapred.TestMiniMRWithDFS FAILED
    [junit] [CLOVER] FATAL ERROR: Clover could not be initialised. Are you sure you have Clover
in the runtime classpath? (class java.lang.NoClassDefFoundError:com_cenqua_clover/CloverVersionInfo)
    [junit] Running org.apache.hadoop.mapred.TestMiniMRWithDFSWithDistinctUsers
    [junit] Tests run: 1, Failures: 0, Errors: 1, Time elapsed: 0 sec
    [junit] Test org.apache.hadoop.mapred.TestMiniMRWithDFSWithDistinctUsers FAILED
    [junit] [CLOVER] FATAL ERROR: Clover could not be initialised. Are you sure you have Clover
in the runtime classpath? (class java.lang.NoClassDefFoundError:com_cenqua_clover/CloverVersionInfo)
    [junit] Running org.apache.hadoop.mapred.TestMultiFileInputFormat
    [junit] Tests run: 1, Failures: 0, Errors: 1, Time elapsed: 0 sec
    [junit] Test org.apache.hadoop.mapred.TestMultiFileInputFormat FAILED
    [junit] Running org.apache.hadoop.mapred.TestMultiFileSplit
    [junit] [CLOVER] FATAL ERROR: Clover could not be initialised. Are you sure you have Clover
in the runtime classpath? (class java.lang.NoClassDefFoundError:com_cenqua_clover/CloverVersionInfo)
    [junit] Tests run: 1, Failures: 0, Errors: 1, Time elapsed: 0.19 sec
    [junit] Test org.apache.hadoop.mapred.TestMultiFileSplit FAILED
    [junit] [CLOVER] FATAL ERROR: Clover could not be initialised. Are you sure you have Clover
in the runtime classpath? (class java.lang.NoClassDefFoundError:com_cenqua_clover/CloverVersionInfo)
    [junit] Running org.apache.hadoop.mapred.TestMultipleTextOutputFormat
    [junit] Tests run: 1, Failures: 0, Errors: 1, Time elapsed: 0 sec
    [junit] Test org.apache.hadoop.mapred.TestMultipleTextOutputFormat FAILED
    [junit] [CLOVER] FATAL ERROR: Clover could not be initialised. Are you sure you have Clover
in the runtime classpath? (class java.lang.NoClassDefFoundError:com_cenqua_clover/CloverVersionInfo)
    [junit] Running org.apache.hadoop.mapred.TestRackAwareTaskPlacement
    [junit] 	at org.apache.hadoop.fs.Path.<init>(Path.java:89)
    [junit] 	at org.apache.hadoop.mapred.TestRackAwareTaskPlacement.<init>(TestRackAwareTaskPlacement.java:55)
    [junit] 	at sun.reflect.NativeConstructorAccessorImpl.newInstance0(Native Method)
    [junit] 	at sun.reflect.NativeConstructorAccessorImpl.newInstance(NativeConstructorAccessorImpl.java:39)
    [junit] 	at sun.reflect.DelegatingConstructorAccessorImpl.newInstance(DelegatingConstructorAccessorImpl.java:27)
    [junit] 	at java.lang.reflect.Constructor.newInstance(Constructor.java:494)
    [junit] 	at junit.framework.TestSuite.createTest(TestSuite.java:131)
    [junit] 	at junit.framework.TestSuite.addTestMethod(TestSuite.java:114)
    [junit] 	at junit.framework.TestSuite.<init>(TestSuite.java:75)
    [junit] 	at org.apache.tools.ant.taskdefs.optional.junit.JUnitTestRunner.run(JUnitTestRunner.java:397)
    [junit] 	at org.apache.tools.ant.taskdefs.optional.junit.JUnitTestRunner.launch(JUnitTestRunner.java:912)
    [junit] 	at org.apache.tools.ant.taskdefs.optional.junit.JUnitTestRunner.main(JUnitTestRunner.java:766)
    [junit] ))
    [junit] Tests run: 1, Failures: 1, Errors: 0, Time elapsed: 0.088 sec
    [junit] Test org.apache.hadoop.mapred.TestRackAwareTaskPlacement FAILED
    [junit] Running org.apache.hadoop.mapred.TestReduceTask
    [junit] [CLOVER] FATAL ERROR: Clover could not be initialised. Are you sure you have Clover
in the runtime classpath? (class java.lang.NoClassDefFoundError:com_cenqua_clover/CloverVersionInfo)
    [junit] Tests run: 1, Failures: 0, Errors: 1, Time elapsed: 0.08 sec
    [junit] Test org.apache.hadoop.mapred.TestReduceTask FAILED
    [junit] Running org.apache.hadoop.mapred.TestSequenceFileAsBinaryInputFormat
    [junit] [CLOVER] FATAL ERROR: Clover could not be initialised. Are you sure you have Clover
in the runtime classpath? (class java.lang.NoClassDefFoundError:com_cenqua_clover/CloverVersionInfo)
    [junit] Tests run: 1, Failures: 0, Errors: 1, Time elapsed: 0.072 sec
    [junit] Test org.apache.hadoop.mapred.TestSequenceFileAsBinaryInputFormat FAILED
    [junit] [CLOVER] FATAL ERROR: Clover could not be initialised. Are you sure you have Clover
in the runtime classpath? (class java.lang.NoClassDefFoundError:com_cenqua_clover/CloverVersionInfo)
    [junit] Running org.apache.hadoop.mapred.TestSequenceFileAsTextInputFormat
    [junit] Tests run: 1, Failures: 0, Errors: 1, Time elapsed: 0 sec
    [junit] Test org.apache.hadoop.mapred.TestSequenceFileAsTextInputFormat FAILED
    [junit] [CLOVER] FATAL ERROR: Clover could not be initialised. Are you sure you have Clover
in the runtime classpath? (class java.lang.NoClassDefFoundError:com_cenqua_clover/CloverVersionInfo)
    [junit] Running org.apache.hadoop.mapred.TestSequenceFileInputFilter
    [junit] Tests run: 1, Failures: 0, Errors: 1, Time elapsed: 0 sec
    [junit] Test org.apache.hadoop.mapred.TestSequenceFileInputFilter FAILED
    [junit] [CLOVER] FATAL ERROR: Clover could not be initialised. Are you sure you have Clover
in the runtime classpath? (class java.lang.NoClassDefFoundError:com_cenqua_clover/CloverVersionInfo)
    [junit] Running org.apache.hadoop.mapred.TestSequenceFileInputFormat
    [junit] Tests run: 1, Failures: 0, Errors: 1, Time elapsed: 0 sec
    [junit] Test org.apache.hadoop.mapred.TestSequenceFileInputFormat FAILED
    [junit] Running org.apache.hadoop.mapred.TestSpecialCharactersInOutputPath
    [junit] [CLOVER] FATAL ERROR: Clover could not be initialised. Are you sure you have Clover
in the runtime classpath? (class java.lang.NoClassDefFoundError:com_cenqua_clover/CloverVersionInfo)
    [junit] Tests run: 1, Failures: 0, Errors: 1, Time elapsed: 0.074 sec
    [junit] Test org.apache.hadoop.mapred.TestSpecialCharactersInOutputPath FAILED
    [junit] [CLOVER] FATAL ERROR: Clover could not be initialised. Are you sure you have Clover
in the runtime classpath? (class java.lang.NoClassDefFoundError:com_cenqua_clover/CloverVersionInfo)
    [junit] Running org.apache.hadoop.mapred.TestTextInputFormat
    [junit] Tests run: 1, Failures: 0, Errors: 1, Time elapsed: 0 sec
    [junit] Test org.apache.hadoop.mapred.TestTextInputFormat FAILED
    [junit] [CLOVER] FATAL ERROR: Clover could not be initialised. Are you sure you have Clover
in the runtime classpath? (class java.lang.NoClassDefFoundError:com_cenqua_clover/CloverVersionInfo)
    [junit] Running org.apache.hadoop.mapred.TestTextOutputFormat
    [junit] Tests run: 1, Failures: 0, Errors: 1, Time elapsed: 0 sec
    [junit] Test org.apache.hadoop.mapred.TestTextOutputFormat FAILED
    [junit] Running org.apache.hadoop.mapred.jobcontrol.TestJobControl
    [junit] [CLOVER] FATAL ERROR: Clover could not be initialised. Are you sure you have Clover
in the runtime classpath? (class java.lang.NoClassDefFoundError:com_cenqua_clover/CloverVersionInfo)
    [junit] Tests run: 1, Failures: 0, Errors: 1, Time elapsed: 0.172 sec
    [junit] Test org.apache.hadoop.mapred.jobcontrol.TestJobControl FAILED
    [junit] Running org.apache.hadoop.mapred.jobcontrol.TestLocalJobControl
    [junit] [CLOVER] FATAL ERROR: Clover could not be initialised. Are you sure you have Clover
in the runtime classpath? (class java.lang.NoClassDefFoundError:com_cenqua_clover/CloverVersionInfo)
    [junit] Tests run: 1, Failures: 0, Errors: 1, Time elapsed: 0.072 sec
    [junit] Test org.apache.hadoop.mapred.jobcontrol.TestLocalJobControl FAILED
    [junit] Running org.apache.hadoop.mapred.join.TestDatamerge
    [junit] [CLOVER] FATAL ERROR: Clover could not be initialised. Are you sure you have Clover
in the runtime classpath? (class java.lang.NoClassDefFoundError:com_cenqua_clover/CloverVersionInfo)
    [junit] Tests run: 0, Failures: 0, Errors: 1, Time elapsed: 0.168 sec
    [junit] Test org.apache.hadoop.mapred.join.TestDatamerge FAILED
    [junit] Running org.apache.hadoop.mapred.join.TestTupleWritable
    [junit] [CLOVER] FATAL ERROR: Clover could not be initialised. Are you sure you have Clover
in the runtime classpath? (class java.lang.NoClassDefFoundError:com_cenqua_clover/CloverVersionInfo)
    [junit] Tests run: 3, Failures: 0, Errors: 3, Time elapsed: 0.091 sec
    [junit] Test org.apache.hadoop.mapred.join.TestTupleWritable FAILED
    [junit] Running org.apache.hadoop.mapred.lib.TestMultithreadedMapRunner
    [junit] [CLOVER] FATAL ERROR: Clover could not be initialised. Are you sure you have Clover
in the runtime classpath? (class java.lang.NoClassDefFoundError:com_cenqua_clover/CloverVersionInfo)
    [junit] Tests run: 3, Failures: 0, Errors: 3, Time elapsed: 0.19 sec
    [junit] Test org.apache.hadoop.mapred.lib.TestMultithreadedMapRunner FAILED
    [junit] Running org.apache.hadoop.mapred.lib.aggregate.TestAggregates
    [junit] [CLOVER] FATAL ERROR: Clover could not be initialised. Are you sure you have Clover
in the runtime classpath? (class java.lang.NoClassDefFoundError:com_cenqua_clover/CloverVersionInfo)
    [junit] Tests run: 1, Failures: 0, Errors: 1, Time elapsed: 0.173 sec
    [junit] Test org.apache.hadoop.mapred.lib.aggregate.TestAggregates FAILED
    [junit] Running org.apache.hadoop.mapred.pipes.TestPipes
    [junit] [CLOVER] FATAL ERROR: Clover could not be initialised. Are you sure you have Clover
in the runtime classpath? (class java.lang.NoClassDefFoundError:com_cenqua_clover/CloverVersionInfo)
    [junit] Tests run: 1, Failures: 0, Errors: 1, Time elapsed: 0.065 sec
    [junit] Test org.apache.hadoop.mapred.pipes.TestPipes FAILED
    [junit] [CLOVER] FATAL ERROR: Clover could not be initialised. Are you sure you have Clover
in the runtime classpath? (class java.lang.NoClassDefFoundError:com_cenqua_clover/CloverVersionInfo)
    [junit] Running org.apache.hadoop.net.TestNetworkTopology
    [junit] Tests run: 1, Failures: 0, Errors: 1, Time elapsed: 0 sec
    [junit] Test org.apache.hadoop.net.TestNetworkTopology FAILED
    [junit] Running org.apache.hadoop.net.TestSocketIOWithTimeout
    [junit] [CLOVER] FATAL ERROR: Clover could not be initialised. Are you sure you have Clover
in the runtime classpath? (class java.lang.NoClassDefFoundError:com_cenqua_clover/CloverVersionInfo)
    [junit] Tests run: 1, Failures: 0, Errors: 1, Time elapsed: 0.113 sec
    [junit] Test org.apache.hadoop.net.TestSocketIOWithTimeout FAILED
    [junit] Running org.apache.hadoop.record.TestBuffer
    [junit] Tests run: 6, Failures: 0, Errors: 0, Time elapsed: 0.075 sec
    [junit] Running org.apache.hadoop.record.TestRecordIO
    [junit] [CLOVER] FATAL ERROR: Clover could not be initialised. Are you sure you have Clover
in the runtime classpath? (class java.lang.NoClassDefFoundError:com_cenqua_clover/CloverVersionInfo)
    [junit] [CLOVER] FATAL ERROR: Clover could not be initialised. Are you sure you have Clover
in the runtime classpath? (class java.lang.NoClassDefFoundError:com_cenqua_clover/CloverVersionInfo)
    [junit] [CLOVER] FATAL ERROR: Clover could not be initialised. Are you sure you have Clover
in the runtime classpath? (class java.lang.NoClassDefFoundError:com_cenqua_clover/CloverVersionInfo)
    [junit] [CLOVER] FATAL ERROR: Clover could not be initialised. Are you sure you have Clover
in the runtime classpath? (class java.lang.NoClassDefFoundError:com_cenqua_clover/CloverVersionInfo)
    [junit] Tests run: 5, Failures: 1, Errors: 4, Time elapsed: 0.11 sec
    [junit] Test org.apache.hadoop.record.TestRecordIO FAILED
    [junit] [CLOVER] FATAL ERROR: Clover could not be initialised. Are you sure you have Clover
in the runtime classpath? (class java.lang.NoClassDefFoundError:com_cenqua_clover/CloverVersionInfo)
    [junit] Running org.apache.hadoop.record.TestRecordMR
    [junit] Tests run: 1, Failures: 0, Errors: 1, Time elapsed: 0 sec
    [junit] Test org.apache.hadoop.record.TestRecordMR FAILED
    [junit] Running org.apache.hadoop.record.TestRecordVersioning
    [junit] [CLOVER] FATAL ERROR: Clover could not be initialised. Are you sure you have Clover
in the runtime classpath? (class java.lang.NoClassDefFoundError:com_cenqua_clover/CloverVersionInfo)
    [junit] Tests run: 2, Failures: 0, Errors: 2, Time elapsed: 0.084 sec
    [junit] Test org.apache.hadoop.record.TestRecordVersioning FAILED
    [junit] [CLOVER] FATAL ERROR: Clover could not be initialised. Are you sure you have Clover
in the runtime classpath? (class java.lang.NoClassDefFoundError:com_cenqua_clover/CloverVersionInfo)
    [junit] Running org.apache.hadoop.record.TestRecordWritable
    [junit] Tests run: 1, Failures: 0, Errors: 1, Time elapsed: 0 sec
    [junit] Test org.apache.hadoop.record.TestRecordWritable FAILED
    [junit] [CLOVER] FATAL ERROR: Clover could not be initialised. Are you sure you have Clover
in the runtime classpath? (class java.lang.NoClassDefFoundError:com_cenqua_clover/CloverVersionInfo)
    [junit] Running org.apache.hadoop.security.TestPermission
    [junit] Tests run: 1, Failures: 0, Errors: 1, Time elapsed: 0 sec
    [junit] Test org.apache.hadoop.security.TestPermission FAILED
    [junit] Running org.apache.hadoop.security.TestUnixUserGroupInformation
    [junit] [CLOVER] FATAL ERROR: Clover could not be initialised. Are you sure you have Clover
in the runtime classpath? (class java.lang.NoClassDefFoundError:com_cenqua_clover/CloverVersionInfo)
    [junit] [CLOVER] FATAL ERROR: Clover could not be initialised. Are you sure you have Clover
in the runtime classpath? (class java.lang.NoClassDefFoundError:com_cenqua_clover/CloverVersionInfo)
    [junit] Tests run: 4, Failures: 0, Errors: 4, Time elapsed: 0.184 sec
    [junit] Test org.apache.hadoop.security.TestUnixUserGroupInformation FAILED
    [junit] Running org.apache.hadoop.util.TestIndexedSort
    [junit] [CLOVER] FATAL ERROR: Clover could not be initialised. Are you sure you have Clover
in the runtime classpath? (class java.lang.NoClassDefFoundError:com_cenqua_clover/CloverVersionInfo)
    [junit] [CLOVER] FATAL ERROR: Clover could not be initialised. Are you sure you have Clover
in the runtime classpath? (class java.lang.NoClassDefFoundError:com_cenqua_clover/CloverVersionInfo)
    [junit] Tests run: 5, Failures: 0, Errors: 5, Time elapsed: 0.209 sec
    [junit] Test org.apache.hadoop.util.TestIndexedSort FAILED
    [junit] Running org.apache.hadoop.util.TestReflectionUtils
    [junit] [CLOVER] FATAL ERROR: Clover could not be initialised. Are you sure you have Clover
in the runtime classpath? (class java.lang.NoClassDefFoundError:com_cenqua_clover/CloverVersionInfo)
    [junit] Tests run: 4, Failures: 0, Errors: 4, Time elapsed: 0.09 sec
    [junit] Test org.apache.hadoop.util.TestReflectionUtils FAILED
    [junit] Running org.apache.hadoop.util.TestShell
    [junit] [CLOVER] FATAL ERROR: Clover could not be initialised. Are you sure you have Clover
in the runtime classpath? (class java.lang.NoClassDefFoundError:com_cenqua_clover/CloverVersionInfo)
    [junit] Tests run: 1, Failures: 0, Errors: 1, Time elapsed: 0.165 sec
    [junit] Test org.apache.hadoop.util.TestShell FAILED
    [junit] Running org.apache.hadoop.util.TestStringUtils
    [junit] [CLOVER] FATAL ERROR: Clover could not be initialised. Are you sure you have Clover
in the runtime classpath? (class java.lang.NoClassDefFoundError:com_cenqua_clover/CloverVersionInfo)
    [junit] Tests run: 3, Failures: 0, Errors: 3, Time elapsed: 0.096 sec
    [junit] Test org.apache.hadoop.util.TestStringUtils FAILED

BUILD FAILED
/zonestorage/hudson/home/hudson/hudson/jobs/Hadoop-trunk/workspace/trunk/build.xml:588: Tests
failed!

Total time: 34 minutes 24 seconds
Recording fingerprints
Publishing Javadoc
Recording test results
Updating HADOOP-2551
Updating HADOOP-2634
Updating HADOOP-3118
Updating HADOOP-2839


Mime
View raw message