hadoop-common-dev mailing list archives

Site index · List index
Message view « Date » · « Thread »
Top « Date » · « Thread »
From hud...@lucene.zones.apache.org
Subject Build failed in Hudson: Hadoop-Nightly #312
Date Fri, 23 Nov 2007 11:43:11 GMT
See http://lucene.zones.apache.org:8080/hudson/job/Hadoop-Nightly/312/changes

Changes:

[acmurthy] HADOOP-2216.  Fix jobtasks.jsp to ensure that it first collects the taskids which
satisfy the filtering criteria and then use that list to print out only the required task-reports,
previously it was oblivious to the filtering and hence used the wrong index into the array
of task-reports. Contributed by Amar Kamat.

[acmurthy] HADOOP-2246.  Moved the changelog for HADOOP-1851 from the NEW FEATURES section
to the INCOMPATIBLE CHANGES section.

[acmurthy] HADOOP-2245.  Fix LocalJobRunner to generate unique mapids across jobs by incorporating
the jobid. Also adds a test-case for JobControl vis-a-vis the LocalJobRunner. Contributed
by Adrian Woodhead.

------------------------------------------
[...truncated 1779 lines...]
    [javac] Compiling 3 source files to http://lucene.zones.apache.org:8080/hudson/job/Hadoop-Nightly/ws/trunk/build/test/testjar

      [jar] Building jar: http://lucene.zones.apache.org:8080/hudson/job/Hadoop-Nightly/ws/trunk/build/test/testjar/testjob.jar

      [jar] Building jar: http://lucene.zones.apache.org:8080/hudson/job/Hadoop-Nightly/ws/trunk/build/hadoop-2007-11-23_11-34-15-test.jar

    [mkdir] Created dir: http://lucene.zones.apache.org:8080/hudson/job/Hadoop-Nightly/ws/trunk/build/test/cache

    [mkdir] Created dir: http://lucene.zones.apache.org:8080/hudson/job/Hadoop-Nightly/ws/trunk/build/test/debug

     [copy] Copying 1 file to http://lucene.zones.apache.org:8080/hudson/job/Hadoop-Nightly/ws/trunk/build/test/debug

     [copy] Copying 1 file to http://lucene.zones.apache.org:8080/hudson/job/Hadoop-Nightly/ws/trunk/build/test/cache

     [copy] Copying 1 file to http://lucene.zones.apache.org:8080/hudson/job/Hadoop-Nightly/ws/trunk/build/test/cache

     [copy] Copying 1 file to http://lucene.zones.apache.org:8080/hudson/job/Hadoop-Nightly/ws/trunk/build/test/cache

     [copy] Copying 1 file to http://lucene.zones.apache.org:8080/hudson/job/Hadoop-Nightly/ws/trunk/build/test/cache

     [copy] Copying 1 file to http://lucene.zones.apache.org:8080/hudson/job/Hadoop-Nightly/ws/trunk/build/test/cache


compile-ant-tasks:
    [javac] Compiling 5 source files to http://lucene.zones.apache.org:8080/hudson/job/Hadoop-Nightly/ws/trunk/build/ant


ant-tasks:
     [copy] Copying 1 file to http://lucene.zones.apache.org:8080/hudson/job/Hadoop-Nightly/ws/trunk/build/ant/org/apache/hadoop/ant

      [jar] Building jar: http://lucene.zones.apache.org:8080/hudson/job/Hadoop-Nightly/ws/trunk/build/ant-hadoop-2007-11-23_11-34-15.jar


package:
    [mkdir] Created dir: http://lucene.zones.apache.org:8080/hudson/job/Hadoop-Nightly/ws/trunk/build/hadoop-2007-11-23_11-34-15

    [mkdir] Created dir: http://lucene.zones.apache.org:8080/hudson/job/Hadoop-Nightly/ws/trunk/build/hadoop-2007-11-23_11-34-15/lib

    [mkdir] Created dir: http://lucene.zones.apache.org:8080/hudson/job/Hadoop-Nightly/ws/trunk/build/hadoop-2007-11-23_11-34-15/contrib

    [mkdir] Created dir: http://lucene.zones.apache.org:8080/hudson/job/Hadoop-Nightly/ws/trunk/build/hadoop-2007-11-23_11-34-15/bin

    [mkdir] Created dir: http://lucene.zones.apache.org:8080/hudson/job/Hadoop-Nightly/ws/trunk/build/hadoop-2007-11-23_11-34-15/docs

    [mkdir] Created dir: http://lucene.zones.apache.org:8080/hudson/job/Hadoop-Nightly/ws/trunk/build/hadoop-2007-11-23_11-34-15/docs/api

     [copy] Copying 19 files to http://lucene.zones.apache.org:8080/hudson/job/Hadoop-Nightly/ws/trunk/build/hadoop-2007-11-23_11-34-15/lib


package:

check-contrib:

init:
     [echo] contrib: abacus
    [mkdir] Created dir: http://lucene.zones.apache.org:8080/hudson/job/Hadoop-Nightly/ws/trunk/build/contrib/abacus

    [mkdir] Created dir: http://lucene.zones.apache.org:8080/hudson/job/Hadoop-Nightly/ws/trunk/build/contrib/abacus/classes

    [mkdir] Created dir: http://lucene.zones.apache.org:8080/hudson/job/Hadoop-Nightly/ws/trunk/build/contrib/abacus/test

    [mkdir] Created dir: http://lucene.zones.apache.org:8080/hudson/job/Hadoop-Nightly/ws/trunk/build/contrib/abacus/examples

    [mkdir] Created dir: http://lucene.zones.apache.org:8080/hudson/job/Hadoop-Nightly/ws/trunk/build/contrib/abacus/test/logs


init-contrib:

compile:
     [echo] contrib: abacus
    [javac] Compiling 14 source files to http://lucene.zones.apache.org:8080/hudson/job/Hadoop-Nightly/ws/trunk/build/contrib/abacus/classes

    [javac] Note: Some input files use or override a deprecated API.
    [javac] Note: Recompile with -Xlint:deprecation for details.
    [javac] Note: Some input files use unchecked or unsafe operations.
    [javac] Note: Recompile with -Xlint:unchecked for details.

jar:
      [jar] Building jar: http://lucene.zones.apache.org:8080/hudson/job/Hadoop-Nightly/ws/trunk/build/contrib/abacus/hadoop-2007-11-23_11-34-15-abacus.jar


compile-examples:
     [echo] contrib: abacus
    [javac] Compiling 2 source files to http://lucene.zones.apache.org:8080/hudson/job/Hadoop-Nightly/ws/trunk/build/contrib/abacus/examples

    [javac] Note: Some input files use or override a deprecated API.
    [javac] Note: Recompile with -Xlint:deprecation for details.

jar-examples:
     [echo] contrib: abacus
      [jar] Building jar: http://lucene.zones.apache.org:8080/hudson/job/Hadoop-Nightly/ws/trunk/build/contrib/abacus/hadoop-2007-11-23_11-34-15-abacus-examples.jar


package:
    [mkdir] Created dir: http://lucene.zones.apache.org:8080/hudson/job/Hadoop-Nightly/ws/trunk/build/hadoop-2007-11-23_11-34-15/contrib/abacus

     [copy] Copying 1 file to http://lucene.zones.apache.org:8080/hudson/job/Hadoop-Nightly/ws/trunk/build/hadoop-2007-11-23_11-34-15/contrib/abacus


check-contrib:

init:
     [echo] contrib: datajoin
    [mkdir] Created dir: http://lucene.zones.apache.org:8080/hudson/job/Hadoop-Nightly/ws/trunk/build/contrib/datajoin

    [mkdir] Created dir: http://lucene.zones.apache.org:8080/hudson/job/Hadoop-Nightly/ws/trunk/build/contrib/datajoin/classes

    [mkdir] Created dir: http://lucene.zones.apache.org:8080/hudson/job/Hadoop-Nightly/ws/trunk/build/contrib/datajoin/test

    [mkdir] Created dir: http://lucene.zones.apache.org:8080/hudson/job/Hadoop-Nightly/ws/trunk/build/contrib/datajoin/examples

    [mkdir] Created dir: http://lucene.zones.apache.org:8080/hudson/job/Hadoop-Nightly/ws/trunk/build/contrib/datajoin/test/logs


init-contrib:

compile:
     [echo] contrib: datajoin
    [javac] Compiling 7 source files to http://lucene.zones.apache.org:8080/hudson/job/Hadoop-Nightly/ws/trunk/build/contrib/datajoin/classes

    [javac] Note: Some input files use unchecked or unsafe operations.
    [javac] Note: Recompile with -Xlint:unchecked for details.

jar:
      [jar] Building jar: http://lucene.zones.apache.org:8080/hudson/job/Hadoop-Nightly/ws/trunk/build/contrib/datajoin/hadoop-2007-11-23_11-34-15-datajoin.jar


jar-examples:

check-contrib:

init:
     [echo] contrib: datajoin

init-contrib:

compile:
     [echo] contrib: datajoin

compile-examples:
     [echo] contrib: datajoin
    [javac] Compiling 3 source files to http://lucene.zones.apache.org:8080/hudson/job/Hadoop-Nightly/ws/trunk/build/contrib/datajoin/examples


hadoopbuildcontrib.jar-examples:
     [echo] contrib: datajoin
      [jar] Building jar: http://lucene.zones.apache.org:8080/hudson/job/Hadoop-Nightly/ws/trunk/build/contrib/datajoin/hadoop-2007-11-23_11-34-15-datajoin-examples.jar


package:
    [mkdir] Created dir: http://lucene.zones.apache.org:8080/hudson/job/Hadoop-Nightly/ws/trunk/build/hadoop-2007-11-23_11-34-15/contrib/datajoin

     [copy] Copying 1 file to http://lucene.zones.apache.org:8080/hudson/job/Hadoop-Nightly/ws/trunk/build/hadoop-2007-11-23_11-34-15/contrib/datajoin

Overriding previous definition of reference to classpath

check-contrib:
     [echo] eclipse.home unset: skipping eclipse plugin

init:

compile:

jar:

compile-examples:

jar-examples:

package:
Overriding previous definition of reference to test.classpath

init:
Overriding previous definition of reference to test.classpath

check-contrib:

hadoopbuildcontrib.init:
     [echo] contrib: hbase
    [mkdir] Created dir: http://lucene.zones.apache.org:8080/hudson/job/Hadoop-Nightly/ws/trunk/build/contrib/hbase

    [mkdir] Created dir: http://lucene.zones.apache.org:8080/hudson/job/Hadoop-Nightly/ws/trunk/build/contrib/hbase/classes

    [mkdir] Created dir: http://lucene.zones.apache.org:8080/hudson/job/Hadoop-Nightly/ws/trunk/build/contrib/hbase/test

    [mkdir] Created dir: http://lucene.zones.apache.org:8080/hudson/job/Hadoop-Nightly/ws/trunk/build/contrib/hbase/examples

    [mkdir] Created dir: http://lucene.zones.apache.org:8080/hudson/job/Hadoop-Nightly/ws/trunk/build/contrib/hbase/test/logs

Overriding previous definition of reference to test.classpath

init-contrib:
    [mkdir] Created dir: http://lucene.zones.apache.org:8080/hudson/job/Hadoop-Nightly/ws/trunk/build/contrib/hbase/webapps

     [copy] Copying 6 files to http://lucene.zones.apache.org:8080/hudson/job/Hadoop-Nightly/ws/trunk/build/contrib/hbase/webapps

    [mkdir] Created dir: http://lucene.zones.apache.org:8080/hudson/job/Hadoop-Nightly/ws/trunk/build/contrib/hbase/lib

     [copy] Copying 2 files to http://lucene.zones.apache.org:8080/hudson/job/Hadoop-Nightly/ws/trunk/build/contrib/hbase/lib

    [mkdir] Created dir: http://lucene.zones.apache.org:8080/hudson/job/Hadoop-Nightly/ws/trunk/build/contrib/hbase/conf

     [copy] Copying 4 files to http://lucene.zones.apache.org:8080/hudson/job/Hadoop-Nightly/ws/trunk/build/contrib/hbase/conf

    [mkdir] Created dir: http://lucene.zones.apache.org:8080/hudson/job/Hadoop-Nightly/ws/trunk/build/contrib/hbase/bin

     [copy] Copying 7 files to http://lucene.zones.apache.org:8080/hudson/job/Hadoop-Nightly/ws/trunk/build/contrib/hbase/bin


javacc:

compile:
     [echo] contrib: hbase
    [javac] Compiling 124 source files to http://lucene.zones.apache.org:8080/hudson/job/Hadoop-Nightly/ws/trunk/build/contrib/hbase/classes

    [javac] Note: Some input files use unchecked or unsafe operations.
    [javac] Note: Recompile with -Xlint:unchecked for details.

jar:
      [jar] Building jar: http://lucene.zones.apache.org:8080/hudson/job/Hadoop-Nightly/ws/trunk/build/contrib/hbase/hadoop-2007-11-23_11-34-15-hbase.jar


compile-examples:

jar-examples:

package:
    [mkdir] Created dir: http://lucene.zones.apache.org:8080/hudson/job/Hadoop-Nightly/ws/trunk/build/hadoop-2007-11-23_11-34-15/contrib/hbase

     [copy] Copying 1 file to http://lucene.zones.apache.org:8080/hudson/job/Hadoop-Nightly/ws/trunk/build/hadoop-2007-11-23_11-34-15/contrib/hbase


check-contrib:

init:
     [echo] contrib: streaming
    [mkdir] Created dir: http://lucene.zones.apache.org:8080/hudson/job/Hadoop-Nightly/ws/trunk/build/contrib/streaming

    [mkdir] Created dir: http://lucene.zones.apache.org:8080/hudson/job/Hadoop-Nightly/ws/trunk/build/contrib/streaming/classes

    [mkdir] Created dir: http://lucene.zones.apache.org:8080/hudson/job/Hadoop-Nightly/ws/trunk/build/contrib/streaming/test

    [mkdir] Created dir: http://lucene.zones.apache.org:8080/hudson/job/Hadoop-Nightly/ws/trunk/build/contrib/streaming/examples

    [mkdir] Created dir: http://lucene.zones.apache.org:8080/hudson/job/Hadoop-Nightly/ws/trunk/build/contrib/streaming/test/logs


init-contrib:

compile:
     [echo] contrib: streaming
    [javac] Compiling 16 source files to http://lucene.zones.apache.org:8080/hudson/job/Hadoop-Nightly/ws/trunk/build/contrib/streaming/classes

    [javac] Note: Some input files use or override a deprecated API.
    [javac] Note: Recompile with -Xlint:deprecation for details.
    [javac] Note: Some input files use unchecked or unsafe operations.
    [javac] Note: Recompile with -Xlint:unchecked for details.

jar:
      [jar] Building jar: http://lucene.zones.apache.org:8080/hudson/job/Hadoop-Nightly/ws/trunk/build/contrib/streaming/hadoop-2007-11-23_11-34-15-streaming.jar


compile-examples:

jar-examples:

package:
    [mkdir] Created dir: http://lucene.zones.apache.org:8080/hudson/job/Hadoop-Nightly/ws/trunk/build/hadoop-2007-11-23_11-34-15/contrib/streaming

     [copy] Copying 1 file to http://lucene.zones.apache.org:8080/hudson/job/Hadoop-Nightly/ws/trunk/build/hadoop-2007-11-23_11-34-15/contrib/streaming

     [copy] Copying 10 files to http://lucene.zones.apache.org:8080/hudson/job/Hadoop-Nightly/ws/trunk/build/hadoop-2007-11-23_11-34-15/webapps

     [copy] Copying 1 file to http://lucene.zones.apache.org:8080/hudson/job/Hadoop-Nightly/ws/trunk/build/hadoop-2007-11-23_11-34-15

     [copy] Copying 1 file to http://lucene.zones.apache.org:8080/hudson/job/Hadoop-Nightly/ws/trunk/build/hadoop-2007-11-23_11-34-15

     [copy] Copying 1 file to http://lucene.zones.apache.org:8080/hudson/job/Hadoop-Nightly/ws/trunk/build/hadoop-2007-11-23_11-34-15

     [copy] Copying 12 files to http://lucene.zones.apache.org:8080/hudson/job/Hadoop-Nightly/ws/trunk/build/hadoop-2007-11-23_11-34-15/bin

     [copy] Copying 9 files to http://lucene.zones.apache.org:8080/hudson/job/Hadoop-Nightly/ws/trunk/build/hadoop-2007-11-23_11-34-15/conf

     [copy] Copying 1446 files to http://lucene.zones.apache.org:8080/hudson/job/Hadoop-Nightly/ws/trunk/build/hadoop-2007-11-23_11-34-15/docs

     [copy] Copied 106 empty directories to 3 empty directories under http://lucene.zones.apache.org:8080/hudson/job/Hadoop-Nightly/ws/trunk/build/hadoop-2007-11-23_11-34-15/docs

     [copy] Copying 4 files to http://lucene.zones.apache.org:8080/hudson/job/Hadoop-Nightly/ws/trunk/build/hadoop-2007-11-23_11-34-15

     [copy] Copying 1197 files to http://lucene.zones.apache.org:8080/hudson/job/Hadoop-Nightly/ws/trunk/build/hadoop-2007-11-23_11-34-15/src

     [copy] Copying 1 file to http://lucene.zones.apache.org:8080/hudson/job/Hadoop-Nightly/ws/trunk/build/hadoop-2007-11-23_11-34-15


tar:
      [tar] Building tar: http://lucene.zones.apache.org:8080/hudson/job/Hadoop-Nightly/ws/trunk/build/hadoop-2007-11-23_11-34-15.tar.gz


findbugs:
    [mkdir] Created dir: http://lucene.zones.apache.org:8080/hudson/job/Hadoop-Nightly/ws/trunk/build/test/findbugs

 [findbugs] Running FindBugs...
 [findbugs] Exception in thread "main" java.util.zip.ZipException: Error opening http://lucene.zones.apache.org:8080/hudson/job/Hadoop-Nightly/ws/trunk/build/hadoop-2007-11-23_11-34-15-streaming.jar

 [findbugs] 	at edu.umd.cs.findbugs.classfile.impl.ZipFileCodeBase.<init>(ZipFileCodeBase.java:61)
 [findbugs] 	at edu.umd.cs.findbugs.classfile.impl.ClassFactory.createFilesystemCodeBase(ClassFactory.java:96)
 [findbugs] 	at edu.umd.cs.findbugs.classfile.impl.FilesystemCodeBaseLocator.openCodeBase(FilesystemCodeBaseLocator.java:63)
 [findbugs] 	at edu.umd.cs.findbugs.classfile.impl.ClassPathBuilder.processWorkList(ClassPathBuilder.java:381)
 [findbugs] 	at edu.umd.cs.findbugs.classfile.impl.ClassPathBuilder.build(ClassPathBuilder.java:192)
 [findbugs] 	at edu.umd.cs.findbugs.FindBugs2.buildClassPath(FindBugs2.java:432)
 [findbugs] 	at edu.umd.cs.findbugs.FindBugs2.execute(FindBugs2.java:160)
 [findbugs] 	at edu.umd.cs.findbugs.FindBugs.runMain(FindBugs.java:1521)
 [findbugs] 	at edu.umd.cs.findbugs.FindBugs2.main(FindBugs2.java:731)
 [findbugs] Output saved to http://lucene.zones.apache.org:8080/hudson/job/Hadoop-Nightly/ws/trunk/build/test/findbugs/hadoop-findbugs-report.xml

     [xslt] Processing http://lucene.zones.apache.org:8080/hudson/job/Hadoop-Nightly/ws/trunk/build/test/findbugs/hadoop-findbugs-report.xml
 to http://lucene.zones.apache.org:8080/hudson/job/Hadoop-Nightly/ws/trunk/build/test/findbugs/hadoop-findbugs-report.html

     [xslt] Loading stylesheet /export/home/hudson/tools/findbugs/latest/src/xsl/default.xsl
     [xslt] : Error! Premature end of file.
     [xslt] : Error! com.sun.org.apache.xml.internal.utils.WrappedRuntimeException: Premature
end of file.
     [xslt] Failed to process http://lucene.zones.apache.org:8080/hudson/job/Hadoop-Nightly/ws/trunk/build/test/findbugs/hadoop-findbugs-report.xml


BUILD FAILED
http://lucene.zones.apache.org:8080/hudson/job/Hadoop-Nightly/ws/trunk/build.xml :599: javax.xml.transform.TransformerException:
javax.xml.transform.TransformerException: com.sun.org.apache.xml.internal.utils.WrappedRuntimeException:
Premature end of file.

Total time: 2 minutes 0 seconds
Build Failed: remaining tests not run
Recording fingerprints
Publishing Javadoc
Recording test results
No test report files were found. Configuration error?
Updating HADOOP-2246
Updating HADOOP-1851
Updating HADOOP-2245
Updating HADOOP-2216


Mime
View raw message