hadoop-common-dev mailing list archives

Site index · List index
Message view « Date » · « Thread »
Top « Date » · « Thread »
From hud...@lucene.zones.apache.org
Subject Build failed in Hudson: Hadoop-Nightly #113
Date Wed, 06 Jun 2007 20:27:41 GMT
See http://lucene.zones.apache.org:8080/hudson/job/Hadoop-Nightly/113/changes

------------------------------------------
[...truncated 16294 lines...]
    [junit] 2007-06-06 20:26:42,100 INFO  mapred.FileInputFormat (TestSequenceFileInputFilter.java:countRecords(90))
- Accept record 10057
    [junit] 2007-06-06 20:26:42,110 INFO  mapred.FileInputFormat (TestSequenceFileInputFilter.java:testMD5Filter(165))
- Accepted 8 records
    [junit] 2007-06-06 20:26:42,110 INFO  mapred.FileInputFormat (TestSequenceFileInputFilter.java:testMD5Filter(163))
- ******Number of records: 13317
    [junit] 2007-06-06 20:26:42,330 INFO  mapred.FileInputFormat (TestSequenceFileInputFilter.java:countRecords(84))
- Generated 49 splits.
    [junit] 2007-06-06 20:26:42,333 INFO  mapred.FileInputFormat (TestSequenceFileInputFilter.java:countRecords(90))
- Accept record 826
    [junit] 2007-06-06 20:26:42,334 INFO  mapred.FileInputFormat (TestSequenceFileInputFilter.java:countRecords(90))
- Accept record 1026
    [junit] 2007-06-06 20:26:42,335 INFO  mapred.FileInputFormat (TestSequenceFileInputFilter.java:countRecords(90))
- Accept record 1302
    [junit] 2007-06-06 20:26:42,340 INFO  mapred.FileInputFormat (TestSequenceFileInputFilter.java:countRecords(90))
- Accept record 3184
    [junit] 2007-06-06 20:26:42,345 INFO  mapred.FileInputFormat (TestSequenceFileInputFilter.java:countRecords(90))
- Accept record 4839
    [junit] 2007-06-06 20:26:42,346 INFO  mapred.FileInputFormat (TestSequenceFileInputFilter.java:countRecords(90))
- Accept record 4863
    [junit] 2007-06-06 20:26:42,353 INFO  mapred.FileInputFormat (TestSequenceFileInputFilter.java:countRecords(90))
- Accept record 7606
    [junit] 2007-06-06 20:26:42,362 INFO  mapred.FileInputFormat (TestSequenceFileInputFilter.java:countRecords(90))
- Accept record 10057
    [junit] 2007-06-06 20:26:42,370 INFO  mapred.FileInputFormat (TestSequenceFileInputFilter.java:countRecords(90))
- Accept record 12945
    [junit] 2007-06-06 20:26:42,371 INFO  mapred.FileInputFormat (TestSequenceFileInputFilter.java:testMD5Filter(165))
- Accepted 9 records
    [junit] 2007-06-06 20:26:42,372 INFO  mapred.FileInputFormat (TestSequenceFileInputFilter.java:testMD5Filter(163))
- ******Number of records: 13538
    [junit] 2007-06-06 20:26:42,595 INFO  mapred.FileInputFormat (TestSequenceFileInputFilter.java:countRecords(84))
- Generated 27 splits.
    [junit] 2007-06-06 20:26:42,598 INFO  mapred.FileInputFormat (TestSequenceFileInputFilter.java:countRecords(90))
- Accept record 826
    [junit] 2007-06-06 20:26:42,598 INFO  mapred.FileInputFormat (TestSequenceFileInputFilter.java:countRecords(90))
- Accept record 1026
    [junit] 2007-06-06 20:26:42,599 INFO  mapred.FileInputFormat (TestSequenceFileInputFilter.java:countRecords(90))
- Accept record 1302
    [junit] 2007-06-06 20:26:42,604 INFO  mapred.FileInputFormat (TestSequenceFileInputFilter.java:countRecords(90))
- Accept record 3184
    [junit] 2007-06-06 20:26:42,607 INFO  mapred.FileInputFormat (TestSequenceFileInputFilter.java:countRecords(90))
- Accept record 4839
    [junit] 2007-06-06 20:26:42,608 INFO  mapred.FileInputFormat (TestSequenceFileInputFilter.java:countRecords(90))
- Accept record 4863
    [junit] 2007-06-06 20:26:42,613 INFO  mapred.FileInputFormat (TestSequenceFileInputFilter.java:countRecords(90))
- Accept record 7606
    [junit] 2007-06-06 20:26:42,620 INFO  mapred.FileInputFormat (TestSequenceFileInputFilter.java:countRecords(90))
- Accept record 10057
    [junit] 2007-06-06 20:26:42,626 INFO  mapred.FileInputFormat (TestSequenceFileInputFilter.java:countRecords(90))
- Accept record 12945
    [junit] 2007-06-06 20:26:42,628 INFO  mapred.FileInputFormat (TestSequenceFileInputFilter.java:testMD5Filter(165))
- Accepted 9 records
    [junit] 2007-06-06 20:26:42,629 INFO  mapred.FileInputFormat (TestSequenceFileInputFilter.java:testMD5Filter(163))
- ******Number of records: 14790
    [junit] 2007-06-06 20:26:42,870 INFO  mapred.FileInputFormat (TestSequenceFileInputFilter.java:countRecords(84))
- Generated 130 splits.
    [junit] 2007-06-06 20:26:42,875 INFO  mapred.FileInputFormat (TestSequenceFileInputFilter.java:countRecords(90))
- Accept record 826
    [junit] 2007-06-06 20:26:42,876 INFO  mapred.FileInputFormat (TestSequenceFileInputFilter.java:countRecords(90))
- Accept record 1026
    [junit] 2007-06-06 20:26:42,877 INFO  mapred.FileInputFormat (TestSequenceFileInputFilter.java:countRecords(90))
- Accept record 1302
    [junit] 2007-06-06 20:26:42,887 INFO  mapred.FileInputFormat (TestSequenceFileInputFilter.java:countRecords(90))
- Accept record 3184
    [junit] 2007-06-06 20:26:42,896 INFO  mapred.FileInputFormat (TestSequenceFileInputFilter.java:countRecords(90))
- Accept record 4839
    [junit] 2007-06-06 20:26:42,896 INFO  mapred.FileInputFormat (TestSequenceFileInputFilter.java:countRecords(90))
- Accept record 4863
    [junit] 2007-06-06 20:26:42,909 INFO  mapred.FileInputFormat (TestSequenceFileInputFilter.java:countRecords(90))
- Accept record 7606
    [junit] 2007-06-06 20:26:42,920 INFO  mapred.FileInputFormat (TestSequenceFileInputFilter.java:countRecords(90))
- Accept record 10057
    [junit] 2007-06-06 20:26:42,934 INFO  mapred.FileInputFormat (TestSequenceFileInputFilter.java:countRecords(90))
- Accept record 12945
    [junit] 2007-06-06 20:26:42,944 INFO  mapred.FileInputFormat (TestSequenceFileInputFilter.java:testMD5Filter(165))
- Accepted 9 records
    [junit] Tests run: 3, Failures: 0, Errors: 0, Time elapsed: 9.737 sec
    [junit] Running org.apache.hadoop.mapred.TestSequenceFileInputFormat
    [junit] 2007-06-06 20:26:43,961 WARN  util.NativeCodeLoader (NativeCodeLoader.java:<clinit>(51))
- Unable to load native-hadoop library for your platform... using builtin-java classes where
applicable
    [junit] Tests run: 1, Failures: 0, Errors: 0, Time elapsed: 6.081 sec
    [junit] Running org.apache.hadoop.mapred.TestTextInputFormat
    [junit] 2007-06-06 20:26:50,238 INFO  mapred.TestTextInputFormat (TestTextInputFormat.java:testFormat(58))
- seed = 720364282
    [junit] 2007-06-06 20:26:54,254 WARN  util.NativeCodeLoader (NativeCodeLoader.java:<clinit>(51))
- Unable to load native-hadoop library for your platform... using builtin-java classes where
applicable
    [junit] Tests run: 4, Failures: 0, Errors: 0, Time elapsed: 4.07 sec
    [junit] Running org.apache.hadoop.mapred.TestTextOutputFormat
    [junit] Tests run: 1, Failures: 0, Errors: 0, Time elapsed: 0.12 sec
    [junit] Running org.apache.hadoop.mapred.TestUserValueGrouping
    [junit] 2007-06-06 20:26:55,949 WARN  util.NativeCodeLoader (NativeCodeLoader.java:<clinit>(51))
- Unable to load native-hadoop library for your platform... using builtin-java classes where
applicable
    [junit] 2007-06-06 20:26:56,102 INFO  mapred.FileInputFormat (FileInputFormat.java:validateInput(142))
- Total input paths to process : 1
    [junit] 2007-06-06 20:26:56,515 INFO  mapred.MapTask (MapTask.java:run(120)) - numReduceTasks:
1
    [junit] 2007-06-06 20:26:56,682 INFO  mapred.LocalJobRunner (LocalJobRunner.java:progress(200))
- http://lucene.zones.apache.org:8080/hudson/job/Hadoop-Nightly/ws/trunk/build/test/test.mapred.spill/in/part0
:0+207
    [junit] 2007-06-06 20:26:56,778 INFO  mapred.LocalJobRunner (LocalJobRunner.java:progress(200))
- reduce > reduce
    [junit] 2007-06-06 20:26:56,783 INFO  mapred.TaskRunner (Task.java:saveTaskOutput(331))
- Saved output of task 'reduce_b72ryw' to http://lucene.zones.apache.org:8080/hudson/job/Hadoop-Nightly/ws/trunk/build/test/test.mapred.spill/out

    [junit] Tests run: 1, Failures: 0, Errors: 0, Time elapsed: 1.917 sec
    [junit] Running org.apache.hadoop.mapred.jobcontrol.TestJobControl
    [junit] Jobs in waiting state: 4
    [junit] Jobs in ready state: 0
    [junit] Jobs in running state: 0
    [junit] Jobs in success state: 0
    [junit] Jobs in failed state: 0


    [junit] 2007-06-06 20:27:07,829 INFO  mapred.FileInputFormat (FileInputFormat.java:validateInput(142))
- Total input paths to process : 1
    [junit] 2007-06-06 20:27:08,026 INFO  mapred.FileInputFormat (FileInputFormat.java:validateInput(142))
- Total input paths to process : 1
    [junit] 2007-06-06 20:27:08,097 INFO  mapred.MapTask (MapTask.java:run(120)) - numReduceTasks:
1
    [junit] 2007-06-06 20:27:08,222 INFO  mapred.MapTask (MapTask.java:run(120)) - numReduceTasks:
1
    [junit] 2007-06-06 20:27:09,063 INFO  mapred.LocalJobRunner (LocalJobRunner.java:progress(200))
- http://lucene.zones.apache.org:8080/hudson/job/Hadoop-Nightly/ws/trunk/build/test/data/TestJobControlData/indir/data.txt
:0+33554432
    [junit] 2007-06-06 20:27:09,235 INFO  mapred.LocalJobRunner (LocalJobRunner.java:progress(200))
- http://lucene.zones.apache.org:8080/hudson/job/Hadoop-Nightly/ws/trunk/build/test/data/TestJobControlData/indir/data.txt
:0+33554432
    [junit] 2007-06-06 20:27:10,064 INFO  mapred.LocalJobRunner (LocalJobRunner.java:progress(200))
- http://lucene.zones.apache.org:8080/hudson/job/Hadoop-Nightly/ws/trunk/build/test/data/TestJobControlData/indir/data.txt
:0+33554432
    [junit] 2007-06-06 20:27:10,234 INFO  mapred.LocalJobRunner (LocalJobRunner.java:progress(200))
- http://lucene.zones.apache.org:8080/hudson/job/Hadoop-Nightly/ws/trunk/build/test/data/TestJobControlData/indir/data.txt
:0+33554432
    [junit] 2007-06-06 20:27:11,065 INFO  mapred.LocalJobRunner (LocalJobRunner.java:progress(200))
- http://lucene.zones.apache.org:8080/hudson/job/Hadoop-Nightly/ws/trunk/build/test/data/TestJobControlData/indir/data.txt
:0+33554432
    [junit] 2007-06-06 20:27:11,235 INFO  mapred.LocalJobRunner (LocalJobRunner.java:progress(200))
- http://lucene.zones.apache.org:8080/hudson/job/Hadoop-Nightly/ws/trunk/build/test/data/TestJobControlData/indir/data.txt
:0+33554432
    [junit] Jobs in waiting state: 2
    [junit] Jobs in ready state: 0
    [junit] Jobs in running state: 2
    [junit] Jobs in success state: 0
    [junit] Jobs in failed state: 0


    [junit] 2007-06-06 20:27:12,832 INFO  mapred.LocalJobRunner (LocalJobRunner.java:progress(200))
- http://lucene.zones.apache.org:8080/hudson/job/Hadoop-Nightly/ws/trunk/build/test/data/TestJobControlData/indir/data.txt
:0+33554432
    [junit] 2007-06-06 20:27:12,982 INFO  mapred.LocalJobRunner (LocalJobRunner.java:progress(200))
- http://lucene.zones.apache.org:8080/hudson/job/Hadoop-Nightly/ws/trunk/build/test/data/TestJobControlData/indir/data.txt
:0+33554432
    [junit] 2007-06-06 20:27:13,458 WARN  mapred.LocalJobRunner (LocalJobRunner.java:run(176))
- job_risx6c
    [junit] java.io.IOException: Target build/test/mapred/local/map_0000/file.out already
exists
    [junit] 	at org.apache.hadoop.fs.FileUtil.checkDest(FileUtil.java:249)
    [junit] 	at org.apache.hadoop.fs.FileUtil.copy(FileUtil.java:93)
    [junit] 	at org.apache.hadoop.fs.RawLocalFileSystem.rename(RawLocalFileSystem.java:212)
    [junit] 	at org.apache.hadoop.fs.ChecksumFileSystem.rename(ChecksumFileSystem.java:482)
    [junit] 	at org.apache.hadoop.mapred.MapTask$MapOutputBuffer.mergeParts(MapTask.java:515)
    [junit] 	at org.apache.hadoop.mapred.MapTask$MapOutputBuffer.flush(MapTask.java:620)
    [junit] 	at org.apache.hadoop.mapred.MapTask.run(MapTask.java:187)
    [junit] 	at org.apache.hadoop.mapred.LocalJobRunner$Job.run(LocalJobRunner.java:131)
    [junit] 2007-06-06 20:27:13,816 INFO  mapred.LocalJobRunner (LocalJobRunner.java:progress(200))
- http://lucene.zones.apache.org:8080/hudson/job/Hadoop-Nightly/ws/trunk/build/test/data/TestJobControlData/indir/data.txt
:0+33554432
    [junit] 2007-06-06 20:27:13,847 INFO  mapred.MapTask (MapTask.java:run(120)) - numReduceTasks:
1
    [junit] 2007-06-06 20:27:14,739 INFO  mapred.LocalJobRunner (LocalJobRunner.java:progress(200))
- http://lucene.zones.apache.org:8080/hudson/job/Hadoop-Nightly/ws/trunk/build/test/data/TestJobControlData/indir/data.txt
:33554432+7332460
    [junit] 2007-06-06 20:27:15,246 INFO  fs.FSInputChecker (ChecksumFileSystem.java:readBuffer(225))
- Found checksum error: org.apache.hadoop.fs.ChecksumException: Checksum error: build/test/mapred/local/reduce_b38beg/map_0.out
at 0
    [junit] 	at org.apache.hadoop.fs.ChecksumFileSystem$FSInputChecker.verifySum(ChecksumFileSystem.java:264)
    [junit] 	at org.apache.hadoop.fs.ChecksumFileSystem$FSInputChecker.readBuffer(ChecksumFileSystem.java:219)
    [junit] 	at org.apache.hadoop.fs.ChecksumFileSystem$FSInputChecker.read(ChecksumFileSystem.java:175)
    [junit] 	at org.apache.hadoop.fs.FSDataInputStream$PositionCache.read(FSDataInputStream.java:41)
    [junit] 	at java.io.BufferedInputStream.fill(BufferedInputStream.java:218)
    [junit] 	at java.io.BufferedInputStream.read1(BufferedInputStream.java:256)
    [junit] 	at java.io.BufferedInputStream.read(BufferedInputStream.java:313)
    [junit] 	at java.io.DataInputStream.readFully(DataInputStream.java:176)
    [junit] 	at java.io.DataInputStream.readFully(DataInputStream.java:152)
    [junit] 	at org.apache.hadoop.io.SequenceFile$Reader.init(SequenceFile.java:1178)
    [junit] 	at org.apache.hadoop.io.SequenceFile$Reader.<init>(SequenceFile.java:1173)
    [junit] 	at org.apache.hadoop.io.SequenceFile$Reader.<init>(SequenceFile.java:1104)
    [junit] 	at org.apache.hadoop.io.SequenceFile$Sorter$SegmentDescriptor.nextRawKey(SequenceFile.java:2563)
    [junit] 	at org.apache.hadoop.io.SequenceFile$Sorter$MergeQueue.merge(SequenceFile.java:2398)
    [junit] 	at org.apache.hadoop.io.SequenceFile$Sorter.merge(SequenceFile.java:2166)
    [junit] 	at org.apache.hadoop.mapred.ReduceTask.run(ReduceTask.java:318)
    [junit] 	at org.apache.hadoop.mapred.LocalJobRunner$Job.run(LocalJobRunner.java:162)

    [junit] 2007-06-06 20:27:15,289 WARN  fs.FileSystem (LocalFileSystem.java:reportChecksumFailure(92))
- Moving bad file http://lucene.zones.apache.org:8080/hudson/job/Hadoop-Nightly/ws/trunk/build/test/mapred/local/reduce_b38beg/map_0.out
 to /export/home/hudson/bad_files/map_0.out.1775452801
    [junit] 2007-06-06 20:27:15,311 WARN  mapred.LocalJobRunner (LocalJobRunner.java:run(176))
- job_vn9tro
    [junit] org.apache.hadoop.fs.ChecksumException: Checksum error: build/test/mapred/local/reduce_b38beg/map_0.out
at 0
    [junit] 	at org.apache.hadoop.fs.ChecksumFileSystem$FSInputChecker.verifySum(ChecksumFileSystem.java:264)
    [junit] 	at org.apache.hadoop.fs.ChecksumFileSystem$FSInputChecker.readBuffer(ChecksumFileSystem.java:219)
    [junit] 	at org.apache.hadoop.fs.ChecksumFileSystem$FSInputChecker.read(ChecksumFileSystem.java:175)
    [junit] 	at org.apache.hadoop.fs.FSDataInputStream$PositionCache.read(FSDataInputStream.java:41)
    [junit] 	at java.io.BufferedInputStream.fill(BufferedInputStream.java:218)
    [junit] 	at java.io.BufferedInputStream.read1(BufferedInputStream.java:256)
    [junit] 	at java.io.BufferedInputStream.read(BufferedInputStream.java:313)
    [junit] 	at java.io.DataInputStream.readFully(DataInputStream.java:176)
    [junit] 	at java.io.DataInputStream.readFully(DataInputStream.java:152)
    [junit] 	at org.apache.hadoop.io.SequenceFile$Reader.init(SequenceFile.java:1178)
    [junit] 	at org.apache.hadoop.io.SequenceFile$Reader.<init>(SequenceFile.java:1173)
    [junit] 	at org.apache.hadoop.io.SequenceFile$Reader.<init>(SequenceFile.java:1104)
    [junit] 	at org.apache.hadoop.io.SequenceFile$Sorter$SegmentDescriptor.nextRawKey(SequenceFile.java:2563)
    [junit] 	at org.apache.hadoop.io.SequenceFile$Sorter$MergeQueue.merge(SequenceFile.java:2398)
    [junit] 	at org.apache.hadoop.io.SequenceFile$Sorter.merge(SequenceFile.java:2166)
    [junit] 	at org.apache.hadoop.mapred.ReduceTask.run(ReduceTask.java:318)
    [junit] 	at org.apache.hadoop.mapred.LocalJobRunner$Job.run(LocalJobRunner.java:162)
    [junit] Jobs in waiting state: 2
    [junit] Jobs in ready state: 0
    [junit] Jobs in running state: 2
    [junit] Jobs in success state: 0
    [junit] Jobs in failed state: 0


    [junit] Jobs are all done???
    [junit] Jobs in waiting state: 0
    [junit] Jobs in ready state: 0
    [junit] Jobs in running state: 0
    [junit] Jobs in success state: 0
    [junit] Jobs in failed state: 4


    [junit] Tests run: 1, Failures: 0, Errors: 0, Time elapsed: 25.072 sec
    [junit] Running org.apache.hadoop.mapred.pipes.TestPipes
    [junit] 2007-06-06 20:27:23,493 INFO  pipes.TestPipes (TestPipes.java:testPipes(47)) -
compile.c++ is not defined, so skipping TestPipes
    [junit] Tests run: 1, Failures: 0, Errors: 0, Time elapsed: 0.047 sec
    [junit] Running org.apache.hadoop.net.TestNetworkTopology
    [junit] 2007-06-06 20:27:24,259 INFO  net.NetworkTopology (NetworkTopology.java:add(315))
- Adding a new node: /d1/r1/h1:5020
    [junit] 2007-06-06 20:27:24,265 INFO  net.NetworkTopology (NetworkTopology.java:add(315))
- Adding a new node: /d1/r1/h2:5020
    [junit] 2007-06-06 20:27:24,266 INFO  net.NetworkTopology (NetworkTopology.java:add(315))
- Adding a new node: /d1/r2/h3:5020
    [junit] 2007-06-06 20:27:24,267 INFO  net.NetworkTopology (NetworkTopology.java:add(315))
- Adding a new node: /d1/r2/h4:5020
    [junit] 2007-06-06 20:27:24,267 INFO  net.NetworkTopology (NetworkTopology.java:add(315))
- Adding a new node: /d1/r2/h5:5020
    [junit] 2007-06-06 20:27:24,268 INFO  net.NetworkTopology (NetworkTopology.java:add(315))
- Adding a new node: /d2/r3/h6:5020
    [junit] 2007-06-06 20:27:24,269 INFO  net.NetworkTopology (NetworkTopology.java:add(315))
- Adding a new node: /d2/r3/h7:5020
    [junit] 2007-06-06 20:27:24,315 INFO  net.NetworkTopology (NetworkTopology.java:remove(337))
- Removing a node: /d1/r1/h1:5020
    [junit] 2007-06-06 20:27:24,316 INFO  net.NetworkTopology (NetworkTopology.java:remove(337))
- Removing a node: /d1/r1/h2:5020
    [junit] 2007-06-06 20:27:24,318 INFO  net.NetworkTopology (NetworkTopology.java:remove(337))
- Removing a node: /d1/r2/h3:5020
    [junit] 2007-06-06 20:27:24,319 INFO  net.NetworkTopology (NetworkTopology.java:remove(337))
- Removing a node: /d1/r2/h4:5020
    [junit] 2007-06-06 20:27:24,321 INFO  net.NetworkTopology (NetworkTopology.java:remove(337))
- Removing a node: /d1/r2/h5:5020
    [junit] 2007-06-06 20:27:24,323 INFO  net.NetworkTopology (NetworkTopology.java:remove(337))
- Removing a node: /d2/r3/h6:5020
    [junit] 2007-06-06 20:27:24,324 INFO  net.NetworkTopology (NetworkTopology.java:remove(337))
- Removing a node: /d2/r3/h7:5020
    [junit] 2007-06-06 20:27:24,325 INFO  net.NetworkTopology (NetworkTopology.java:add(315))
- Adding a new node: /d1/r1/h1:5020
    [junit] 2007-06-06 20:27:24,326 INFO  net.NetworkTopology (NetworkTopology.java:add(315))
- Adding a new node: /d1/r1/h2:5020
    [junit] 2007-06-06 20:27:24,327 INFO  net.NetworkTopology (NetworkTopology.java:add(315))
- Adding a new node: /d1/r2/h3:5020
    [junit] 2007-06-06 20:27:24,328 INFO  net.NetworkTopology (NetworkTopology.java:add(315))
- Adding a new node: /d1/r2/h4:5020
    [junit] 2007-06-06 20:27:24,329 INFO  net.NetworkTopology (NetworkTopology.java:add(315))
- Adding a new node: /d1/r2/h5:5020
    [junit] 2007-06-06 20:27:24,331 INFO  net.NetworkTopology (NetworkTopology.java:add(315))
- Adding a new node: /d2/r3/h6:5020
    [junit] 2007-06-06 20:27:24,332 INFO  net.NetworkTopology (NetworkTopology.java:add(315))
- Adding a new node: /d2/r3/h7:5020
    [junit] Tests run: 5, Failures: 0, Errors: 0, Time elapsed: 0.061 sec
    [junit] Running org.apache.hadoop.record.TestBuffer
    [junit] Tests run: 6, Failures: 0, Errors: 0, Time elapsed: 0.106 sec
    [junit] Running org.apache.hadoop.record.TestRecordIO
    [junit] Illustrating toString bugT,102,4567,99344109427290,3.1449999809265137,1.5234,'random
text,#000102030405060708090a0b0c0d0e0f101112131415161718191a1b1c1d1e1f202122232425262728292a2b2c2d2e2f303132333435363738393a3b3c3d3e3f404142434445464748494a4b4c4d4e4f505152535455565758595a5b5c5d5e5f606162636465666768696a6b6c6d6e6f707172737475767778797a7b7c7d7e7f808182838485868788898a8b8c8d8e8f909192939495969798999a9b9c9d9e9fa0a1a2a3a4a5a6a7a8a9aaabacadaeafb0b1b2b3b4b5b6b7b8b9babbbcbdbebfc0c1c2c3c4c5c6c7c8c9cacbcccdcecfd0d1d2d3d4d5d6d7d8d9dadbdcdddedfe0e1e2e3e4e5e6e7e8e9eaebecedeeeff0f1f2f3f4f5f6f7f8f9fafbfcfdfeff,v{},m{},s{'other
random text}

    [junit] Illustrating toString bugT,102,4567,99344109427290,3.1449999809265137,1.5234,'random
text,#000102030405060708090a0b0c0d0e0f101112131415161718191a1b1c1d1e1f202122232425262728292a2b2c2d2e2f303132333435363738393a3b3c3d3e3f404142434445464748494a4b4c4d4e4f505152535455565758595a5b5c5d5e5f606162636465666768696a6b6c6d6e6f707172737475767778797a7b7c7d7e7f808182838485868788898a8b8c8d8e8f909192939495969798999a9b9c9d9e9fa0a1a2a3a4a5a6a7a8a9aaabacadaeafb0b1b2b3b4b5b6b7b8b9babbbcbdbebfc0c1c2c3c4c5c6c7c8c9cacbcccdcecfd0d1d2d3d4d5d6d7d8d9dadbdcdddedfe0e1e2e3e4e5e6e7e8e9eaebecedeeeff0f1f2f3f4f5f6f7f8f9fafbfcfdfeff,v{},m{},s{'other
random text}

    [junit] Tests run: 5, Failures: 0, Errors: 0, Time elapsed: 0.292 sec
    [junit] Running org.apache.hadoop.record.TestRecordMR
    [junit] 2007-06-06 20:27:26,637 INFO  mapred.FileInputFormat (FileInputFormat.java:validateInput(142))
- Total input paths to process : 1
    [junit] 2007-06-06 20:27:26,919 INFO  mapred.JobClient (JobClient.java:runJob(552)) -
Running job: job_ufl7v9
    [junit] 2007-06-06 20:27:26,995 INFO  mapred.MapTask (MapTask.java:run(120)) - numReduceTasks:
1
    [junit] 2007-06-06 20:27:27,110 INFO  mapred.LocalJobRunner (LocalJobRunner.java:progress(200))
- http://lucene.zones.apache.org:8080/hudson/job/Hadoop-Nightly/ws/trunk/mapred.loadtest/genins/answer.key
:0+190
    [junit] 2007-06-06 20:27:27,202 INFO  mapred.LocalJobRunner (LocalJobRunner.java:progress(200))
- reduce > reduce
    [junit] 2007-06-06 20:27:27,207 INFO  mapred.TaskRunner (Task.java:saveTaskOutput(331))
- Saved output of task 'reduce_p5bhav' to http://lucene.zones.apache.org:8080/hudson/job/Hadoop-Nightly/ws/trunk/mapred.loadtest/genouts

    [junit] 2007-06-06 20:27:27,929 INFO  mapred.JobClient (JobClient.java:runJob(613)) -
Job complete: job_ufl7v9
    [junit] 2007-06-06 20:27:27,930 INFO  mapred.JobClient (Counters.java:log(359)) - Counters:
7
    [junit] 2007-06-06 20:27:27,958 INFO  mapred.JobClient (Counters.java:log(363)) -   Map-Reduce
Framework
    [junit] 2007-06-06 20:27:27,959 INFO  mapred.JobClient (Counters.java:log(365)) -    
Map input records=10
    [junit] 2007-06-06 20:27:27,960 INFO  mapred.JobClient (Counters.java:log(365)) -    
Map output records=102
    [junit] 2007-06-06 20:27:27,960 INFO  mapred.JobClient (Counters.java:log(365)) -    
Map input bytes=100
    [junit] 2007-06-06 20:27:27,961 INFO  mapred.JobClient (Counters.java:log(365)) -    
Map output bytes=714
    [junit] 2007-06-06 20:27:27,961 INFO  mapred.JobClient (Counters.java:log(365)) -    
Reduce input groups=102
    [junit] 2007-06-06 20:27:27,962 INFO  mapred.JobClient (Counters.java:log(365)) -    
Reduce input records=102
    [junit] 2007-06-06 20:27:27,963 INFO  mapred.JobClient (Counters.java:log(365)) -    
Reduce output records=102
    [junit] 2007-06-06 20:27:28,000 INFO  mapred.FileInputFormat (FileInputFormat.java:validateInput(142))
- Total input paths to process : 1
    [junit] 2007-06-06 20:27:28,073 INFO  mapred.JobClient (JobClient.java:runJob(552)) -
Running job: job_ea2qpw
    [junit] 2007-06-06 20:27:28,102 INFO  mapred.MapTask (MapTask.java:run(120)) - numReduceTasks:
1
    [junit] 2007-06-06 20:27:28,133 INFO  mapred.LocalJobRunner (LocalJobRunner.java:progress(200))
- http://lucene.zones.apache.org:8080/hudson/job/Hadoop-Nightly/ws/trunk/mapred.loadtest/genouts/part-00000
:0+1113
    [junit] 2007-06-06 20:27:28,175 INFO  mapred.LocalJobRunner (LocalJobRunner.java:progress(200))
- reduce > reduce
    [junit] 2007-06-06 20:27:28,180 INFO  mapred.TaskRunner (Task.java:saveTaskOutput(331))
- Saved output of task 'reduce_s14f9' to http://lucene.zones.apache.org:8080/hudson/job/Hadoop-Nightly/ws/trunk/mapred.loadtest/intermediateouts

    [junit] 2007-06-06 20:27:29,079 INFO  mapred.JobClient (JobClient.java:runJob(613)) -
Job complete: job_ea2qpw
    [junit] 2007-06-06 20:27:29,080 INFO  mapred.JobClient (Counters.java:log(359)) - Counters:
7
    [junit] 2007-06-06 20:27:29,080 INFO  mapred.JobClient (Counters.java:log(363)) -   Map-Reduce
Framework
    [junit] 2007-06-06 20:27:29,081 INFO  mapred.JobClient (Counters.java:log(365)) -    
Map input records=102
    [junit] 2007-06-06 20:27:29,081 INFO  mapred.JobClient (Counters.java:log(365)) -    
Map output records=102
    [junit] 2007-06-06 20:27:29,082 INFO  mapred.JobClient (Counters.java:log(365)) -    
Map input bytes=1020
    [junit] 2007-06-06 20:27:29,082 INFO  mapred.JobClient (Counters.java:log(365)) -    
Map output bytes=306
    [junit] 2007-06-06 20:27:29,083 INFO  mapred.JobClient (Counters.java:log(365)) -    
Reduce input groups=10
    [junit] 2007-06-06 20:27:29,083 INFO  mapred.JobClient (Counters.java:log(365)) -    
Reduce input records=102
    [junit] 2007-06-06 20:27:29,083 INFO  mapred.JobClient (Counters.java:log(365)) -    
Reduce output records=10
    [junit] 2007-06-06 20:27:29,106 INFO  mapred.FileInputFormat (FileInputFormat.java:validateInput(142))
- Total input paths to process : 1
    [junit] 2007-06-06 20:27:29,180 INFO  mapred.JobClient (JobClient.java:runJob(552)) -
Running job: job_5u782q
    [junit] 2007-06-06 20:27:29,221 INFO  mapred.MapTask (MapTask.java:run(120)) - numReduceTasks:
1
    [junit] 2007-06-06 20:27:29,242 INFO  mapred.LocalJobRunner (LocalJobRunner.java:progress(200))
- http://lucene.zones.apache.org:8080/hudson/job/Hadoop-Nightly/ws/trunk/mapred.loadtest/intermediateouts/part-00000
:0+210
    [junit] 2007-06-06 20:27:29,272 INFO  mapred.LocalJobRunner (LocalJobRunner.java:progress(200))
- reduce > reduce
    [junit] 2007-06-06 20:27:29,276 INFO  mapred.TaskRunner (Task.java:saveTaskOutput(331))
- Saved output of task 'reduce_n10kbg' to http://lucene.zones.apache.org:8080/hudson/job/Hadoop-Nightly/ws/trunk/mapred.loadtest/finalouts

    [junit] 2007-06-06 20:27:30,189 INFO  mapred.JobClient (JobClient.java:runJob(613)) -
Job complete: job_5u782q
    [junit] 2007-06-06 20:27:30,190 INFO  mapred.JobClient (Counters.java:log(359)) - Counters:
7
    [junit] 2007-06-06 20:27:30,190 INFO  mapred.JobClient (Counters.java:log(363)) -   Map-Reduce
Framework
    [junit] 2007-06-06 20:27:30,191 INFO  mapred.JobClient (Counters.java:log(365)) -    
Map input records=10
    [junit] 2007-06-06 20:27:30,191 INFO  mapred.JobClient (Counters.java:log(365)) -    
Map output records=10
    [junit] 2007-06-06 20:27:30,191 INFO  mapred.JobClient (Counters.java:log(365)) -    
Map input bytes=117
    [junit] 2007-06-06 20:27:30,192 INFO  mapred.JobClient (Counters.java:log(365)) -    
Map output bytes=20
    [junit] 2007-06-06 20:27:30,192 INFO  mapred.JobClient (Counters.java:log(365)) -    
Reduce input groups=10
    [junit] 2007-06-06 20:27:30,193 INFO  mapred.JobClient (Counters.java:log(365)) -    
Reduce input records=10
    [junit] 2007-06-06 20:27:30,193 INFO  mapred.JobClient (Counters.java:log(365)) -    
Reduce output records=10
    [junit] Original sum: 102
    [junit] Recomputed sum: 102
    [junit] Success=true
    [junit] Tests run: 1, Failures: 0, Errors: 0, Time elapsed: 4.159 sec
    [junit] Running org.apache.hadoop.record.TestRecordWritable
    [junit] Tests run: 1, Failures: 0, Errors: 0, Time elapsed: 1.85 sec
    [junit] Running org.apache.hadoop.util.TestReflectionUtils
    [junit] Tests run: 4, Failures: 0, Errors: 0, Time elapsed: 0.582 sec

BUILD FAILED
http://lucene.zones.apache.org:8080/hudson/job/Hadoop-Nightly/ws/trunk/build.xml :483: Tests
failed!

Total time: 73 minutes 38 seconds
Recording fingerprints
Publishing Javadoc
Recording test results


Mime
View raw message